java-prs archive
subject index for April - June, 2007

This is the mail archive of the java-prs@gcc.gnu.org mailing list for the Java project.

Indexes: [Date Index] [Subject Index] [Author Index] [Thread Index]
Site Nav: [Browse other archives for this mailing list]
[Browse other mailing lists at this site]
Search: Limit to:

[Bug java/10632] Numerical result differs from Sun JDK -- strictfp not supported

[Bug java/15474] libgcj jar file should always be in classpath at runtime

[Bug java/18131] [meta-bug] inner class problems in java front-end

[Bug java/24454] GCJ does not correctly support strictfp

[Bug java/27442] gcj segfaults on invalid code (related to 8923?)

[Bug java/30591] Cross build fails because native gcj needed to build ecjx

[Bug java/31365] private methods given vtable slots

[Bug java/31570] New: ports/gcc43 fails on FreeBSD 6.2 with signal 9

[Bug java/31570] ports/gcc43 fails on FreeBSD 6.2 with signal 9

[Bug java/31622] New: Segment violation in the “toString” method on a mathematical expression

[Bug java/31622] Segment violation in the “toString” method on a mathematical expression

[Bug java/31647] New: Embedded class dependencies cannot be loaded dynamically from a staic binary

[Bug java/31719] New: gcj crashes compiling simple .class file output by Rhino js->.class compiler

[Bug java/31719] gcj crashes compiling simple .class file output by Rhino js->.class compiler

[Bug java/31842] New: r124338 causes java Divide_1 and pr6388 to fail

[Bug java/31842] [4.2/4.3 Regression] r124338 causes java Divide_1 and pr6388 to fail

[Bug java/31853] New: ICE in bootstrap compiling gnu.CORBA.ObjectCreator

[Bug java/31853] ICE in bootstrap compiling gnu.CORBA.ObjectCreator

[Bug java/31875] New: "Error loading applet" when playing runescape

[Bug java/31890] New: Java Namespace error - javaprims.h out of sync

[Bug java/31890] Java Namespace error - javaprims.h out of sync

[Bug java/31900] New: Java line number debug info is bogus

[Bug java/31932] New: no values accepted for --encoding options except UTF-8

[Bug java/31932] no values accepted for --encoding options except UTF-8

[Bug java/32010] New: bootstrap fails; chooses wrong zlib for building jc1

[Bug java/32010] bootstrap fails; chooses wrong zlib for building jc1

[Bug java/32045] New: unknown option -e for test command in gen-classlist.sh

[Bug java/32045] unknown option -e for test command in gen-classlist.sh

[Bug java/32091] New: Can't build gcj in mingw32 in window XP (gcc-4.2.0)

[Bug java/32091] Can't build gcj in mingw32 in window XP (gcc-4.2.0)

[Bug java/32098] New: New libtool doesn't support with Java

[Bug java/32098] New libtool doesn't support Java

[Bug java/32098] New libtool doesn't support libjava

[Bug java/32247] New: -Wall enables -Wunused enables -Wunused-parameter

[Bug java/32247] -Wall enables -Wunused enables -Wunused-parameter

[Bug java/32249] New: %s substituted with "interface"/"class" can't be properly translated

[Bug java/32249] %s substituted with "interface"/"class" can't be properly translated

[Bug java/32250] New: %s substituted with "interface"/"array" can't be properly translated

[Bug java/32250] %s substituted with "interface"/"array" can't be properly translated

[Bug java/32484] New: build of junit 4.3.1 native lib fails

[Bug java/32484] build of junit 4.3.1 native lib fails

[Bug libgcj/16662] IllegalMonitorStateException in EventQueue.getNextEvent(): possible hash synchronization bug?

[Bug libgcj/17002] java.util.TimeZone.getDefault() is broken

[Bug libgcj/23758] java::lang::ConcreteProcess::nativeSpawn unsafe

[Bug libgcj/24403] --enable-java-awt=qt fails to build

[Bug libgcj/29324] add wait handling hook

[Bug libgcj/29604] Race condition in ServerSocket.accept()

[Bug libgcj/30071] make install fails for libjava

[Bug libgcj/30424] [4.3 regression] revision 120632 failed to build on ia64

[Bug libgcj/30448] libjava configure script mix up with .c / .java using gcj /gcc

[Bug libgcj/30570] Word "DEBUG" used as a variable in VMAccessController.java breaks build

[Bug libgcj/30999] support for GCC4.0's fvisibility option in JNIEXPORT macro

[Bug libgcj/31084] TRUE or FALSE defined

[Bug libgcj/31093] Multicast PromiscuousTraffic

[Bug libgcj/31223] [regression] indirect dispatch not working with static builds

[Bug libgcj/31450] New: natFileChannelPosix.cc should use mincore

[Bug libgcj/31450] natFileChannelPosix.cc should use mincore

[Bug libgcj/31650] New: gcc-4_2-branch uses class that has been removed - breaks make

[Bug libgcj/31650] gcc-4_2-branch uses class that has been removed - breaks make

[Bug libgcj/31659] New: config-int.h:327:1: error: "INT8_MIN" redefined

[Bug libgcj/31659] config-int.h:327:1: error: "INT8_MIN" redefined

[Bug libgcj/31662] New: Can't boostrap current gcc trunk with libjava

[Bug libgcj/31662] Can't boostrap current gcc trunk with libjava

[Bug libgcj/31700] New: [JNI] -X options not recognised by JNI_CreateJavaVM

[Bug libgcj/31700] [JNI] -X options not recognised by JNI_CreateJavaVM

[Bug libgcj/31728] New: --enable-java-maintainer-mode should pass JNI header options to classpath configure

[Bug libgcj/31728] --enable-java-maintainer-mode should pass JNI header options to classpath configure

[Bug libgcj/31890] Java Namespace error - javaprims.h out of sync

[Bug libgcj/31891] New: Libjava configuration scripts out of sync for pkg-config tests

[Bug libgcj/31891] Libjava configuration scripts out of sync for pkg-config tests

[Bug libgcj/31910] New: Trouble with libtool and libjava/classpath/native/jni/gtk-peer/Makefile

[Bug libgcj/31910] Trouble with libtool and libjava/classpath/native/jni/gtk-peer/Makefile

[Bug libgcj/31931] New: Mauve test "wonka" causes "java.lang.IllegalMonitorStateException: current thread not owner" error

[Bug libgcj/31939] New: Command line arguments are byteswapped before being passed to the program runing in custom locale.

[Bug libgcj/31939] Command line arguments are byteswapped before being passed to the program runing in custom locale.

[Bug libgcj/32005] New: libjava fails to install

[Bug libgcj/32028] New: Make fails at gjdoc - gnu.classpath.tools.gjdoc.ParseException: unmatched input in line 1: @Retention(SOURCE) @Target(METHOD)

[Bug libgcj/32028] Make fails at gjdoc - gnu.classpath.tools.gjdoc.ParseException: unmatched input in line 1: @Retention(SOURCE) @Target(METHOD)

[Bug libgcj/32034] New: Use of deprecated classes in "gcc-4_2-build/i686-pc-linux-gnu/libjava/classpath/tools"

[Bug libgcj/32034] Use of deprecated classes in "gcc-4_2-build/i686-pc-linux-gnu/libjava/classpath/tools"

[Bug libgcj/32198] New: rmic fails if remote method throws superclass of RemoteException

[Bug libgcj/32227] New: ../gcc/libjava/classpath/include/config-int.h:7:20: error: stdint.h: No such file or directory

[Bug libgcj/32227] ../gcc/libjava/classpath/include/config-int.h:7:20: error: stdint.h: No such file or directory

[Bug libgcj/32227] [4.3 Regression] ../gcc/libjava/classpath/include/config-int.h:7:20: error: stdint.h: No such file or directory

[Bug libstdc++/31932] no values accepted for --encoding options except UTF-8

[Bug preprocessor/31932] cpp -f*-charset and gcj --encoding accept no values except UTF-8

[Bug preprocessor/31932] no values accepted for --encoding options except UTF-8

[Bug rtl-optimization/17700] -Os causes bad build of libgcj.so.5.0.0 file

[Bug tree-optimization/31264] internal compiler error: in build_int_cst_wide, at tree.c:886


Indexes: [Date Index] [Subject Index] [Author Index] [Thread Index]
Site Nav: [Browse other archives for this mailing list]
[Browse other mailing lists at this site]
Search: Limit to:

Mail converted by MHonArc 2.6.3