java-prs archive
date index for April - June, 2007

This is the mail archive of the java-prs@gcc.gnu.org mailing list for the Java project.

Indexes: [Date Index] [Subject Index] [Author Index] [Thread Index]
Site Nav: [Browse other archives for this mailing list]
[Browse other mailing lists at this site]
Search: Limit to:


2007-06-28 [Bug libgcj/30999] support for GCC4.0's fvisibility option in JNIEXPORT macro tromey at gcc dot gnu dot org
2007-06-28 [Bug libgcj/30999] support for GCC4.0's fvisibility option in JNIEXPORT macro tromey at gcc dot gnu dot org
2007-06-25 [Bug libgcj/31650] gcc-4_2-branch uses class that has been removed - breaks make rob1weld at aol dot com
2007-06-24 [Bug java/32484] build of junit 4.3.1 native lib fails h dot mth at web dot de
2007-06-24 [Bug java/32484] New: build of junit 4.3.1 native lib fails h dot mth at web dot de
2007-06-22 [Bug libgcj/17002] java.util.TimeZone.getDefault() is broken jakub at gcc dot gnu dot org
2007-06-15 [Bug java/32247] -Wall enables -Wunused enables -Wunused-parameter manu at gcc dot gnu dot org
2007-06-14 [Bug libgcj/31093] Multicast PromiscuousTraffic geoffk at gcc dot gnu dot org
2007-06-11 [Bug java/32247] -Wall enables -Wunused enables -Wunused-parameter pinskia at gcc dot gnu dot org
2007-06-11 [Bug java/32247] -Wall enables -Wunused enables -Wunused-parameter tromey at gcc dot gnu dot org
2007-06-11 [Bug java/32247] -Wall enables -Wunused enables -Wunused-parameter pinskia at gcc dot gnu dot org
2007-06-11 [Bug java/32247] -Wall enables -Wunused enables -Wunused-parameter cagney at redhat dot com
2007-06-11 [Bug java/32247] -Wall enables -Wunused enables -Wunused-parameter pinskia at gcc dot gnu dot org
2007-06-11 [Bug java/32247] -Wall enables -Wunused enables -Wunused-parameter cagney at redhat dot com
2007-06-11 [Bug java/32247] -Wall enables -Wunused enables -Wunused-parameter pinskia at gcc dot gnu dot org
2007-06-11 [Bug java/32247] -Wall enables -Wunused enables -Wunused-parameter cagney at redhat dot com
2007-06-10 [Bug java/32247] -Wall enables -Wunused enables -Wunused-parameter pinskia at gcc dot gnu dot org
2007-06-08 [Bug java/32250] %s substituted with "interface"/"array" can't be properly translated goeran at uddeborg dot se
2007-06-08 [Bug java/32249] %s substituted with "interface"/"class" can't be properly translated tromey at gcc dot gnu dot org
2007-06-08 [Bug java/32250] %s substituted with "interface"/"array" can't be properly translated tromey at gcc dot gnu dot org
2007-06-08 [Bug libgcj/32227] [4.3 Regression] ../gcc/libjava/classpath/include/config-int.h:7:20: error: stdint.h: No such file or directory pinskia at gcc dot gnu dot org
2007-06-07 [Bug java/32250] New: %s substituted with "interface"/"array" can't be properly translated goeran at uddeborg dot se
2007-06-07 [Bug java/32249] New: %s substituted with "interface"/"class" can't be properly translated goeran at uddeborg dot se
2007-06-07 [Bug java/32247] New: -Wall enables -Wunused enables -Wunused-parameter cagney at redhat dot com
2007-06-07 [Bug libgcj/32227] [4.3 Regression] ../gcc/libjava/classpath/include/config-int.h:7:20: error: stdint.h: No such file or directory doko at gcc dot gnu dot org
2007-06-07 [Bug libgcj/32227] [4.3 Regression] ../gcc/libjava/classpath/include/config-int.h:7:20: error: stdint.h: No such file or directory dave at hiauly1 dot hia dot nrc dot ca
2007-06-07 [Bug libgcj/32227] [4.3 Regression] ../gcc/libjava/classpath/include/config-int.h:7:20: error: stdint.h: No such file or directory andreast at gcc dot gnu dot org
2007-06-06 [Bug libgcj/32227] [4.3 Regression] ../gcc/libjava/classpath/include/config-int.h:7:20: error: stdint.h: No such file or directory pinskia at gcc dot gnu dot org
2007-06-06 [Bug libgcj/32227] ../gcc/libjava/classpath/include/config-int.h:7:20: error: stdint.h: No such file or directory doko at ubuntu dot com
2007-06-05 [Bug libgcj/32227] New: ../gcc/libjava/classpath/include/config-int.h:7:20: error: stdint.h: No such file or directory danglin at gcc dot gnu dot org
2007-06-03 [Bug libgcj/32198] New: rmic fails if remote method throws superclass of RemoteException marcus at better dot se
2007-05-31 [Bug java/32098] New libtool doesn't support libjava bonzini at gcc dot gnu dot org
2007-05-30 [Bug libgcj/31659] config-int.h:327:1: error: "INT8_MIN" redefined andreast at gcc dot gnu dot org
2007-05-30 [Bug java/32098] New libtool doesn't support libjava hjl at lucon dot org
2007-05-30 [Bug java/32098] New libtool doesn't support libjava hjl at gcc dot gnu dot org
2007-05-30 [Bug java/32098] New libtool doesn't support libjava hjl at gcc dot gnu dot org
2007-05-30 [Bug java/32098] New libtool doesn't support libjava hjl at gcc dot gnu dot org
2007-05-30 [Bug java/10632] Numerical result differs from Sun JDK -- strictfp not supported aph at gcc dot gnu dot org
2007-05-30 [Bug java/24454] GCJ does not correctly support strictfp aph at gcc dot gnu dot org
2007-05-30 [Bug java/32098] New libtool doesn't support libjava rob1weld at aol dot com
2007-05-29 [Bug java/32098] New libtool doesn't support libjava tromey at gcc dot gnu dot org
2007-05-27 [Bug java/32098] New libtool doesn't support libjava hjl at lucon dot org
2007-05-26 [Bug java/18131] [meta-bug] inner class problems in java front-end pinskia at gcc dot gnu dot org
2007-05-26 [Bug libgcj/32034] Use of deprecated classes in "gcc-4_2-build/i686-pc-linux-gnu/libjava/classpath/tools" rob1weld at aol dot com
2007-05-26 [Bug java/32098] New libtool doesn't support libjava hjl at lucon dot org
2007-05-26 [Bug java/32098] New libtool doesn't support Java hjl at lucon dot org
2007-05-26 [Bug java/32098] New: New libtool doesn't support with Java hjl at lucon dot org
2007-05-26 [Bug java/32091] Can't build gcj in mingw32 in window XP (gcc-4.2.0) dragzhb at yahoo dot com dot cn
2007-05-26 [Bug java/32091] New: Can't build gcj in mingw32 in window XP (gcc-4.2.0) dragzhb at yahoo dot com dot cn
2007-05-25 [Bug java/31853] ICE in bootstrap compiling gnu.CORBA.ObjectCreator tromey at gcc dot gnu dot org
2007-05-25 [Bug libgcj/32028] Make fails at gjdoc - gnu.classpath.tools.gjdoc.ParseException: unmatched input in line 1: @Retention(SOURCE) @Target(METHOD) rob1weld at aol dot com
2007-05-25 [Bug libgcj/24403] --enable-java-awt=qt fails to build bero at arklinux dot org
2007-05-25 [Bug java/31853] ICE in bootstrap compiling gnu.CORBA.ObjectCreator deknuydt at esat dot kuleuven dot be
2007-05-25 [Bug libgcj/32028] Make fails at gjdoc - gnu.classpath.tools.gjdoc.ParseException: unmatched input in line 1: @Retention(SOURCE) @Target(METHOD) rob1weld at aol dot com
2007-05-24 [Bug libgcj/32028] Make fails at gjdoc - gnu.classpath.tools.gjdoc.ParseException: unmatched input in line 1: @Retention(SOURCE) @Target(METHOD) rob1weld at aol dot com
2007-05-24 [Bug java/31853] ICE in bootstrap compiling gnu.CORBA.ObjectCreator tromey at gcc dot gnu dot org
2007-05-24 [Bug libgcj/24403] --enable-java-awt=qt fails to build tromey at gcc dot gnu dot org
2007-05-24 [Bug java/31853] ICE in bootstrap compiling gnu.CORBA.ObjectCreator deknuydt at esat dot kuleuven dot be
2007-05-24 [Bug java/31853] ICE in bootstrap compiling gnu.CORBA.ObjectCreator tromey at gcc dot gnu dot org
2007-05-24 [Bug libgcj/32028] Make fails at gjdoc - gnu.classpath.tools.gjdoc.ParseException: unmatched input in line 1: @Retention(SOURCE) @Target(METHOD) tromey at gcc dot gnu dot org
2007-05-24 [Bug libgcj/32034] Use of deprecated classes in "gcc-4_2-build/i686-pc-linux-gnu/libjava/classpath/tools" tromey at gcc dot gnu dot org
2007-05-24 [Bug libgcj/24403] --enable-java-awt=qt fails to build bero at arklinux dot org
2007-05-24 [Bug java/32010] bootstrap fails; chooses wrong zlib for building jc1 lucier at math dot purdue dot edu
2007-05-23 [Bug java/32010] bootstrap fails; chooses wrong zlib for building jc1 lucier at math dot purdue dot edu
2007-05-22 [Bug java/32045] unknown option -e for test command in gen-classlist.sh pinskia at gcc dot gnu dot org
2007-05-22 [Bug java/32045] unknown option -e for test command in gen-classlist.sh André Schneider <Andre dot Schneider at eas dot iis dot fraunhofer dot de>
2007-05-22 [Bug java/32045] unknown option -e for test command in gen-classlist.sh pinskia at gcc dot gnu dot org
2007-05-22 [Bug java/32045] New: unknown option -e for test command in gen-classlist.sh Andre dot Schneider at eas dot iis dot fraunhofer dot de
2007-05-22 [Bug libgcj/32034] New: Use of deprecated classes in "gcc-4_2-build/i686-pc-linux-gnu/libjava/classpath/tools" rob1weld at aol dot com
2007-05-22 [Bug libgcj/32028] New: Make fails at gjdoc - gnu.classpath.tools.gjdoc.ParseException: unmatched input in line 1: @Retention(SOURCE) @Target(METHOD) rob1weld at aol dot com
2007-05-20 [Bug java/32010] New: bootstrap fails; chooses wrong zlib for building jc1 lucier at math dot purdue dot edu
2007-05-20 [Bug libgcj/32005] New: libjava fails to install danglin at gcc dot gnu dot org
2007-05-19 [Bug libgcj/31659] config-int.h:327:1: error: "INT8_MIN" redefined cvs-commit at developer dot classpath dot org
2007-05-19 [Bug libgcj/31659] config-int.h:327:1: error: "INT8_MIN" redefined andreast at gcc dot gnu dot org
2007-05-19 [Bug libgcj/29604] Race condition in ServerSocket.accept() daney at gcc dot gnu dot org
2007-05-19 [Bug libgcj/29604] Race condition in ServerSocket.accept() daney at gcc dot gnu dot org
2007-05-18 [Bug libgcj/31939] Command line arguments are byteswapped before being passed to the program runing in custom locale. serg at vostok dot net
2007-05-18 [Bug libgcj/31891] Libjava configuration scripts out of sync for pkg-config tests rob1weld at aol dot com
2007-05-17 [Bug libgcj/31659] config-int.h:327:1: error: "INT8_MIN" redefined andreast at gcc dot gnu dot org
2007-05-17 [Bug rtl-optimization/17700] -Os causes bad build of libgcj.so.5.0.0 file ebotcazou at gcc dot gnu dot org
2007-05-16 [Bug java/30591] Cross build fails because native gcj needed to build ecjx daney at gcc dot gnu dot org
2007-05-15 [Bug preprocessor/31932] cpp -f*-charset and gcj --encoding accept no values except UTF-8 serg at vostok dot net
2007-05-15 [Bug preprocessor/31932] no values accepted for --encoding options except UTF-8 serg at vostok dot net
2007-05-15 [Bug preprocessor/31932] no values accepted for --encoding options except UTF-8 pinskia at gcc dot gnu dot org
2007-05-15 [Bug java/31932] no values accepted for --encoding options except UTF-8 tromey at gcc dot gnu dot org
2007-05-15 [Bug java/31932] no values accepted for --encoding options except UTF-8 pcarlini at suse dot de
2007-05-15 [Bug libgcj/31939] Command line arguments are byteswapped before being passed to the program runing in custom locale. serg at vostok dot net
2007-05-15 [Bug libgcj/31939] Command line arguments are byteswapped before being passed to the program runing in custom locale. serg at vostok dot net
2007-05-15 [Bug libgcj/31939] Command line arguments are byteswapped before being passed to the program runing in custom locale. serg at vostok dot net
2007-05-15 [Bug libgcj/31939] New: Command line arguments are byteswapped before being passed to the program runing in custom locale. serg at vostok dot net
2007-05-15 [Bug libstdc++/31932] no values accepted for --encoding options except UTF-8 serg at vostok dot net
2007-05-15 [Bug java/31932] no values accepted for --encoding options except UTF-8 pinskia at gcc dot gnu dot org
2007-05-15 [Bug java/31932] no values accepted for --encoding options except UTF-8 serg at vostok dot net
2007-05-15 [Bug java/31932] New: no values accepted for --encoding options except UTF-8 serg at vostok dot net
2007-05-15 [Bug libgcj/31931] New: Mauve test "wonka" causes "java.lang.IllegalMonitorStateException: current thread not owner" error rob1weld at aol dot com
2007-05-15 [Bug libgcj/16662] IllegalMonitorStateException in EventQueue.getNextEvent(): possible hash synchronization bug? rob1weld at aol dot com
2007-05-15 [Bug libgcj/31910] Trouble with libtool and libjava/classpath/native/jni/gtk-peer/Makefile rob1weld at aol dot com
2007-05-15 [Bug libgcj/31890] Java Namespace error - javaprims.h out of sync rob1weld at aol dot com
2007-05-14 [Bug java/31890] Java Namespace error - javaprims.h out of sync tromey at gcc dot gnu dot org
2007-05-14 [Bug libgcj/31700] [JNI] -X options not recognised by JNI_CreateJavaVM marcus at better dot se
2007-05-13 [Bug libgcj/31910] New: Trouble with libtool and libjava/classpath/native/jni/gtk-peer/Makefile rob1weld at aol dot com
2007-05-12 [Bug libgcj/29324] add wait handling hook daney at gcc dot gnu dot org
2007-05-12 [Bug libgcj/29324] add wait handling hook daney at gcc dot gnu dot org
2007-05-11 [Bug java/31900] New: Java line number debug info is bogus drow at gcc dot gnu dot org
2007-05-10 [Bug libgcj/31891] New: Libjava configuration scripts out of sync for pkg-config tests rob1weld at aol dot com
2007-05-10 [Bug java/31890] New: Java Namespace error - javaprims.h out of sync rob1weld at aol dot com
2007-05-09 [Bug java/31875] New: "Error loading applet" when playing runescape donmerlcp at yahoo dot com
2007-05-08 [Bug java/31842] [4.2/4.3 Regression] r124338 causes java Divide_1 and pr6388 to fail ian at airs dot com
2007-05-08 [Bug java/31842] [4.2/4.3 Regression] r124338 causes java Divide_1 and pr6388 to fail ian at gcc dot gnu dot org
2007-05-08 [Bug java/31842] [4.2/4.3 Regression] r124338 causes java Divide_1 and pr6388 to fail ian at gcc dot gnu dot org
2007-05-07 [Bug java/31842] [4.2/4.3 Regression] r124338 causes java Divide_1 and pr6388 to fail daney at gcc dot gnu dot org
2007-05-07 [Bug java/31842] [4.2/4.3 Regression] r124338 causes java Divide_1 and pr6388 to fail aph at gcc dot gnu dot org
2007-05-07 [Bug java/31842] [4.2/4.3 Regression] r124338 causes java Divide_1 and pr6388 to fail ian at airs dot com
2007-05-07 [Bug java/31853] New: ICE in bootstrap compiling gnu.CORBA.ObjectCreator deknuydt at esat dot kuleuven dot be
2007-05-07 [Bug java/31842] [4.2/4.3 Regression] r124338 causes java Divide_1 and pr6388 to fail daney at gcc dot gnu dot org
2007-05-06 [Bug java/31842] [4.2/4.3 Regression] r124338 causes java Divide_1 and pr6388 to fail pinskia at gcc dot gnu dot org
2007-05-06 [Bug java/31842] New: r124338 causes java Divide_1 and pr6388 to fail daney at gcc dot gnu dot org
2007-05-04 [Bug libgcj/31659] config-int.h:327:1: error: "INT8_MIN" redefined dave at hiauly1 dot hia dot nrc dot ca
2007-05-04 [Bug libgcj/31659] config-int.h:327:1: error: "INT8_MIN" redefined andreast at gcc dot gnu dot org
2007-05-04 [Bug libgcj/31659] config-int.h:327:1: error: "INT8_MIN" redefined ebotcazou at gcc dot gnu dot org
2007-05-03 [Bug libgcj/31650] gcc-4_2-branch uses class that has been removed - breaks make rob1weld at aol dot com
2007-05-01 [Bug libgcj/30570] Word "DEBUG" used as a variable in VMAccessController.java breaks build rob1weld at aol dot com
2007-04-29 [Bug libgcj/30448] libjava configure script mix up with .c / .java using gcj /gcc rob1weld at aol dot com
2007-04-29 [Bug libgcj/30448] libjava configure script mix up with .c / .java using gcj /gcc rob1weld at aol dot com
2007-04-29 [Bug libgcj/31650] gcc-4_2-branch uses class that has been removed - breaks make rob1weld at aol dot com
2007-04-28 [Bug libgcj/31223] [regression] indirect dispatch not working with static builds mtrudel at gmx dot ch
2007-04-28 [Bug tree-optimization/31264] internal compiler error: in build_int_cst_wide, at tree.c:886 kargl at gcc dot gnu dot org
2007-04-28 [Bug libgcj/31223] [regression] indirect dispatch not working with static builds pinskia at gcc dot gnu dot org
2007-04-28 [Bug java/31365] private methods given vtable slots pinskia at gcc dot gnu dot org
2007-04-27 [Bug libgcj/31728] --enable-java-maintainer-mode should pass JNI header options to classpath configure fitzsim at redhat dot com
2007-04-27 [Bug java/31719] gcj crashes compiling simple .class file output by Rhino js->.class compiler tromey at gcc dot gnu dot org
2007-04-27 [Bug libgcj/31728] New: --enable-java-maintainer-mode should pass JNI header options to classpath configure fitzsim at redhat dot com
2007-04-26 [Bug java/31719] gcj crashes compiling simple .class file output by Rhino js->.class compiler tromey at gcc dot gnu dot org
2007-04-26 [Bug java/31719] gcj crashes compiling simple .class file output by Rhino js->.class compiler btrost at motorola dot com
2007-04-26 [Bug libgcj/31700] [JNI] -X options not recognised by JNI_CreateJavaVM tromey at gcc dot gnu dot org
2007-04-26 [Bug java/31719] gcj crashes compiling simple .class file output by Rhino js->.class compiler tromey at gcc dot gnu dot org
2007-04-26 [Bug java/31719] New: gcj crashes compiling simple .class file output by Rhino js->.class compiler billt at tutsys dot com
2007-04-25 [Bug libgcj/31700] [JNI] -X options not recognised by JNI_CreateJavaVM tromey at gcc dot gnu dot org
2007-04-25 [Bug libgcj/31700] New: [JNI] -X options not recognised by JNI_CreateJavaVM marcus at better dot se
2007-04-25 [Bug java/31622] Segment violation in the &#8220;toString&#8221; method on a mathematical expression eduardo dot iniesta at aquiline dot es
2007-04-25 [Bug java/30591] Cross build fails because native gcj needed to build ecjx mtrudel at gmx dot ch
2007-04-25 [Bug libgcj/31084] TRUE or FALSE defined danglin at gcc dot gnu dot org
2007-04-25 [Bug libgcj/31084] TRUE or FALSE defined danglin at gcc dot gnu dot org
2007-04-25 [Bug libgcj/31662] Can't boostrap current gcc trunk with libjava davek at gcc dot gnu dot org
2007-04-25 [Bug java/30591] Cross build fails because native gcj needed to build ecjx ddaney at avtrex dot com
2007-04-25 [Bug java/30591] Cross build fails because native gcj needed to build ecjx tromey at gcc dot gnu dot org
2007-04-24 [Bug libgcj/31659] config-int.h:327:1: error: "INT8_MIN" redefined dave at hiauly1 dot hia dot nrc dot ca
2007-04-24 [Bug libgcj/31662] Can't boostrap current gcc trunk with libjava tromey at gcc dot gnu dot org
2007-04-24 [Bug libgcj/31084] TRUE or FALSE defined tromey at gcc dot gnu dot org
2007-04-24 [Bug libgcj/31659] config-int.h:327:1: error: "INT8_MIN" redefined tromey at gcc dot gnu dot org
2007-04-24 [Bug libgcj/31650] gcc-4_2-branch uses class that has been removed - breaks make tromey at gcc dot gnu dot org
2007-04-23 [Bug java/31622] Segment violation in the &#8220;toString&#8221; method on a mathematical expression tromey at gcc dot gnu dot org
2007-04-23 [Bug java/31570] ports/gcc43 fails on FreeBSD 6.2 with signal 9 vaclav dot kocian at wo dot cz
2007-04-23 [Bug java/31622] Segment violation in the &#8220;toString&#8221; method on a mathematical expression eduardo dot iniesta at aquiline dot es
2007-04-23 [Bug libgcj/31662] New: Can't boostrap current gcc trunk with libjava davek at gcc dot gnu dot org
2007-04-22 [Bug libgcj/31084] TRUE or FALSE defined dave at hiauly1 dot hia dot nrc dot ca
2007-04-22 [Bug libgcj/31659] config-int.h:327:1: error: "INT8_MIN" redefined dave at hiauly1 dot hia dot nrc dot ca
2007-04-22 [Bug libgcj/31659] config-int.h:327:1: error: "INT8_MIN" redefined danglin at gcc dot gnu dot org
2007-04-22 [Bug libgcj/31659] New: config-int.h:327:1: error: "INT8_MIN" redefined danglin at gcc dot gnu dot org
2007-04-21 [Bug java/31570] ports/gcc43 fails on FreeBSD 6.2 with signal 9 pinskia at gcc dot gnu dot org
2007-04-21 [Bug libgcj/31650] New: gcc-4_2-branch uses class that has been removed - breaks make rob1weld at aol dot com
2007-04-21 [Bug java/31647] New: Embedded class dependencies cannot be loaded dynamically from a staic binary mohsens at gmail dot com
2007-04-20 [Bug java/31622] Segment violation in the &#8220;toString&#8221; method on a mathematical expression tromey at gcc dot gnu dot org
2007-04-19 [Bug java/31622] Segment violation in the &#8220;toString&#8221; method on a mathematical expression eduardo dot iniesta at aquiline dot es
2007-04-19 [Bug java/27442] gcj segfaults on invalid code (related to 8923?) pinskia at gcc dot gnu dot org
2007-04-19 [Bug java/31622] Segment violation in the &#8220;toString&#8221; method on a mathematical expression pinskia at gcc dot gnu dot org
2007-04-18 [Bug java/31622] Segment violation in the &#8220;toString&#8221; method on a mathematical expression tromey at gcc dot gnu dot org
2007-04-18 [Bug java/31622] New: Segment violation in the &#8220;toString&#8221; method on a mathematical expression eduardo dot iniesta at aquiline dot es
2007-04-17 [Bug libgcj/30071] make install fails for libjava r dot emrich at de dot tecosim dot com
2007-04-14 [Bug java/31570] New: ports/gcc43 fails on FreeBSD 6.2 with signal 9 vaclav dot kocian at wo dot cz
2007-04-13 [Bug java/15474] libgcj jar file should always be in classpath at runtime mark at gcc dot gnu dot org
2007-04-10 [Bug libgcj/30424] [4.3 regression] revision 120632 failed to build on ia64 oliver at linux-kernel dot at
2007-04-10 [Bug libgcj/30424] [4.3 regression] revision 120632 failed to build on ia64 aph at gcc dot gnu dot org
2007-04-10 [Bug libgcj/30424] [4.3 regression] revision 120632 failed to build on ia64 oliver at linux-kernel dot at
2007-04-10 [Bug libgcj/30424] [4.3 regression] revision 120632 failed to build on ia64 aph at gcc dot gnu dot org
2007-04-10 [Bug libgcj/30424] [4.3 regression] revision 120632 failed to build on ia64 oliver at linux-kernel dot at
2007-04-09 [Bug libgcj/23758] java::lang::ConcreteProcess::nativeSpawn unsafe daney at gcc dot gnu dot org
2007-04-09 [Bug libgcj/23758] java::lang::ConcreteProcess::nativeSpawn unsafe daney at gcc dot gnu dot org
2007-04-06 [Bug libgcj/23758] java::lang::ConcreteProcess::nativeSpawn unsafe daney at gcc dot gnu dot org
2007-04-03 [Bug libgcj/31450] natFileChannelPosix.cc should use mincore tromey at gcc dot gnu dot org
2007-04-03 [Bug libgcj/31450] New: natFileChannelPosix.cc should use mincore tromey at gcc dot gnu dot org
Indexes: [Date Index] [Subject Index] [Author Index] [Thread Index]
Site Nav: [Browse other archives for this mailing list]
[Browse other mailing lists at this site]
Search: Limit to:

Mail converted by MHonArc 2.6.3