java-prs archive
date index for April - June, 2006

This is the mail archive of the java-prs@gcc.gnu.org mailing list for the Java project.

Indexes: [Date Index] [Subject Index] [Author Index] [Thread Index]
Site Nav: [Browse other archives for this mailing list]
[Browse other mailing lists at this site]
Search: Limit to:


2006-06-30 [Bug java/22299] Even length strings (not odd) placed in .section .rodata.jutf8.# at -O1 or above. mckinlay at redhat dot com
2006-06-30 [Bug java/22299] Even length strings (not odd) placed in .section .rodata.jutf8.# at -O1 or above. mckinlay at redhat dot com
2006-06-29 [Bug libgcj/28175] libgcj install tree should be relocatable mckinlay at redhat dot com
2006-06-29 [Bug java/28149] Fail to test GCC on simulation due to libjava build errors. jserv at kaffe dot org
2006-06-27 [Bug libgcj/28178] jniEnv->DeleteLocalRef (null) fails tromey at gcc dot gnu dot org
2006-06-27 [Bug libgcj/28178] jniEnv->DeleteLocalRef (null) fails tromey at gcc dot gnu dot org
2006-06-27 [Bug libgcj/28178] jniEnv->DeleteLocalRef (null) fails tromey at gcc dot gnu dot org
2006-06-27 [Bug java/28149] Fail to test GCC on simulation due to libjava build errors. tromey at gcc dot gnu dot org
2006-06-27 [Bug libgcj/28178] jniEnv->DeleteLocalRef (null) fails tromey at gcc dot gnu dot org
2006-06-27 [Bug libgcj/28178] jniEnv->DeleteLocalRef (null) fails hakan dot hjort at gmail dot com
2006-06-27 [Bug libgcj/28178] New: jniEnv->DeleteLocalRef (null) fails hakan dot hjort at gmail dot com
2006-06-27 [Bug java/28153] Under Windows Xp the generated JNI headers need to have a '_' prepended for each function. tromey at gcc dot gnu dot org
2006-06-26 [Bug libgcj/28175] New: libgcj install tree should be relocatable fitzsim at redhat dot com
2006-06-26 [Bug java/28153] Under Windows Xp the generated JNI headers need to have a '_' prepended for each function. dannysmith at users dot sourceforge dot net
2006-06-26 [Bug java/28153] Under Windows Xp the generated JNI headers need to have a '_' prepended for each function. dannysmith at users dot sourceforge dot net
2006-06-26 [Bug java/28153] Under Windows Xp the generated JNI headers need to have a '_' prepended for each function. bcmpinc at hotmail dot com
2006-06-26 [Bug java/28153] Under Windows Xp the generated JNI headers need to have a '_' prepended for each function. tromey at gcc dot gnu dot org
2006-06-24 [Bug java/28153] New: Under Windows Xp the generated JNI headers need to have a '_' prepended for each function. bcmpinc at hotmail dot com
2006-06-24 [Bug java/28149] Fail to test GCC on simulation due to libjava build errors. jserv at kaffe dot org
2006-06-24 [Bug java/28149] New: Fail to test GCC on simulation due to libjava build errors. jserv at kaffe dot org
2006-06-21 [Bug libgcj/21524] Cancelling a TimerTask puts Timer binary heap in inconsistent state tromey at gcc dot gnu dot org
2006-06-21 [Bug java/28089] jc1 miscompilation with fields inherited from interfaces tromey at gcc dot gnu dot org
2006-06-21 [Bug java/28089] jc1 miscompilation with fields inherited from interfaces tromey at gcc dot gnu dot org
2006-06-20 [Bug classpath/20247] Lack java.util.concurrent.LinkedBlockingQueue tromey at gcc dot gnu dot org
2006-06-20 [Bug java/28090] incorrect implementation of expand_java_arraystore tromey at gcc dot gnu dot org
2006-06-20 [Bug java/28067] [meta-bug] Tracking bug for ecj fixes tromey at gcc dot gnu dot org
2006-06-20 [Bug java/28089] jc1 miscompilation with fields inherited from interfaces tromey at gcc dot gnu dot org
2006-06-20 [Bug java/28090] incorrect implementation of expand_java_arraystore tromey at gcc dot gnu dot org
2006-06-20 [Bug java/28090] incorrect implementation of expand_java_arraystore pinskia at gcc dot gnu dot org
2006-06-19 [Bug java/28090] New: incorrect implementation of expand_java_arraystore tromey at gcc dot gnu dot org
2006-06-19 [Bug java/28089] New: jc1 miscompilation with fields inherited from interfaces tromey at gcc dot gnu dot org
2006-06-19 [Bug java/1305] [JSR133] GCJ ignores volatile modifier aph at gcc dot gnu dot org
2006-06-19 [Bug java/27908] VMSecureRandom generateSeed infinite loop? (Regression) aph at gcc dot gnu dot org
2006-06-19 [Bug java/27025] ICE on simple initializer aph at gcc dot gnu dot org
2006-06-17 [Bug libgcj/26483] Wrong parsing of doubles when interpreted on ia64 tromey at gcc dot gnu dot org
2006-06-17 [Bug libgcj/25250] Turn off lib-foo-bar class loading mechanism by default tromey at gcc dot gnu dot org
2006-06-16 [Bug java/15411] CNI: gcjh not aware of "miranda" methods tromey at gcc dot gnu dot org
2006-06-16 [Bug java/28067] [meta-bug] Tracking bug for ecj fixes tromey at gcc dot gnu dot org
2006-06-16 [Bug java/28067] New: [meta-bug] Tracking bug for ecj fixes tromey at gcc dot gnu dot org
2006-06-16 [Bug java/1308] It would be nice if gcj -d worked for object files. tromey at gcc dot gnu dot org
2006-06-16 [Bug java/28024] libjava build failure on Solaris 2.8 (sun4u) ebotcazou at gcc dot gnu dot org
2006-06-16 [Bug java/28024] libjava build failure on Solaris 2.8 (sun4u) bob at digilink dot net
2006-06-15 [Bug java/28024] libjava build failure on Solaris 2.8 (sun4u) ebotcazou at gcc dot gnu dot org
2006-06-15 [Bug java/28024] libjava build failure on Solaris 2.8 (sun4u) ebotcazou at gcc dot gnu dot org
2006-06-14 [Bug libgcj/27823] Found a problem with the JNI methods declared and implemented tromey at gcc dot gnu dot org
2006-06-14 [Bug libgcj/27823] Found a problem with the JNI methods declared and implemented WILLIAMPAUL dot PHILIBERT at telus dot com
2006-06-14 [Bug java/28024] libjava build failure on Solaris 2.8 (sun4u) tromey at gcc dot gnu dot org
2006-06-14 [Bug java/28024] libjava build failure on Solaris 2.8 (sun4u) tromey at gcc dot gnu dot org
2006-06-14 [Bug java/28024] libjava build failure on Solaris 2.8 (sun4u) tromey at gcc dot gnu dot org
2006-06-14 [Bug java/28024] libjava build failure on Solaris 2.8 (sun4u) cvs-commit at developer dot classpath dot org
2006-06-14 [Bug java/28024] libjava build failure on Solaris 2.8 (sun4u) tromey at gcc dot gnu dot org
2006-06-14 [Bug java/28024] New: libjava build failure on Solaris 2.8 (sun4u) bob at digilink dot net
2006-06-13 [Bug java/1305] [JSR133] GCJ ignores volatile modifier aph at gcc dot gnu dot org
2006-06-13 [Bug java/1305] [JSR133] GCJ ignores volatile modifier aph at gcc dot gnu dot org
2006-06-13 [Bug java/27908] VMSecureRandom generateSeed infinite loop? (Regression) aph at gcc dot gnu dot org
2006-06-13 [Bug libgcj/28009] libjava cannot be cross-built; X_CFLAGS includes /usr/include tbm at cyrius dot com
2006-06-13 [Bug libgcj/28009] libjava cannot be cross-built; X_CFLAGS includes /usr/include tbm at cyrius dot com
2006-06-13 [Bug libgcj/28009] New: libjava cannot be cross-built; X_CFLAGS includes /usr/include tbm at cyrius dot com
2006-06-10 [Bug java/27985] gcj fails dependant on compiler order cagney at redhat dot com
2006-06-10 [Bug java/27985] New: gcj fails dependant on compiler order cagney at redhat dot com
2006-06-10 [Bug libgcj/13212] JNI/CNI AttachCurrentThread does not register thread with garbage collector arno at heho dot snv dot jussieu dot fr
2006-06-09 [Bug libgcj/27983] New: FAIL: md5test output - gij test danglin at gcc dot gnu dot org
2006-06-09 [Bug java/27982] New: Make gcj inline methods in java.nio.Buffer daney at gcc dot gnu dot org
2006-06-09 [Bug libgcj/27730] Thread.getId() needs implemented tromey at gcc dot gnu dot org
2006-06-09 [Bug libgcj/27730] Thread.getId() needs implemented tromey at gcc dot gnu dot org
2006-06-09 [Bug libgcj/27730] Thread.getId() needs implemented tromey at gcc dot gnu dot org
2006-06-07 [Bug libgcj/27938] gij should dlopen() libgcj mckinlay at redhat dot com
2006-06-07 [Bug libgcj/27939] New: eclipse deadlock on startup fitzsim at redhat dot com
2006-06-07 [Bug libgcj/27938] New: gij should dlopen() libgcj mckinlay at redhat dot com
2006-06-07 [Bug java/19870] gcj -C doesn't generate accessors for private members across nested class boundaries mckinlay at redhat dot com
2006-06-07 [Bug java/27925] Trampolines not generated for private inner class methods. mckinlay at redhat dot com
2006-06-07 [Bug java/27908] VMSecureRandom generateSeed infinite loop? (Regression) csm at gnu dot org
2006-06-07 [Bug java/27908] VMSecureRandom generateSeed infinite loop? (Regression) pinskia at gcc dot gnu dot org
2006-06-07 [Bug java/27908] VMSecureRandom generateSeed infinite loop? (Regression) r_ovidius at eml dot cc
2006-06-07 [Bug java/1305] [JSR133] GCJ ignores volatile modifier csm at gnu dot org
2006-06-07 [Bug java/27908] VMSecureRandom generateSeed infinite loop? (Regression) csm at gnu dot org
2006-06-07 [Bug java/27925] Trampolines not generated for private inner class methods. csm at gnu dot org
2006-06-07 [Bug java/27925] New: Trampolines not generated for private inner class methods. csm at gnu dot org
2006-06-07 [Bug java/27908] VMSecureRandom generateSeed infinite loop? (Regression) pinskia at gcc dot gnu dot org
2006-06-07 [Bug java/27908] VMSecureRandom generateSeed infinite loop? (Regression) csm at gnu dot org
2006-06-06 [Bug java/27908] VMSecureRandom generateSeed infinite loop? (Regression) csm at gnu dot org
2006-06-06 [Bug libgcj/27908] VMSecureRandom generateSeed infinite loop? (Regression) csm at gnu dot org
2006-06-06 [Bug libgcj/27908] VMSecureRandom generateSeed infinite loop? (Regression) csm at gnu dot org
2006-06-06 [Bug libgcj/27890] [4.2 regression] lib/logging.properties pollutes common namespace gerald at pfeifer dot com
2006-06-06 [Bug libgcj/27908] VMSecureRandom generateSeed infinite loop? (Regression) r_ovidius at eml dot cc
2006-06-06 [Bug libgcj/27908] VMSecureRandom generateSeed infinite loop? (Regression) csm at gnu dot org
2006-06-06 [Bug libgcj/27908] VMSecureRandom generateSeed infinite loop? (Regression) csm at gnu dot org
2006-06-06 [Bug libgcj/27921] New: libgcj should support old 1.1-style JNI invocation API tromey at gcc dot gnu dot org
2006-06-06 [Bug libgcj/27797] win32.cc: FormatMessage fails on win98 for network messages r_ovidius at eml dot cc
2006-06-06 [Bug libgcj/27890] [4.2 regression] lib/logging.properties pollutes common namespace fitzsim at redhat dot com
2006-06-06 [Bug libgcj/27910] building fails due essentially to bad /bin/ksh on darwin pinskia at gcc dot gnu dot org
2006-06-06 [Bug libgcj/27910] building fails due essentially to bad /bin/ksh on darwin Denis dot Excoffier at airbus dot com
2006-06-06 [Bug libgcj/27910] building fails due essentially to bad /bin/ksh on darwin pinskia at gcc dot gnu dot org
2006-06-06 [Bug java/27910] New: building fails due essentially to bad /bin/ksh on darwin Denis dot Excoffier at airbus dot com
2006-06-06 [Bug libgcj/27908] VMSecureRandom generateSeed infinite loop? (Regression) csm at gnu dot org
2006-06-06 [Bug libgcj/27908] VMSecureRandom generateSeed infinite loop? (Regression) pinskia at gcc dot gnu dot org
2006-06-06 [Bug libgcj/27908] New: VMSecureRandom generateSeed infinite loop? (Regression) r_ovidius at eml dot cc
2006-06-05 [Bug libgcj/27860] build failure on m68k: error: 'ffi_closure' does not name a type schwab at suse dot de
2006-06-05 [Bug libgcj/27860] build failure on m68k: error: 'ffi_closure' does not name a type schwab at gcc dot gnu dot org
2006-06-05 [Bug libgcj/27890] [4.2 regression] lib/logging.properties pollutes common namespace rguenth at gcc dot gnu dot org
2006-06-05 [Bug libgcj/27860] build failure on m68k: error: 'ffi_closure' does not name a type tbm at cyrius dot com
2006-06-05 [Bug libgcj/27892] gij.cc:104: error: 'setenv' was not declared in this scope tromey at gcc dot gnu dot org
2006-06-05 [Bug libgcj/27892] gij.cc:104: error: 'setenv' was not declared in this scope tromey at gcc dot gnu dot org
2006-06-05 [Bug libgcj/27890] [4.2 regression] lib/logging.properties pollutes common namespace tromey at gcc dot gnu dot org
2006-06-05 [Bug libgcj/27860] build failure on m68k: error: 'ffi_closure' does not name a type tbm at cyrius dot com
2006-06-05 [Bug libgcj/27892] gij.cc:104: error: 'setenv' was not declared in this scope tromey at gcc dot gnu dot org
2006-06-05 [Bug libgcj/27860] build failure on m68k: error: 'ffi_closure' does not name a type tromey at gcc dot gnu dot org
2006-06-05 [Bug libgcj/27892] gij.cc:104: error: 'setenv' was not declared in this scope r_ovidius at eml dot cc
2006-06-05 [Bug libgcj/27860] build failure on m68k: error: 'ffi_closure' does not name a type schwab at suse dot de
2006-06-05 [Bug libgcj/27860] build failure on m68k: error: 'ffi_closure' does not name a type tbm at cyrius dot com
2006-06-05 [Bug libgcj/27892] gij.cc:104: error: 'setenv' was not declared in this scope dave at hiauly1 dot hia dot nrc dot ca
2006-06-05 [Bug libgcj/27860] build failure on m68k: error: 'ffi_closure' does not name a type schwab at suse dot de
2006-06-05 [Bug libgcj/27797] win32.cc: FormatMessage fails on win98 for network messages r_ovidius at eml dot cc
2006-06-05 [Bug libgcj/27797] win32.cc: FormatMessage fails on win98 for network messages tromey at gcc dot gnu dot org
2006-06-05 [Bug libgcj/27823] Found a problem with the JNI methods declared and implemented tromey at gcc dot gnu dot org
2006-06-05 [Bug libgcj/27892] gij.cc:104: error: 'setenv' was not declared in this scope tromey at gcc dot gnu dot org
2006-06-05 [Bug libgcj/27860] build failure on m68k: error: 'ffi_closure' does not name a type tromey at gcc dot gnu dot org
2006-06-04 [Bug middle-end/26556] [4.2 Regression] javax/imageio/stream/ImageOutputStreamImpl.java:0: ICE: Segmentation fault danglin at gcc dot gnu dot org
2006-06-04 [Bug java/21900] [4.1/4.2 Regression] debugging regression when debugging libgcj pinskia at gcc dot gnu dot org
2006-06-04 [Bug libgcj/27890] [4.2 regression] lib/logging.properties pollutes common namespace mmitchel at gcc dot gnu dot org
2006-06-04 [Bug java/21900] [4.1/4.2 Regression] debugging regression when debugging libgcj jsm28 at gcc dot gnu dot org
2006-06-04 [Bug java/24698] [4.1/4.2 regression] SIGABRT when using ResourceBundle.getBundle with a nonexistant key mmitchel at gcc dot gnu dot org
2006-06-04 [Bug java/24698] [4.1/4.2 regression] SIGABRT when using ResourceBundle.getBundle with a nonexistant key jsm28 at gcc dot gnu dot org
2006-06-04 [Bug libgcj/27890] [4.2 regression] lib/logging.properties pollutes common namespace jsm28 at gcc dot gnu dot org
2006-06-04 [Bug middle-end/27590] [4.1/4.2 Regression] ICE when compiling catalina.jar from tomcat 5.0.30 mmitchel at gcc dot gnu dot org
2006-06-04 [Bug libgcj/27860] build failure on m68k: error: 'ffi_closure' does not name a type schwab at suse dot de
2006-06-04 [Bug middle-end/26556] [4.2 Regression] javax/imageio/stream/ImageOutputStreamImpl.java:0: ICE: Segmentation fault mmitchel at gcc dot gnu dot org
2006-06-04 [Bug middle-end/26556] [4.2 Regression] javax/imageio/stream/ImageOutputStreamImpl.java:0: ICE: Segmentation fault mmitchel at gcc dot gnu dot org
2006-06-04 [Bug middle-end/26556] [4.2 Regression] javax/imageio/stream/ImageOutputStreamImpl.java:0: ICE: Segmentation fault mmitchel at gcc dot gnu dot org
2006-06-04 [Bug libgcj/27892] New: gij.cc:104: error: 'setenv' was not declared in this scope danglin at gcc dot gnu dot org
2006-06-04 [Bug libgcj/27890] [4.2 regression] lib/logging.properties pollutes common namespace rguenth at gcc dot gnu dot org
2006-06-04 [Bug libgcj/27890] [4.2 regression] lib/logging.properties pollutes common namespace gerald at pfeifer dot com
2006-06-04 [Bug libgcj/27890] New: [4.2 regression] lib/logging.properties pollutes common namespace gerald at pfeifer dot com
2006-06-02 [Bug libgcj/27271] i/o error (java.util.zip.ZipException: Deflated stream ends early.) green at redhat dot com
2006-06-02 [Bug libgcj/27860] build failure on m68k: error: 'ffi_closure' does not name a type pinskia at gcc dot gnu dot org
2006-06-02 [Bug libgcj/27860] [4.2 Regression] build failure on m68k: error: 'ffi_closure' does not name a type pinskia at gcc dot gnu dot org
2006-06-01 [Bug libgcj/26483] Wrong parsing of doubles when interpreted on ia64 wilson at gcc dot gnu dot org
2006-06-01 [Bug libgcj/20047] runtime 'protected' access checks mckinlay at redhat dot com
2006-05-30 [Bug java/27823] New: Found a problem with the JNI methods declared and implemented william-paul dot philibert at telus dot com
2006-05-29 [Bug middle-end/27590] [4.1/4.2 Regression] ICE when compiling catalina.jar from tomcat 5.0.30 pinskia at gcc dot gnu dot org
2006-05-29 [Bug java/27812] New: Classpath AWT Demo: anonymous class call miscompilation mckinlay at redhat dot com
2006-05-29 [Bug java/27442] gcj segfaults on invalid code (related to 8923?) pinskia at gcc dot gnu dot org
2006-05-29 [Bug java/27400] switch indexed by class crashes compiler pinskia at gcc dot gnu dot org
2006-05-29 [Bug java/27399] GCJ permits indexing by final object pinskia at gcc dot gnu dot org
2006-05-29 [Bug libgcj/27797] win32.cc: FormatMessage fails on win98 for network messages pinskia at gcc dot gnu dot org
2006-05-29 [Bug libgcj/27797] New: win32.cc: FormatMessage fails on win98 for network messages r_ovidius at eml dot cc
2006-05-27 [Bug libgcj/24403] --enable-java-awt=qt fails to build borisdusek at cmail dot cz
2006-05-27 [Bug libgcj/26593] libgcjawt should be built even if the gtk peers aren't bero at arklinux dot org
2006-05-27 [Bug libgcj/26593] libgcjawt should be built even if the gtk peers aren't bero at arklinux dot org
2006-05-27 [Bug libgcj/27778] New: libgcj configure fails if pango is not installed even with --enable-java-awt=no ansla80 at yahoo dot com
2006-05-26 [Bug libgcj/26483] Wrong parsing of doubles when interpreted on ia64 konqueror at gmx dot de
2006-05-26 [Bug java/27756] ICE in update_aliases, at java/decl.c:192 aph at gcc dot gnu dot org
2006-05-26 [Bug java/27756] ICE in update_aliases, at java/decl.c:192 aph at gcc dot gnu dot org
2006-05-26 [Bug java/27756] ICE in update_aliases, at java/decl.c:192 aph at gcc dot gnu dot org
2006-05-26 [Bug java/27756] ICE in update_aliases, at java/decl.c:192 aph at gcc dot gnu dot org
2006-05-25 [Bug java/27756] ICE in update_aliases, at java/decl.c:192 tromey at gcc dot gnu dot org
2006-05-25 [Bug java/27756] ICE in update_aliases, at java/decl.c:192 aph at gcc dot gnu dot org
2006-05-25 [Bug java/27756] ICE in update_aliases, at java/decl.c:192 aph at gcc dot gnu dot org
2006-05-25 [Bug libgcj/25265] linking BC-compiled classes with incompatible changes aph at gcc dot gnu dot org
2006-05-25 [Bug java/27764] gcj-4.1: error trying to exec 'cc1': execvp: No such file or directory konqueror at gmx dot de
2006-05-25 [Bug java/27764] gcj-4.1: error trying to exec 'cc1': execvp: No such file or directory charleshixsn at earthlink dot net
2006-05-25 [Bug java/27764] gcj-4.1: error trying to exec 'cc1': execvp: No such file or directory charleshixsn at earthlink dot net
2006-05-25 [Bug java/24186] [4.0/4.1/4.2 Regression] interface and extends does not cause us to reject invalid code mmitchel at gcc dot gnu dot org
2006-05-25 [Bug java/23754] [4.0/4.1/4.2 Regression]: tree check error in check_inner_circular_reference mmitchel at gcc dot gnu dot org
2006-05-25 [Bug java/22128] [4.0/4.1/4.2 Regression] Cyclic inheritance hangs jc1 mmitchel at gcc dot gnu dot org
2006-05-25 [Bug libgcj/21714] [4.0/4.1/4.2 Regression] libjava bootstrap failure in java/lang/natConcreteProcess.cc mmitchel at gcc dot gnu dot org
2006-05-25 [Bug java/21662] [4.0/4.1/4.2 Regression] Fields in interfaces not optimized when read from *.class, but optimized when read from *.java mmitchel at gcc dot gnu dot org
2006-05-25 [Bug java/20495] [4.0/4.1/4.2 Regression] building gcj hangs on gcj-dbtool mmitchel at gcc dot gnu dot org
2006-05-25 [Bug java/20031] [4.0/4.1/4.2 regression] ICE on missing files mmitchel at gcc dot gnu dot org
2006-05-25 [Bug tree-optimization/19505] [4.0/4.1/4.2 Regression] java bytecode to native ICE in remove_unreachable_regions mmitchel at gcc dot gnu dot org
2006-05-25 [Bug java/18796] [4.0/4.1/4.2 Regression] gcj imports wrong superclass mmitchel at gcc dot gnu dot org
2006-05-25 [Bug java/18190] [4.0/4.1/4.2 regression] primitive array optimization is gone mmitchel at gcc dot gnu dot org
2006-05-25 [Bug libgcj/10353] [4.0/4.1/4.2 regression] Java testsuite failures mmitchel at gcc dot gnu dot org
2006-05-25 [Bug java/8923] [4.0/4.1/4.2 Regression] ICE when modifying a variable decleared "final static" mmitchel at gcc dot gnu dot org
2006-05-25 [Bug libgcj/9715] Not all required character encodings are supported mmitchel at gcc dot gnu dot org
2006-05-24 [Bug libgcj/27024] Implement URLConnection.getFileNameMap tromey at gcc dot gnu dot org
2006-05-24 [Bug libgcj/27024] Implement URLConnection.getFileNameMap tromey at gcc dot gnu dot org
2006-05-24 [Bug java/27764] gcj-4.1: error trying to exec 'cc1': execvp: No such file or directory pinskia at gcc dot gnu dot org
2006-05-24 [Bug java/27764] New: gcj-4.1: error trying to exec 'cc1': execvp: No such file or directory charleshixsn at earthlink dot net
2006-05-24 [Bug java/27643] ICE in java_mark_cni_decl_local compiling bytecode->native tromey at gcc dot gnu dot org
2006-05-24 [Bug libgcj/27729] Field, Method and Constructor need isSynthetic() implemetation tromey at gcc dot gnu dot org
2006-05-24 [Bug libgcj/27729] Field, Method and Constructor need isSynthetic() implemetation tromey at gcc dot gnu dot org
2006-05-24 [Bug libgcj/27731] Math cbrt(), cosh(), expm1(), hypot(), log1p(), sinh() and tanh() not implemented tromey at gcc dot gnu dot org
2006-05-24 [Bug libgcj/27731] Math cbrt(), cosh(), expm1(), hypot(), log1p(), sinh() and tanh() not implemented tromey at gcc dot gnu dot org
2006-05-24 [Bug libgcj/27726] LocalSocketImpl not implemented tromey at gcc dot gnu dot org
2006-05-24 [Bug libgcj/27731] Math cbrt(), cosh(), expm1(), hypot(), log1p(), sinh() and tanh() not implemented tromey at gcc dot gnu dot org
2006-05-24 [Bug java/27756] ICE in update_aliases, at java/decl.c:192 tromey at gcc dot gnu dot org
2006-05-24 [Bug java/27756] New: ICE in update_aliases, at java/decl.c:192 tromey at gcc dot gnu dot org
2006-05-24 [Bug java/27754] Stack overflow in gcj aph at gcc dot gnu dot org
2006-05-24 [Bug java/27754] Stack overflow in gcj tromey at gcc dot gnu dot org
2006-05-24 [Bug java/27754] Stack overflow in gcj aph at gcc dot gnu dot org
2006-05-24 [Bug java/27754] New: Stack overflow in gcj aph at gcc dot gnu dot org
2006-05-23 [Bug libgcj/27741] Automate generation of gcj/javaprims.h tromey at gcc dot gnu dot org
2006-05-23 [Bug libgcj/27741] New: Automate generation of gcj/javaprims.h mark at gcc dot gnu dot org
2006-05-22 [Bug libgcj/27731] Math cbrt(), cosh(), expm1(), hypot(), log1p(), sinh() and tanh() not implemented tromey at gcc dot gnu dot org
2006-05-22 [Bug libgcj/27730] Thread.getId() needs implemented tromey at gcc dot gnu dot org
2006-05-22 [Bug libgcj/27729] Field, Method and Constructor need isSynthetic() implemetation tromey at gcc dot gnu dot org
2006-05-22 [Bug libgcj/27728] Class.getEnclosingX() methods need implementation tromey at gcc dot gnu dot org
2006-05-22 [Bug libgcj/27727] Class should implement AnnotatedElement tromey at gcc dot gnu dot org
2006-05-22 [Bug libgcj/27731] New: Math cbrt(), cosh(), expm1(), hypot(), log1p(), sinh() and tanh() not implemented mark at gcc dot gnu dot org
2006-05-22 [Bug libgcj/27730] New: Thread.getId() needs implemented mark at gcc dot gnu dot org
2006-05-22 [Bug libgcj/27729] New: Field, Method and Constructor need isSynthetic() implemetation mark at gcc dot gnu dot org
2006-05-22 [Bug libgcj/27728] New: Class.getEnclosingX() methods need implementation mark at gcc dot gnu dot org
2006-05-22 [Bug libgcj/27727] New: Class should implement AnnotatedElement mark at gcc dot gnu dot org
2006-05-22 [Bug libgcj/27726] New: LocalSocketImpl not implemented mark at gcc dot gnu dot org
2006-05-22 [Bug libgcj/13212] JNI/CNI AttachCurrentThread does not register thread with garbage collector rguenth at gcc dot gnu dot org
2006-05-22 [Bug java/27643] ICE in java_mark_cni_decl_local compiling bytecode->native rmathew at gcc dot gnu dot org
2006-05-20 [Bug libgcj/27330] natSystemProperties.cc:213: error: 'getpwuid_r' was not declared in this scope andreast at gcc dot gnu dot org
2006-05-18 [Bug libgcj/27658] _Jv_CreateJavaVM calling ExtensionClassLoader bootstrap problem tromey at gcc dot gnu dot org
2006-05-18 [Bug java/27643] ICE in java_mark_cni_decl_local compiling bytecode->native tromey at gcc dot gnu dot org
2006-05-18 [Bug libgcj/27658] New: _Jv_CreateJavaVM calling ExtensionClassLoader bootstrap problem mark at gcc dot gnu dot org
2006-05-18 [Bug java/27643] ICE in java_mark_cni_decl_local compiling bytecode->native rmathew at gcc dot gnu dot org
2006-05-17 [Bug java/27643] New: ICE in java_mark_cni_decl_local compiling bytecode->native mckinlay at redhat dot com
2006-05-17 [Bug libgcj/27352] SecurityManager.checkPermission() called unnecessarily mckinlay at redhat dot com
2006-05-17 [Bug libgcj/27352] SecurityManager.checkPermission() called unnecessarily bryce at gcc dot gnu dot org
2006-05-17 [Bug awt/20630] GTK 2.8 peer Image and Graphics API reorganization sven at physto dot se
2006-05-16 [Bug libgcj/27352] SecurityManager.checkPermission() called unnecessarily mckinlay at redhat dot com
2006-05-15 [Bug libgcj/22579] URLClassLoader re-merge plan tromey at gcc dot gnu dot org
2006-05-15 [Bug tree-optimization/27590] [regression] ICE when compiling catalina.jar from tomcat 5.0.30 aph at gcc dot gnu dot org
2006-05-15 [Bug tree-optimization/27590] [regression] ICE when compiling catalina.jar from tomcat 5.0.30 aph at gcc dot gnu dot org
2006-05-15 [Bug tree-optimization/27590] [regression] ICE when compiling catalina.jar from tomcat 5.0.30 aph at gcc dot gnu dot org
2006-05-15 [Bug tree-optimization/27590] [regression] ICE when compiling catalina.jar from tomcat 5.0.30 aph at gcc dot gnu dot org
2006-05-15 [Bug tree-optimization/27590] [regression] ICE when compiling catalina.jar from tomcat 5.0.30 aph at gcc dot gnu dot org
2006-05-15 [Bug java/9861] method name mangling ignores return type rmathew at gcc dot gnu dot org
2006-05-14 [Bug libgcj/22579] URLClassLoader re-merge plan tromey at gcc dot gnu dot org
2006-05-13 [Bug libgcj/27024] Implement URLConnection.getFileNameMap tromey at gcc dot gnu dot org
2006-05-13 [Bug tree-optimization/27590] [regression] ICE when compiling catalina.jar from tomcat 5.0.30 aph at gcc dot gnu dot org
2006-05-13 [Bug java/27590] [regression] ICE when compiling catalina.jar from tomcat 5.0.30 konqueror at gmx dot de
2006-05-13 [Bug java/27590] [regression] ICE when compiling catalina.jar from tomcat 5.0.30 konqueror at gmx dot de
2006-05-13 [Bug java/27590] New: [regression] ICE when compiling catalina.jar from tomcat 5.0.30 konqueror at gmx dot de
2006-05-11 [Bug java/20418] ICE if variable name is ommitted in an initialiser and a qualified type for the variable is used daney at gcc dot gnu dot org
2006-05-10 [Bug java/12257] Inner classes with same name causes crash. aph at gcc dot gnu dot org
2006-05-08 [Bug libgcj/27502] [4.2 Regression] Bootstrap failure without a jar program installed pinskia at gcc dot gnu dot org
2006-05-08 [Bug libgcj/27502] [4.2 Regression] Bootstrap failure without a jar program installed pinskia at gcc dot gnu dot org
2006-05-08 [Bug libgcj/27502] New: [4.2 Regression] Bootstrap failure without a jar program installed pinskia at gcc dot gnu dot org
2006-05-06 [Bug libgcj/10353] [4.0/4.1/4.2 regression] Java testsuite failures ebotcazou at gcc dot gnu dot org
2006-05-06 [Bug libgcj/10353] [4.0/4.1/4.2 regression] Java testsuite failures christian dot joensson at gmail dot com
2006-05-05 [Bug libgcj/27294] gij throws NullPointerException, when the interpreter is not enabled tromey at gcc dot gnu dot org
2006-05-05 [Bug libgcj/27294] gij throws NullPointerException, when the interpreter is not enabled tromey at gcc dot gnu dot org
2006-05-05 [Bug java/27442] New: gcj segfaults on invalid code (related to 8923?) brakhane at gmail dot com
2006-05-05 [Bug java/27439] gcj chokes on invalid expression pinskia at gcc dot gnu dot org
2006-05-04 [Bug java/27439] New: gcj chokes on invalid expression brakhane at gmail dot com
2006-05-04 [Bug libgcj/27352] SecurityManager.checkPermission() called unnecessarily aph at gcc dot gnu dot org
2006-05-04 [Bug libgcj/27294] gij throws NullPointerException, when the interpreter is not enabled tromey at gcc dot gnu dot org
2006-05-04 [Bug libgcj/26861] VirtualMachineError in interperter. tromey at gcc dot gnu dot org
2006-05-04 [Bug libgcj/26861] VirtualMachineError in interperter. tromey at gcc dot gnu dot org
2006-05-04 [Bug libgcj/26861] VirtualMachineError in interperter. tromey at gcc dot gnu dot org
2006-05-04 [Bug libgcj/26858] NullPointerException not generated for large classes... aph at gcc dot gnu dot org
2006-05-04 [Bug java/8260] gcj -fprofile-arcs doesn't work aoliva at gcc dot gnu dot org
2006-05-04 [Bug java/8260] gcj -fprofile-arcs doesn't work aoliva at gcc dot gnu dot org
2006-05-04 [Bug java/8260] gcj -fprofile-arcs doesn't work aoliva at gcc dot gnu dot org
2006-05-02 [Bug java/27400] New: switch indexed by class crashes compiler cagney at redhat dot com
2006-05-02 [Bug java/27399] New: GCJ permits indexing by final object cagney at redhat dot com
2006-05-02 [Bug libgcj/27352] SecurityManager.checkPermission() called unnecessarily aph at gcc dot gnu dot org
2006-05-01 [Bug libgcj/26593] libgcjawt should be built even if the gtk peers aren't bero at arklinux dot org
2006-05-01 [Bug libgcj/27368] New: [Xlib peer] Font.canDisplayUpTo throws UnsupportedOperationException greenrd at gcc dot gnu dot org
2006-05-01 [Bug libgcj/27352] SecurityManager.checkPermission() called unnecessarily csm at gnu dot org
2006-04-30 [Bug libgcj/27330] natSystemProperties.cc:213: error: 'getpwuid_r' was not declared in this scope andreast at gcc dot gnu dot org
2006-04-30 [Bug libgcj/26858] NullPointerException not generated for large classes... pinskia at gcc dot gnu dot org
2006-04-28 [Bug libgcj/27352] SecurityManager.checkPermission() called unnecessarily aph at gcc dot gnu dot org
2006-04-28 [Bug libgcj/27352] SecurityManager.checkPermission() called unnecessarily aph at gcc dot gnu dot org
2006-04-28 [Bug libgcj/27352] New: SecurityManager.checkPermission() called unnecessarily aph at gcc dot gnu dot org
2006-04-27 [Bug libgcj/27330] natSystemProperties.cc:213: error: 'getpwuid_r' was not declared in this scope andreast at gcc dot gnu dot org
2006-04-27 [Bug classpath/26688] Classpath Makefiles assume CVS source control gnu_andrew at member dot fsf dot org
2006-04-27 [Bug classpath/26707] lib/Makefile.am should ignore .svn directories gnu_andrew at member dot fsf dot org
2006-04-27 [Bug classpath/24632] java.util.HashMap$HashIterator.hasNext throws ConcurrentModificationException gnu_andrew at member dot fsf dot org
2006-04-27 [Bug crypto/27111] SecureRandom isn't seeded on creation gnu_andrew at member dot fsf dot org
2006-04-27 [Bug awt/22163] scrollbars appear and disappear gnu_andrew at member dot fsf dot org
2006-04-27 [Bug libgcj/27330] natSystemProperties.cc:213: error: 'getpwuid_r' was not declared in this scope dave at hiauly1 dot hia dot nrc dot ca
2006-04-26 [Bug libgcj/27330] natSystemProperties.cc:213: error: 'getpwuid_r' was not declared in this scope danglin at gcc dot gnu dot org
2006-04-26 [Bug libgcj/27330] New: natSystemProperties.cc:213: error: 'getpwuid_r' was not declared in this scope danglin at gcc dot gnu dot org
2006-04-26 [Bug java/10894] Wildcard import statements not resolved pinskia at gcc dot gnu dot org
2006-04-26 [Bug java/27280] gcj cannot import inner classes using a wildcard import pinskia at gcc dot gnu dot org
2006-04-24 [Bug libgcj/27294] New: gij throws NullPointerException, when the interpreter is not enabled debian-gcc at lists dot debian dot org
2006-04-24 [Bug libgcj/27271] i/o error (java.util.zip.ZipException: Deflated stream ends early.) tromey at gcc dot gnu dot org
2006-04-24 [Bug classpath/27262] org.w3c.dom.Document.getElementById returns null after manual (setIdAttribute) identifying of element in Document instance. cvs-commit at developer dot classpath dot org
2006-04-24 [Bug classpath/27262] org.w3c.dom.Document.getElementById returns null after manual (setIdAttribute) identifying of element in Document instance. dog at gnu dot org
2006-04-24 [Bug java/27280] New: gcj cannot import inner classes using a wildcard import michele at focuseek dot com
2006-04-23 [Bug libgcj/27271] i/o error (java.util.zip.ZipException: Deflated stream ends early.) doko at ubuntu dot com
2006-04-23 [Bug libgcj/27271] New: i/o error (java.util.zip.ZipException: Deflated stream ends early.) doko at ubuntu dot com
2006-04-23 [Bug libgcj/1373] recursion stress test causes segmentation fault pinskia at gcc dot gnu dot org
2006-04-23 [Bug libgcj/1373] recursion stress test causes segmentation fault pinskia at gcc dot gnu dot org
2006-04-23 [Bug libgcj/27268] gij could give a warning on senseless code pinskia at gcc dot gnu dot org
2006-04-23 [Bug libgcj/27268] New: gij could give a warning on senseless code debian-gcc at lists dot debian dot org
2006-04-23 [Bug java/8923] [4.0/4.1/4.2 Regression] ICE when modifying a variable decleared "final static" debian-gcc at lists dot debian dot org
2006-04-23 [Bug classpath/27262] org.w3c.dom.Document.getElementById returns null after manual (setIdAttribute) identifying of element in Document instance. mark at gcc dot gnu dot org
2006-04-23 [Bug libgcj/27265] ClassNotFoundException: gnu.java.awt.peer.gtk.GtkToolkit pinskia at gcc dot gnu dot org
2006-04-23 [Bug libgcj/27265] ClassNotFoundException: gnu.java.awt.peer.gtk.GtkToolkit greenrd at gcc dot gnu dot org
2006-04-23 [Bug libgcj/27265] New: ClassNotFoundException: gnu.java.awt.peer.gtk.GtkToolkit greenrd at gcc dot gnu dot org
2006-04-22 [Bug fastjar/13020] zip-style comments pinskia at gcc dot gnu dot org
2006-04-22 [Bug fastjar/21822] fastjar/jartool.c's usage of MAXPATHLEN pinskia at gcc dot gnu dot org
2006-04-22 [Bug fastjar/20941] Incorrect case for META-INF with fastjar pinskia at gcc dot gnu dot org
2006-04-22 [Bug libgcj/27262] org.w3c.dom.Element.getElementById returns null after manual (setIdAttribute) identifying of element in Document instance. kalle at enrogue dot com
2006-04-22 [Bug libgcj/27262] New: org.w3c.dom.Element.getElementById returns null after manual (setIdAttribute) identifying of element in Document instance. kalle at enrogue dot com
2006-04-22 [Bug crypto/27228] java.security.InvalidAlgorithmParameterException csm at gnu dot org
2006-04-22 [Bug crypto/27228] java.security.InvalidAlgorithmParameterException david at jpackage dot org
2006-04-22 [Bug crypto/27228] java.security.InvalidAlgorithmParameterException cvs-commit at developer dot classpath dot org
2006-04-21 [Bug classpath/27163] FTP directory listing doesn't work tromey at gcc dot gnu dot org
2006-04-21 [Bug classpath/27163] FTP directory listing doesn't work cvs-commit at developer dot classpath dot org
2006-04-21 [Bug classpath/27163] FTP directory listing doesn't work tromey at gcc dot gnu dot org
2006-04-21 [Bug libgcj/27231] java.lang.StringIndexOutOfBoundsException in HTTPURLConnection.connect cvs-commit at developer dot classpath dot org
2006-04-21 [Bug libgcj/27231] java.lang.StringIndexOutOfBoundsException in HTTPURLConnection.connect tromey at gcc dot gnu dot org
2006-04-21 [Bug libgcj/27231] java.lang.StringIndexOutOfBoundsException in HTTPURLConnection.connect tromey at gcc dot gnu dot org
2006-04-21 [Bug libgcj/27231] java.lang.StringIndexOutOfBoundsException in HTTPURLConnection.connect tromey at gcc dot gnu dot org
2006-04-21 [Bug crypto/27228] java.security.InvalidAlgorithmParameterException csm at gnu dot org
2006-04-21 [Bug crypto/27228] java.security.InvalidAlgorithmParameterException r_ovidius at eml dot cc
2006-04-21 [Bug crypto/27228] java.security.InvalidAlgorithmParameterException csm at gnu dot org
2006-04-20 [Bug libgcj/27170] Deadlock in garbage collector mckinlay at redhat dot com
2006-04-20 [Bug libgcj/27170] Deadlock in garbage collector bryce at gcc dot gnu dot org
2006-04-20 [Bug libgcj/27170] Deadlock in garbage collector bryce at gcc dot gnu dot org
2006-04-20 [Bug crypto/27228] java.security.InvalidAlgorithmParameterException tromey at gcc dot gnu dot org
2006-04-20 [Bug libgcj/27228] java.security.InvalidAlgorithmParameterException tromey at gcc dot gnu dot org
2006-04-20 [Bug libgcj/27231] New: java.lang.StringIndexOutOfBoundsException in HTTPURLConnection.connect r_ovidius at eml dot cc
2006-04-20 [Bug libgcj/27228] java.security.InvalidAlgorithmParameterException tromey at gcc dot gnu dot org
2006-04-20 [Bug libgcj/27228] java.security.InvalidAlgorithmParameterException tromey at gcc dot gnu dot org
2006-04-20 [Bug libgcj/27219] bogus-looking code in natPlainSocketImplPosix.cc mckinlay at redhat dot com
2006-04-20 [Bug libgcj/27228] New: java.security.InvalidAlgorithmParameterException r_ovidius at eml dot cc
2006-04-20 [Bug classpath/27163] FTP directory listing doesn't work r_ovidius at eml dot cc
2006-04-20 [Bug libgcj/27201] can't include cni.h and jni.h in the same file tromey at gcc dot gnu dot org
2006-04-20 [Bug libgcj/27219] bogus-looking code in natPlainSocketImplPosix.cc tromey at gcc dot gnu dot org
2006-04-20 [Bug libgcj/27219] bogus-looking code in natPlainSocketImplPosix.cc tromey at gcc dot gnu dot org
2006-04-20 [Bug libgcj/21941] NPE in Socket.connect() tromey at gcc dot gnu dot org
2006-04-20 [Bug libgcj/21941] NPE in Socket.connect() tromey at gcc dot gnu dot org
2006-04-20 [Bug libgcj/21941] NPE in Socket.connect() tromey at gcc dot gnu dot org
2006-04-20 [Bug libgcj/25414] should update rmic aph at gcc dot gnu dot org
2006-04-19 [Bug classpath/27163] FTP directory listing doesn't work tromey at gcc dot gnu dot org
2006-04-19 [Bug classpath/27163] FTP directory listing doesn't work tromey at gcc dot gnu dot org
2006-04-19 [Bug libgcj/27219] New: bogus-looking code in natPlainSocketImplPosix.cc tromey at gcc dot gnu dot org
2006-04-19 [Bug libgcj/27201] can't include cni.h and jni.h in the same file pinskia at gcc dot gnu dot org
2006-04-18 [Bug libgcj/27201] New: can't include cni.h and jni.h in the same file tromey at gcc dot gnu dot org
2006-04-18 [Bug libgcj/26858] NullPointerException not generated for large classes... aph at gcc dot gnu dot org
2006-04-17 [Bug libgcj/27171] UTF8 PrintWriter goes haywire tromey at gcc dot gnu dot org
2006-04-17 [Bug libgcj/27171] UTF8 PrintWriter goes haywire tromey at gcc dot gnu dot org
2006-04-17 [Bug libgcj/27171] UTF8 PrintWriter goes haywire tromey at gcc dot gnu dot org
2006-04-17 [Bug libgcj/27171] UTF8 PrintWriter goes haywire tromey at gcc dot gnu dot org
2006-04-17 [Bug libgcj/27171] UTF8 PrintWriter goes haywire tromey at gcc dot gnu dot org
2006-04-17 [Bug libgcj/27170] Deadlock in garbage collector tromey at gcc dot gnu dot org
2006-04-17 [Bug libgcj/27170] Deadlock in garbage collector green at redhat dot com
2006-04-17 [Bug libgcj/27170] Deadlock in garbage collector green at redhat dot com
2006-04-14 [Bug libgcj/27170] Deadlock in garbage collector green at redhat dot com
2006-04-14 [Bug libgcj/27170] Deadlock in garbage collector Hans dot Boehm at hp dot com
2006-04-14 [Bug classpath/24642] Failure to produce random values. csm at gnu dot org
2006-04-14 [Bug libgcj/27171] New: UTF8 PrintWriter goes haywire green at redhat dot com
2006-04-14 [Bug libgcj/27170] Deadlock in garbage collector green at redhat dot com
2006-04-14 [Bug libgcj/27170] New: Deadlock in garbage collector green at redhat dot com
2006-04-14 [Bug classpath/24642] Failure to produce random values. cvs-commit at developer dot classpath dot org
2006-04-14 [Bug libgcj/27163] New: FTP directory listing doesn't work r_ovidius at eml dot cc
2006-04-13 [Bug bootstrap/27127] internal compiler error when compiling libjava with jc1 rainer-gccbugzilla at 7val dot com
2006-04-12 [Bug libgcj/26483] Wrong parsing of doubles when interpreted on ia64 wilson at gcc dot gnu dot org
2006-04-12 [Bug libgcj/26483] Wrong parsing of doubles when interpreted on ia64 wilson at gcc dot gnu dot org
2006-04-12 [Bug libgcj/26483] Wrong parsing of doubles when interpreted on ia64 wilson at gcc dot gnu dot org
2006-04-12 [Bug classpath/24642] Failure to produce random values. csm at gnu dot org
2006-04-12 [Bug classpath/24642] Failure to produce random values. csm at gnu dot org
2006-04-12 [Bug crypto/27111] SecureRandom isn't seeded on creation csm at gnu dot org
2006-04-12 [Bug libgcj/23829] FreeBSD 5 support for libjava gerald at pfeifer dot com
2006-04-12 [Bug libgcj/23829] FreeBSD 5 support for libjava gerald at gcc dot gnu dot org
2006-04-12 [Bug libgcj/27066] libgcj native socket code does not support IPv6 cjw at daneel dot dyndns dot org
2006-04-12 [Bug classpath/24481] SecureRandom.setSeed has no impact csm at gnu dot org
2006-04-12 [Bug java/13021] GCJ Boehm descriptor may be incorrect if alignment != sizeof(void*) tromey at gcc dot gnu dot org
2006-04-12 [Bug java/27101] GCJ rejects valid code (for Sun's measure of "valid') tromey at gcc dot gnu dot org
2006-04-12 [Bug classpath/24481] SecureRandom.setSeed has no impact cvs-commit at developer dot classpath dot org
2006-04-12 [Bug java/27127] internal compiler error when compiling libjava with jc1 ebotcazou at gcc dot gnu dot org
2006-04-12 [Bug java/27127] internal compiler error when compiling libjava with jc1 rainer-gccbugzilla at 7val dot com
2006-04-12 [Bug java/27127] New: internal compiler error when compiling libjava with jc1 rainer-gccbugzilla at 7val dot com
2006-04-12 [Bug classpath/24481] SecureRandom.setSeed has no impact csm at gnu dot org
2006-04-12 [Bug classpath/24481] SecureRandom.setSeed has no impact david at jpackage dot org
2006-04-11 [Bug classpath/24481] SecureRandom.setSeed has no impact csm at gnu dot org
2006-04-11 [Bug libgcj/23829] FreeBSD 5 support for libjava gerald at gcc dot gnu dot org
2006-04-11 [Bug java/21428] [4.0 Regression] bogus warning: unused parameter 'this' aph at gcc dot gnu dot org
2006-04-11 [Bug libgcj/27066] libgcj native socket code does not support IPv6 mckinlay at redhat dot com
2006-04-11 [Bug classpath/24481] SecureRandom.setSeed has no impact david at jpackage dot org
2006-04-11 [Bug classpath/24481] SecureRandom.setSeed has no impact csm at gnu dot org
2006-04-10 [Bug java/27104] static final variable not being tracked as being set correctly vnasardinov at gmail dot com
2006-04-10 [Bug java/24835] gcj accepts invalid code with static final variables pinskia at gcc dot gnu dot org
2006-04-10 [Bug java/27104] static final variable not being tracked as being set correctly pinskia at gcc dot gnu dot org
2006-04-10 [Bug libgcj/27104] definite assingment bug in GCJ vnasardinov at gmail dot com
2006-04-10 [Bug libgcj/27104] New: definite assingment bug in GCJ vnasardinov at gmail dot com
2006-04-10 [Bug java/27101] GCJ rejects valid code (for Sun's measure of "valid') pinskia at gcc dot gnu dot org
2006-04-10 [Bug java/27101] GCJ rejects valid code (for Sun's measure of "valid') vnasardinov at gmail dot com
2006-04-10 [Bug java/27101] GCJ rejects valid code (for Sun's measure of "valid') pinskia at gcc dot gnu dot org
2006-04-10 [Bug libgcj/27101] New: GCJ rejects valid code (for Sun's measure of "valid') vnasardinov at gmail dot com
2006-04-07 [Bug libgcj/26483] Wrong parsing of doubles when interpreted on ia64 wilson at gcc dot gnu dot org
2006-04-07 [Bug libgcj/26483] Wrong parsing of doubles when interpreted on ia64 wilson at tuliptree dot org
2006-04-07 [Bug classpath/20247] Lack java.util.concurrent.LinkedBlockingQueue tromey at gcc dot gnu dot org
2006-04-07 [Bug classpath/20247] Lack java.util.concurrent.LinkedBlockingQueue roman at kennke dot org
2006-04-07 [Bug classpath/20247] Lack java.util.concurrent.LinkedBlockingQueue roman at kennke dot org
2006-04-07 [Bug classpath/24481] SecureRandom.setSeed has no impact david at jpackage dot org
2006-04-07 [Bug classpath/20247] Lack java.util.concurrent.LinkedBlockingQueue david at jpackage dot org
2006-04-06 [Bug libgcj/27066] libgcj native socket code does not support IPv6 cjw at daneel dot dyndns dot org
2006-04-06 [Bug libgcj/27066] libgcj native socket code does not support IPv6 mckinlay at redhat dot com
2006-04-06 [Bug libgcj/27066] libgcj native socket code does not support IPv6 cjw at daneel dot dyndns dot org
2006-04-06 [Bug libgcj/27066] New: libgcj native socket code does not support IPv6 cjw at daneel dot dyndns dot org
2006-04-05 [Bug libgcj/25250] Turn off lib-foo-bar class loading mechanism by default fitzsim at redhat dot com
2006-04-05 [Bug libgcj/26625] libgcj-4.2.0.jar not rebuilt after a source file change tromey at gcc dot gnu dot org
2006-04-05 [Bug libgcj/26625] libgcj-4.2.0.jar not rebuilt after a source file change tromey at gcc dot gnu dot org
2006-04-05 [Bug libgcj/26625] libgcj-4.2.0.jar not rebuilt after a source file change tromey at gcc dot gnu dot org
2006-04-05 [Bug libgcj/26625] libgcj-4.2.0.jar not rebuilt after a source file change cvs-commit at developer dot classpath dot org
2006-04-05 [Bug libgcj/26625] libgcj-4.2.0.jar not rebuilt after a source file change tromey at gcc dot gnu dot org
2006-04-05 [Bug libgcj/23682] gnu.java.nio.SelectorImpl.select(long) throws ArrayIndexOutOfBoundsException tromey at gcc dot gnu dot org
2006-04-05 [Bug java/25847] libjava build doesn't stop when there is a fatal error pinskia at gcc dot gnu dot org
2006-04-05 [Bug libgcj/27024] Implement URLConnection.getFileNameMap tromey at gcc dot gnu dot org
2006-04-05 [Bug classpath/27028] Iterator.hasNext() throws ConcurrentModificationException mckinlay at redhat dot com
2006-04-05 [Bug libgcj/27024] Implement URLConnection.getFileNameMap tromey at gcc dot gnu dot org
2006-04-05 [Bug classpath/27028] Iterator.hasNext() throws ConcurrentModificationException bryce at gcc dot gnu dot org
2006-04-05 [Bug classpath/27028] Iterator.hasNext() throws ConcurrentModificationException mckinlay at redhat dot com
2006-04-05 [Bug classpath/24632] java.util.HashMap$HashIterator.hasNext throws ConcurrentModificationException mckinlay at redhat dot com
2006-04-05 [Bug classpath/27028] Iterator.hasNext() throws ConcurrentModificationException mckinlay at redhat dot com
2006-04-05 [Bug classpath/27028] Iterator.hasNext() throws ConcurrentModificationException mckinlay at redhat dot com
2006-04-05 [Bug java/27025] ICE on simple initializer aph at gcc dot gnu dot org
2006-04-05 [Bug java/27025] ICE on simple initializer aph at gcc dot gnu dot org
2006-04-05 [Bug libgcj/25414] should update rmic aph at gcc dot gnu dot org
2006-04-05 [Bug classpath/27028] Iterator.hasNext() throws ConcurrentModificationException rmathew at gcc dot gnu dot org
2006-04-05 [Bug classpath/27028] Iterator.hasNext() throws ConcurrentModificationException mark at gcc dot gnu dot org
2006-04-05 [Bug java/4695] Error calling method from enclosing context in constructor taral at taral dot net
2006-04-05 [Bug libgcj/27024] Implement URLConnection.getFileNameMap tromey at gcc dot gnu dot org
2006-04-05 [Bug java/4695] Error calling method from enclosing context in constructor pinskia at gcc dot gnu dot org
2006-04-05 [Bug java/27037] Direct compile fails pinskia at gcc dot gnu dot org
2006-04-05 [Bug java/27037] Direct compile fails taral at taral dot net
2006-04-05 [Bug java/27037] New: Direct compile fails taral at taral dot net
2006-04-04 [Bug libgcj/27031] native Eclipse uses too much memory on startup, sometimes pinskia at gcc dot gnu dot org
2006-04-04 [Bug libgcj/27031] native Eclipse uses too much memory on startup, sometimes bkonrath at redhat dot com
2006-04-04 [Bug libgcj/26483] Wrong parsing of doubles when interpreted on ia64 andreast at gcc dot gnu dot org
2006-04-04 [Bug classpath/27028] Eclipse Update Manager throws ConcurrentModificationExceptions mckinlay at redhat dot com
2006-04-04 [Bug libgcj/26483] Wrong parsing of doubles when interpreted on ia64 wilson at gcc dot gnu dot org
2006-04-04 [Bug libgcj/26483] Wrong parsing of doubles when interpreted on ia64 wilson at tuliptree dot org
2006-04-04 [Bug libgcj/27028] Eclipse Update Manager throws ConcurrentModificationExceptions mckinlay at redhat dot com
2006-04-04 [Bug libgcj/26483] Wrong parsing of doubles when interpreted on ia64 tromey at gcc dot gnu dot org
2006-04-04 [Bug libgcj/27031] native Eclipse uses too much memory on startup, sometimes fitzsim at redhat dot com
2006-04-04 [Bug libgcj/27031] New: native Eclipse uses too much memory on startup, sometimes fitzsim at redhat dot com
2006-04-04 [Bug java/27025] ICE on simple initializer aph at gcc dot gnu dot org
2006-04-04 [Bug java/27025] ICE on simple initializer aph at gcc dot gnu dot org
2006-04-04 [Bug java/27028] New: Eclipse Update Manager throws ConcurrentModificationExceptions overholt at redhat dot com
2006-04-04 [Bug libgcj/27027] New: thread cancellation and native Eclipse fitzsim at redhat dot com
2006-04-04 [Bug libgcj/27024] Implement URLConnection.getFileNameMap tromey at gcc dot gnu dot org
2006-04-04 [Bug java/27025] ICE on simple initializer tromey at gcc dot gnu dot org
2006-04-04 [Bug java/27025] ICE on simple initializer aph at gcc dot gnu dot org
2006-04-04 [Bug libgcj/25414] should update rmic aph at gcc dot gnu dot org
2006-04-04 [Bug java/27025] ICE on simple initializer taral at taral dot net
2006-04-04 [Bug java/27025] New: ICE on simple initializer taral at taral dot net
2006-04-04 [Bug java/27024] New: Implement URLConnection.getFileNameMap taral at taral dot net
2006-04-03 [Bug libgcj/23829] FreeBSD 5 support for libjava tromey at gcc dot gnu dot org
2006-04-03 [Bug libgcj/23829] FreeBSD 5 support for libjava rittle at latour dot labs dot mot dot com
2006-04-03 [Bug java/17819] ICE in build_java_check_indexed_type tromey at gcc dot gnu dot org
2006-04-03 [Bug libgcj/26858] NullPointerException not generated for large classes... aph at gcc dot gnu dot org
2006-04-03 [Bug libgcj/26858] NullPointerException not generated for large classes... aph at gcc dot gnu dot org
2006-04-03 [Bug libgcj/23682] gnu.java.nio.SelectorImpl.select(long) throws ArrayIndexOutOfBoundsException green at redhat dot com
2006-04-03 [Bug libgcj/23829] FreeBSD 5 support for libjava gerald at pfeifer dot com
2006-04-01 [Bug target/26879] LibJava not compile under alpha zerocool at modemsoft dot it
2006-04-01 [Bug target/26879] LibJava not compile under alpha rmathew at gcc dot gnu dot org
Indexes: [Date Index] [Subject Index] [Author Index] [Thread Index]
Site Nav: [Browse other archives for this mailing list]
[Browse other mailing lists at this site]
Search: Limit to:

Mail converted by MHonArc 2.6.3