java-prs archive
date index for April - June, 2005

This is the mail archive of the java-prs@gcc.gnu.org mailing list for the Java project.

Indexes: [Date Index] [Subject Index] [Author Index] [Thread Index]
Site Nav: [Browse other archives for this mailing list]
[Browse other mailing lists at this site]
Search: Limit to:


2005-06-30 [Bug middle-end/22253] [4.1 Regression] ICE while compiling libjava/gnu/gcj/xlib/natWindow.cc giovannibajo at libero dot it
2005-06-30 [Bug middle-end/22253] [4.1 Regression] ICE while compiling libjava/gnu/gcj/xlib/natWindow.cc pinskia at gcc dot gnu dot org
2005-06-30 [Bug middle-end/22253] [4.1 Regression] ICE while compiling libjava/gnu/gcj/xlib/natWindow.cc pinskia at gcc dot gnu dot org
2005-06-30 [Bug middle-end/22253] [4.1 Regression] ICE while compiling libjava/gnu/gcj/xlib/natWindow.cc pinskia at gcc dot gnu dot org
2005-06-30 [Bug middle-end/22253] ICE while compiling libjava/gnu/gcj/xlib/natWindow.cc andreast at gcc dot gnu dot org
2005-06-30 [Bug middle-end/22253] ICE while compiling libjava/gnu/gcj/xlib/natWindow.cc pinskia at gcc dot gnu dot org
2005-06-30 [Bug libgcj/22253] New: ICE while compiling libjava/gnu/gcj/xlib/natWindow.cc andreast at gcc dot gnu dot org
2005-06-30 [Bug java/21428] [3.4/4.0/4.1 Regression] bogus warning: unused parameter 'this' aph at redhat dot com
2005-06-30 [Bug java/21428] [3.4/4.0/4.1 Regression] bogus warning: unused parameter 'this' tromey at gcc dot gnu dot org
2005-06-30 [Bug java/20302] Problem with sub classes with contructors with exceptions tromey at gcc dot gnu dot org
2005-06-30 [Bug java/20193] Variable names incorrectly resolved in inner classes. tromey at gcc dot gnu dot org
2005-06-29 [Bug libgcj/22211] [4.0 only] Thread.interrupt sometimes causes abort if thread is already dead pinskia at gcc dot gnu dot org
2005-06-29 [Bug libgcj/22211] Thread.interrupt sometimes causes abort if thread is already dead tromey at gcc dot gnu dot org
2005-06-29 [Bug libgcj/22211] Thread.interrupt sometimes causes abort if thread is already dead cvs-commit at gcc dot gnu dot org
2005-06-29 [Bug libgcj/22211] Thread.interrupt sometimes causes abort if thread is already dead tromey at gcc dot gnu dot org
2005-06-29 [Bug libgcj/22211] Thread.interrupt sometimes causes abort if thread is already dead greenrd at greenrd dot org
2005-06-29 [Bug libgcj/22211] Thread.interrupt sometimes causes abort if thread is already dead tromey at gcc dot gnu dot org
2005-06-29 [Bug libgcj/22211] Thread.interrupt sometimes causes abort if thread is already dead mlists at juma dot me dot uk
2005-06-29 [Bug libgcj/13212] AttachCurrentThread() not working greenrd at greenrd dot org
2005-06-28 [Bug libgcj/22211] Thread.interrupt sometimes causes abort if thread is already dead greenrd at greenrd dot org
2005-06-28 [Bug libgcj/22189] Table Full in gcj-dbtool if -m option used with smallest possible input cvs-commit at gcc dot gnu dot org
2005-06-28 [Bug java/22214] Java code with Vector<Double> does not compile with GCJ rmathew at gcc dot gnu dot org
2005-06-28 [Bug libgcj/22211] Thread.interrupt sometimes causes abort if thread is already dead greenrd at greenrd dot org
2005-06-28 [Bug java/22214] New: Java code with Vector<Double> does not compile with GCJ sidharthchaturvedi at gmail dot com
2005-06-28 [Bug libgcj/22211] New: Thread.interrupt sometimes causes abort if thread is already dead greenrd at greenrd dot org
2005-06-27 [Bug java/21540] switch stmt problem tromey at gcc dot gnu dot org
2005-06-27 [Bug java/13788] Zero propogate right shift in static final int initializer causes error tromey at gcc dot gnu dot org
2005-06-27 [Bug java/21540] switch stmt problem cvs-commit at gcc dot gnu dot org
2005-06-27 [Bug java/13788] Zero propogate right shift in static final int initializer causes error cvs-commit at gcc dot gnu dot org
2005-06-27 [Bug java/13788] Zero propogate right shift in static final int initializer causes error tromey at gcc dot gnu dot org
2005-06-27 [Bug java/13788] Zero propogate right shift in static final int initializer causes error tromey at gcc dot gnu dot org
2005-06-26 [Bug libgcj/21058] [4.1 Regression] fragile libgcj link process omits some inner classes pinskia at gcc dot gnu dot org
2005-06-26 [Bug libgcj/22189] Table Full in gcj-dbtool if -m option used with smallest possible input greenrd at greenrd dot org
2005-06-26 [Bug libgcj/22189] Table Full in gcj-dbtool if -m option used with smallest possible input pinskia at gcc dot gnu dot org
2005-06-26 [Bug libgcj/22189] Table Full in gcj-dbtool if -m option used with smallest possible input greenrd at greenrd dot org
2005-06-26 [Bug libgcj/22189] New: Table Full in gcj-dbtool if -m option used with smallest possible input greenrd at greenrd dot org
2005-06-25 [Bug libgcj/22186] gnu.gcj.precompiled.db.path ignored for method which calls JNI native method greenrd at greenrd dot org
2005-06-25 [Bug libgcj/22186] gnu.gcj.precompiled.db.path ignored for method which calls JNI native method tromey at gcc dot gnu dot org
2005-06-25 [Bug libgcj/22186] gnu.gcj.precompiled.db.path ignored for method which calls JNI native method greenrd at greenrd dot org
2005-06-25 [Bug libgcj/22187] gnu.gcj.precompiled.db.path ignored for method which calls JNI native method greenrd at greenrd dot org
2005-06-25 [Bug libgcj/22187] New: gnu.gcj.precompiled.db.path ignored for method which calls JNI native method greenrd at greenrd dot org
2005-06-25 [Bug libgcj/22186] gnu.gcj.precompiled.db.path ignored for method which calls JNI native method greenrd at greenrd dot org
2005-06-25 [Bug libgcj/22186] New: gnu.gcj.precompiled.db.path ignored for method which calls JNI native method greenrd at greenrd dot org
2005-06-25 [Bug java/22183] New: gcj -C fails to compile ant 1.6.5 bero at arklinux dot org
2005-06-24 [Bug java/13788] Zero propogate right shift in static final int initializer causes error tromey at gcc dot gnu dot org
2005-06-24 [Bug libgcj/10421] java.text.Collator.getInstance returns null for "de" locale tromey at gcc dot gnu dot org
2005-06-24 [Bug libgcj/6996] gij needs assertion-related command-line options tromey at gcc dot gnu dot org
2005-06-24 [Bug libgcj/22084] [4.1 Regression] Divide_1 test case hangs rmathew at gcc dot gnu dot org
2005-06-24 [Bug java/22166] 0x80000000/-1 is wrong rmathew at gcc dot gnu dot org
2005-06-23 [Bug java/21695] ICE when building gnu-xml.lo in libjava directory marco at technoboredom dot net
2005-06-23 [Bug SWING/19860] Swing JOptionPane and multiline texts abalkiss at redhat dot com
2005-06-23 [Bug SWING/21444] Swing JList can't do multiple selection abalkiss at redhat dot com
2005-06-23 [Bug SWING/22151] JInternalFrame causes OutOfMemory error when maximized. abalkiss at redhat dot com
2005-06-23 [Bug SWING/22151] JInternalFrame causes OutOfMemory error when maximized. abalkiss at redhat dot com
2005-06-23 [Bug SWING/22151] JInternalFrame causes OutOfMemory error when maximized. abalkiss at redhat dot com
2005-06-23 [Bug java/22166] New: 0x80000000/-1 is wrong pinskia at gcc dot gnu dot org
2005-06-23 [Bug AWT/19847] AWT drawImage fails to render transparent GIFs mark at gcc dot gnu dot org
2005-06-23 [Bug java/18131] [meta-bug] inner class problems in java front-end mckinlay at redhat dot com
2005-06-23 [Bug java/20697] Invalid Can't find method error on call to super mckinlay at redhat dot com
2005-06-23 [Bug java/20697] Invalid Can't find method error on call to super cvs-commit at gcc dot gnu dot org
2005-06-23 [Bug AWT/22163] New: scrollbars appear and disappear tromey at gcc dot gnu dot org
2005-06-23 [Bug AWT/22162] New: double-click fails to select entire word tromey at gcc dot gnu dot org
2005-06-22 [Bug AWT/19840] drawImage bug mark at gcc dot gnu dot org
2005-06-22 [Bug SWING/22150] BasicTreeUI Implementation langel at redhat dot com
2005-06-22 [Bug SWING/22151] New: JInternalFrame causes OutOfMemory error when maximized. abalkiss at redhat dot com
2005-06-22 [Bug SWING/22150] New: BasicTreeUI Implementation langel at redhat dot com
2005-06-22 [Bug libgcj/6996] gij needs assertion-related command-line options pinskia at gcc dot gnu dot org
2005-06-21 [Bug java/21540] switch stmt problem tromey at gcc dot gnu dot org
2005-06-21 [Bug java/21540] switch stmt problem tromey at gcc dot gnu dot org
2005-06-21 [Bug java/22128] [3.4/4.0/4.1 Regression] Cyclic inheritance hangs jc1 pinskia at gcc dot gnu dot org
2005-06-20 [Bug java/22128] New: Cyclic inheritance hangs jc1 mckinlay at redhat dot com
2005-06-20 [Bug SWING/17360] JScrollPane has incorrect size when JList with specified size is added to it abalkiss at redhat dot com
2005-06-20 [Bug java/21868] [4.1 regression] can't build mauve tromey at gcc dot gnu dot org
2005-06-20 [Bug libgcj/18266] SIGSEGV in GC_register_finalizer_inner () ovidr at users dot sourceforge dot net
2005-06-20 [Bug AWT/21978] GCC 4.0 Awt and Swing problem abilalh at yahoo dot com
2005-06-19 [Bug libgcj/13708] static java program crashes at startup, UTF-8 environment pinskia at gcc dot gnu dot org
2005-06-19 [Bug java/22094] gcj compiled executable runtime crash pinskia at gcc dot gnu dot org
2005-06-19 [Bug libgcj/13708] static java program crashes at startup, UTF-8 environment pinskia at gcc dot gnu dot org
2005-06-19 [Bug libgcj/22090] Attempt to compile java1.5 classes with gcj pinskia at gcc dot gnu dot org
2005-06-19 [Bug java/19325] Invoking gcj -C on a list of source files consumes insane amount of memory pinskia at gcc dot gnu dot org
2005-06-19 [Bug java/21900] debugging regression when debugging libgcj pinskia at gcc dot gnu dot org
2005-06-19 [Bug libgcj/21893] class loading and verifier audit pinskia at gcc dot gnu dot org
2005-06-19 [Bug libgcj/21892] gnu.* and native code security audit pinskia at gcc dot gnu dot org
2005-06-19 [Bug fastjar/21822] fastjar/jartool.c's usage of MAXPATHLEN pinskia at gcc dot gnu dot org
2005-06-19 [Bug java/21695] ICE when building gnu-xml.lo in libjava directory pinskia at gcc dot gnu dot org
2005-06-19 [Bug java/19870] gcj -C doesn't generate accessors for private members across nested class boundaries rmathew at gcc dot gnu dot org
2005-06-19 [Bug AWT/21978] GCC 4.0 Awt and Swing problem rmathew at gcc dot gnu dot org
2005-06-18 [Bug libgcj/21949] java.rmi.server.RMIClassLoader.getClassLoader() is private, should be public pinskia at gcc dot gnu dot org
2005-06-18 [Bug AWT/21978] GCC 4.0 Awt and Swing problem abilalh at yahoo dot com
2005-06-18 [Bug java/22113] Buffer overflow in the lexical analyser while reading FP literals rmathew at gcc dot gnu dot org
2005-06-18 [Bug java/22113] New: Buffer overflow in the lexical analyser while reading FP literals rmathew at gcc dot gnu dot org
2005-06-18 [Bug libgcj/22084] [4.1 Regression] Divide_1 test case hangs rmathew at gcc dot gnu dot org
2005-06-18 [Bug java/21045] Anonymous inner class constructor's exceptions can't be caught or thrown mckinlay at redhat dot com
2005-06-18 [Bug java/19674] Empty declaration through semicolon (;) causes compile failure mckinlay at redhat dot com
2005-06-18 [Bug java/18119] Private inner class is visible when it shouldn't be mckinlay at redhat dot com
2005-06-17 [Bug java/21045] Anonymous inner class constructor's exceptions can't be caught or thrown mckinlay at redhat dot com
2005-06-17 [Bug libgcj/22084] [4.1 Regression] Divide_1 test case hangs tromey at gcc dot gnu dot org
2005-06-17 [Bug libgcj/22084] [4.1 Regression] Divide_1 test case hangs pinskia at gcc dot gnu dot org
2005-06-17 [Bug libgcj/22084] Divide_1 test case hangs dnovillo at redhat dot com
2005-06-17 [Bug libgcj/22084] Divide_1 test case hangs rmathew at gcc dot gnu dot org
2005-06-16 [Bug java/22094] gcj compiled executable runtime crash snambi at gmail dot com
2005-06-16 [Bug java/22094] gcj compiled executable runtime crash pinskia at gcc dot gnu dot org
2005-06-16 [Bug java/22094] gcj compiled executable runtime crash pinskia at gcc dot gnu dot org
2005-06-16 [Bug java/22094] New: gcj compiled executable runtime crash snambi at gmail dot com
2005-06-16 [Bug libgcj/22092] libgcj builds zlib subdir even if --with-system-zlib was passed to ./configure pinskia at gcc dot gnu dot org
2005-06-16 [Bug libgcj/22092] New: libgcj builds zlib subdir even if --with-system-zlib was passed to ./configure pluto at agmk dot net
2005-06-16 [Bug java/22091] [meta-bug] missing Java 1.5 support pinskia at gcc dot gnu dot org
2005-06-16 [Bug libgcj/22090] Attempt to compile java1.5 classes with gcj pinskia at gcc dot gnu dot org
2005-06-16 [Bug java/22091] [meta-bug] missing Java 1.5 support pinskia at gcc dot gnu dot org
2005-06-16 [Bug java/22091] New: [meta-bug] missing Java 1.5 support pinskia at gcc dot gnu dot org
2005-06-16 [Bug libgcj/22090] Attempt to compile java1.5 classes with gcj pinskia at gcc dot gnu dot org
2005-06-16 [Bug java/22090] New: Attempt to compile java1.5 classes with gcj Thierry dot Vieville at sophia dot inria dot fr
2005-06-16 [Bug libgcj/19877] sometimes reconfiguring leads to incorrect config.h tromey at gcc dot gnu dot org
2005-06-16 [Bug libgcj/19877] sometimes reconfiguring leads to incorrect config.h bkoz at gcc dot gnu dot org
2005-06-16 [Bug libgcj/19877] sometimes reconfiguring leads to incorrect config.h bkoz at gcc dot gnu dot org
2005-06-15 [Bug libgcj/22084] New: Divide_1 test case hangs tromey at gcc dot gnu dot org
2005-06-15 [Bug java/22011] converting jar files into .so library in win32 tromey at gcc dot gnu dot org
2005-06-15 [Bug libgcj/17536] wrong ClassLoader for int[] cvs-commit at gcc dot gnu dot org
2005-06-15 [Bug java/20697] Invalid Can't find method error on call to super mckinlay at redhat dot com
2005-06-15 [Bug java/22060] javax/swing/text/InternationalFormatter.clone() doesn't compile (GNU Classpath) mckinlay at redhat dot com
2005-06-15 [Bug java/20697] Invalid Can't find method error on call to super mckinlay at redhat dot com
2005-06-15 [Bug java/20697] Invalid Can't find method error on call to super mckinlay at redhat dot com
2005-06-15 [Bug libgcj/14572] System ClassLoader is not set according to java.system.class.loader property tromey at gcc dot gnu dot org
2005-06-15 [Bug libgcj/17536] wrong ClassLoader for int[] tromey at gcc dot gnu dot org
2005-06-15 [Bug java/20715] gcj compilation error tromey at gcc dot gnu dot org
2005-06-15 [Bug java/22060] javax/swing/text/InternationalFormatter.clone() doesn't compile (GNU Classpath) tromey at gcc dot gnu dot org
2005-06-15 [Bug libgcj/21074] Trivial bug in the method getHeaderFieldKey() in the file java/net/protocol/http/HTTPURLConnection.java tromey at gcc dot gnu dot org
2005-06-15 [Bug libgcj/21074] Trivial bug in the method getHeaderFieldKey() in the file java/net/protocol/http/HTTPURLConnection.java cvs-commit at gcc dot gnu dot org
2005-06-15 [Bug java/22060] javax/swing/text/InternationalFormatter.clone() doesn't compile (GNU Classpath) tromey at gcc dot gnu dot org
2005-06-15 [Bug libgcj/21906] hang when invoking abstract method tromey at gcc dot gnu dot org
2005-06-15 [Bug libgcj/21906] hang when invoking abstract method cvs-commit at gcc dot gnu dot org
2005-06-15 [Bug AWT/21978] GCC 4.0 Awt and Swing problem pinskia at gcc dot gnu dot org
2005-06-15 [Bug AWT/21978] GCC 4.0 Awt and Swing problem abilalh at yahoo dot com
2005-06-15 [Bug AWT/21978] GCC 4.0 Awt and Swing problem pinskia at gcc dot gnu dot org
2005-06-15 [Bug AWT/21978] GCC 4.0 Awt and Swing problem abilalh at yahoo dot com
2005-06-14 [Bug libgcj/21906] hang when invoking abstract method tromey at gcc dot gnu dot org
2005-06-14 [Bug libgcj/19877] sometimes reconfiguring leads to incorrect config.h tromey at gcc dot gnu dot org
2005-06-14 [Bug libgcj/19877] sometimes reconfiguring leads to incorrect config.h cvs-commit at gcc dot gnu dot org
2005-06-14 [Bug libgcj/20435] regex pattern compiling bug tromey at gcc dot gnu dot org
2005-06-14 [Bug java/22060] javax/swing/text/InternationalFormatter.clone() doesn't compile (GNU Classpath) rmathew at gcc dot gnu dot org
2005-06-14 [Bug java/22060] javax/swing/text/InternationalFormatter.clone() doesn't compile (GNU Classpath) rmathew at gcc dot gnu dot org
2005-06-14 [Bug java/22060] javax/swing/text/InternationalFormatter.clone() doesn't compile (GNU Classpath) roman at kennke dot org
2005-06-14 [Bug java/22060] New: javax/swing/text/InternationalFormatter.clone() doesn't compile (GNU Classpath) mark at gcc dot gnu dot org
2005-06-13 [Bug libgcj/22036] libjava/jni.cc compilation fix in cvs 2005-06-12 tromey at gcc dot gnu dot org
2005-06-13 [Bug libgcj/22036] libjava/jni.cc compilation fix in cvs 2005-06-12 cvs-commit at gcc dot gnu dot org
2005-06-13 [Bug libgcj/22036] libjava/jni.cc compilation fix in cvs 2005-06-12 tromey at gcc dot gnu dot org
2005-06-13 [Bug java/18131] [meta-bug] inner class problems in java front-end tromey at gcc dot gnu dot org
2005-06-13 [Bug java/21844] [4.1 Regression] miscompilation of LinkedHashMap tromey at gcc dot gnu dot org
2005-06-13 [Bug java/21844] [4.1 Regression] miscompilation of LinkedHashMap cvs-commit at gcc dot gnu dot org
2005-06-13 [Bug java/21844] [4.1 Regression] miscompilation of LinkedHashMap cvs-commit at gcc dot gnu dot org
2005-06-13 [Bug libgcj/22036] libjava/jni.cc compilation fix in cvs 2005-06-12 tromey at gcc dot gnu dot org
2005-06-13 [Bug libgcj/22036] libjava/jni.cc compilation fix in cvs 2005-06-12 pinskia at gcc dot gnu dot org
2005-06-13 [Bug java/20469] gcjh does not rename Java variables named NULL pinskia at gcc dot gnu dot org
2005-06-12 [Bug libgcj/22036] libjava/jni.cc compilation fix in cvs 2005-06-12 pinskia at gcc dot gnu dot org
2005-06-12 [Bug java/22036] libjava/jni.cc compilation fix in cvs 2005-06-12 jserv at kaffe dot org
2005-06-12 [Bug java/22036] New: libjava/jni.cc compilation fix in cvs 2005-06-12 jserv at kaffe dot org
2005-06-11 [Bug java/22011] converting jar files into .so library in win32 pinskia at gcc dot gnu dot org
2005-06-10 [Bug java/22011] New: converting jar files into .so library in win32 snambi at gmail dot com
2005-06-10 [Bug libgcj/9463] add native methods for file name encoding aurelien at aurel32 dot net
2005-06-09 [Bug AWT/21604] strange refresh behavior when moving mouse fitzsim at redhat dot com
2005-06-09 [Bug libgcj/21949] java.rmi.server.RMIClassLoader.getClassLoader() is private, should be public gcc-bugzilla at gcc dot gnu dot org
2005-06-09 [Bug libgcj/21949] java.rmi.server.RMIClassLoader.getClassLoader() is private, should be public gbenson at redhat dot com
2005-06-09 [Bug AWT/21978] GCC 4.0 Awt and Swing problem pinskia at gcc dot gnu dot org
2005-06-09 [Bug AWT/21978] New: GCC 4.0 Awt and Swing problem linux 9.0 abilalh at yahoo dot com
2005-06-09 [Bug libgcj/18266] SIGSEGV in GC_register_finalizer_inner () Hans dot Boehm at hp dot com
2005-06-09 [Bug libgcj/21949] java.rmi.server.RMIClassLoader.getClassLoader() is private, should be public mckinlay at redhat dot com
2005-06-08 [Bug libgcj/18266] SIGSEGV in GC_register_finalizer_inner () ovidr at users dot sourceforge dot net
2005-06-07 [Bug libgcj/21949] java.rmi.server.RMIClassLoader.getClassLoader() is private, should be public pinskia at gcc dot gnu dot org
2005-06-07 [Bug libgcj/21949] java.rmi.server.RMIClassLoader.getClassLoader() is private, should be public gbenson at redhat dot com
2005-06-07 [Bug libgcj/21949] New: java.rmi.server.RMIClassLoader.getClassLoader() is private, should be public gbenson at redhat dot com
2005-06-07 [Bug bootstrap/20155] [4.0 Regression] libgcj build fails with "execvp: /bin/sh: Argument list too long" gerald at pfeifer dot com
2005-06-06 [Bug bootstrap/20155] [4.0/4.1 Regression] libgcj build fails with "execvp: /bin/sh: Argument list too long" ro at gcc dot gnu dot org
2005-06-06 [Bug libgcj/21941] New: NPE in Socket.connect() tromey at gcc dot gnu dot org
2005-06-05 [Bug java/17845] [4.1 Regression] More problems with simple type names as superclasses pinskia at gcc dot gnu dot org
2005-06-05 [Bug libgcj/18220] Test case libjava.lang/Process_3 does not end if "sed" not available pinskia at gcc dot gnu dot org
2005-06-05 [Bug java/21436] imports not remembered for previously compiled files pinskia at gcc dot gnu dot org
2005-06-05 [Bug java/20384] Can't compile oracle test jdbc app with oracle jdbc14.jar shared lib version pinskia at gcc dot gnu dot org
2005-06-05 [Bug java/20384] Can't compile oracle test jdbc app with oracle jdbc14.jar shared lib version pinskia at gcc dot gnu dot org
2005-06-04 [Bug tree-optimization/21855] array bounds checking elimination dnovillo at gcc dot gnu dot org
2005-06-04 [Bug libgcj/21906] hang when invoking abstract method tromey at gcc dot gnu dot org
2005-06-04 [Bug libgcj/21906] hang when invoking abstract method tromey at gcc dot gnu dot org
2005-06-04 [Bug libgcj/21906] New: hang when invoking abstract method tromey at gcc dot gnu dot org
2005-06-03 [Bug java/21844] [4.1 Regression] miscompilation of LinkedHashMap tromey at gcc dot gnu dot org
2005-06-03 [Bug java/21844] [4.1 Regression] miscompilation of LinkedHashMap tromey at gcc dot gnu dot org
2005-06-03 [Bug java/21844] [4.1 Regression] miscompilation of LinkedHashMap pinskia at gcc dot gnu dot org
2005-06-03 [Bug java/21844] miscompilation of LinkedHashMap pinskia at gcc dot gnu dot org
2005-06-03 [Bug java/21844] miscompilation of LinkedHashMap tromey at gcc dot gnu dot org
2005-06-03 [Bug java/21844] miscompilation of LinkedHashMap tromey at gcc dot gnu dot org
2005-06-03 [Bug java/21844] miscompilation of LinkedHashMap tromey at gcc dot gnu dot org
2005-06-03 [Bug libgcj/21892] gnu.* and native code security audit tromey at gcc dot gnu dot org
2005-06-03 [Bug SWING/19860] Swing JOptionPane and multiline texts fitzsim at redhat dot com
2005-06-03 [Bug java/21900] New: debugging regression when debugging libgcj tromey at gcc dot gnu dot org
2005-06-03 [Bug SWING/19862] Swing JTextField fails with StringIndexOutOfBoundsException roman at kennke dot org
2005-06-03 [Bug SWING/19849] Swing: ActionEvent.getActionCommand null roman at kennke dot org
2005-06-03 [Bug SWING/17275] Filechooser implementation roman at kennke dot org
2005-06-03 [Bug SWING/19860] Swing JOptionPane and multiline texts roman at kennke dot org
2005-06-03 [Bug SWING/19861] Swing JOptionPane without parent frame roman at kennke dot org
2005-06-03 [Bug tree-optimization/21855] array bounds checking elimination dnovillo at gcc dot gnu dot org
2005-06-03 [Bug java/21856] null pointer check elimination dnovillo at gcc dot gnu dot org
2005-06-03 [Bug tree-optimization/21855] array bounds checking elimination dnovillo at gcc dot gnu dot org
2005-06-03 [Bug libgcj/21892] gnu.* and native code security audit konqueror at gmx dot de
2005-06-03 [Bug java/21722] gcj miscompiles accesses to static final vars with indirect dispatch tromey at gcc dot gnu dot org
2005-06-03 [Bug java/21722] gcj miscompiles accesses to static final vars with indirect dispatch tromey at gcc dot gnu dot org
2005-06-03 [Bug java/21722] gcj miscompiles accesses to static final vars with indirect dispatch cvs-commit at gcc dot gnu dot org
2005-06-03 [Bug java/21722] gcj miscompiles accesses to static final vars with indirect dispatch cvs-commit at gcc dot gnu dot org
2005-06-02 [Bug libgcj/13603] [meta-bug] Java security model tracking PR tromey at gcc dot gnu dot org
2005-06-02 [Bug libgcj/21893] New: class loading and verifier audit tromey at gcc dot gnu dot org
2005-06-02 [Bug libgcj/13603] [meta-bug] Java security model tracking PR tromey at gcc dot gnu dot org
2005-06-02 [Bug libgcj/21892] New: gnu.* and native code security audit tromey at gcc dot gnu dot org
2005-06-02 [Bug libgcj/13603] [meta-bug] Java security model tracking PR tromey at gcc dot gnu dot org
2005-06-02 [Bug libgcj/21891] New: must audit libgcj for required SecurityManager calls tromey at gcc dot gnu dot org
2005-06-02 [Bug libgcj/13603] [meta-bug] Java security model tracking PR tromey at gcc dot gnu dot org
2005-06-02 [Bug libgcj/21890] New: SecurityManager is incomplete tromey at gcc dot gnu dot org
2005-06-02 [Bug AWT/21882] Wrong Frame size if a frame has been created previously sven at physto dot se
2005-06-02 [Bug AWT/21882] New: Wrong Frame size if a frame has been created previously sven at physto dot se
2005-06-02 [Bug AWT/19838] Repaint-Loop due to setBackground() sven at physto dot se
2005-06-02 [Bug SWING/21880] javax.swing.text.JTextComponent has no read() method pinskia at gcc dot gnu dot org
2005-06-02 [Bug libgcj/21880] New: javax.swing.text.JTextComponent has no read() method gbenson at redhat dot com
2005-06-02 [Bug libgcj/21869] We should to use StringBuilder instead of StringBuffer where appropriate. tromey at gcc dot gnu dot org
2005-06-01 [Bug libgcj/21869] New: We should to use StringBuilder instead of StringBuffer where appropriate. daney at gcc dot gnu dot org
2005-06-01 [Bug libgcj/20435] regex pattern compiling bug cvs-commit at gcc dot gnu dot org
2005-06-01 [Bug java/21722] gcj miscompiles accesses to static final vars with indirect dispatch tromey at gcc dot gnu dot org
2005-06-01 [Bug java/1259] string constants not handled properly tromey at gcc dot gnu dot org
2005-06-01 [Bug java/21722] gcj miscompiles accesses to static final vars with indirect dispatch matz at suse dot de
2005-06-01 [Bug tree-optimization/21855] array bounds checking elimination pinskia at gcc dot gnu dot org
2005-06-01 [Bug java/21722] gcj miscompiles accesses to static final vars with indirect dispatch tromey at gcc dot gnu dot org
2005-06-01 [Bug java/21856] null pointer check elimination pinskia at gcc dot gnu dot org
2005-06-01 [Bug java/21868] New: [4.1 regression] can't build mauve tromey at gcc dot gnu dot org
2005-06-01 [Bug libgcj/20169] Serialization: readResolve does not work tromey at gcc dot gnu dot org
2005-06-01 [Bug libgcj/21785] [4.1 regression] ClassNotFound during deserialization tromey at gcc dot gnu dot org
2005-06-01 [Bug libgcj/21785] [4.1 regression] ClassNotFound during deserialization cvs-commit at gcc dot gnu dot org
2005-06-01 [Bug libgcj/21867] failling to build libjava pinskia at gcc dot gnu dot org
2005-06-01 [Bug libgcj/21867] failling to build libjava jlm_devel at laposte dot net
2005-06-01 [Bug libgcj/21867] failling to build libjava pinskia at gcc dot gnu dot org
2005-06-01 [Bug java/21867] New: failling to build libjava jlm_devel at laposte dot net
2005-06-01 [Bug libgcj/21785] [4.1 regression] ClassNotFound during deserialization tromey at gcc dot gnu dot org
2005-06-01 [Bug libgcj/21753] String.substring sharing heuristic should be improved tromey at gcc dot gnu dot org
2005-06-01 [Bug libgcj/21753] String.substring sharing heuristic should be improved cvs-commit at gcc dot gnu dot org
2005-06-01 [Bug libgcj/21753] String.substring sharing heuristic should be improved cvs-commit at gcc dot gnu dot org
2005-06-01 [Bug AWT/20630] Image APIs should use BufferedImage exclusively sven at physto dot se
2005-06-01 [Bug libgcj/21753] String.substring sharing heuristic should be improved tromey at gcc dot gnu dot org
2005-06-01 [Bug java/21856] New: null pointer check elimination tromey at gcc dot gnu dot org
2005-06-01 [Bug java/21855] New: array bounds checking elimination tromey at gcc dot gnu dot org
2005-06-01 [Bug libgcj/21798] Generational garbage collector? tromey at gcc dot gnu dot org
2005-05-31 [Bug java/21844] New: miscompilation of LinkedHashMap tromey at gcc dot gnu dot org
2005-05-31 [Bug libgcj/21754] ./libtool: /mingw/bin/ar: Invalid argument Christopher dot Dawes at retail-logic dot com
2005-05-31 [Bug libgcj/21754] ./libtool: /mingw/bin/ar: Invalid argument dannysmith at users dot sourceforge dot net
2005-05-30 [Bug fastjar/21822] fastjar/jartool.c's usage of MAXPATHLEN joseph at codesourcery dot com
2005-05-30 [Bug libgcj/21821] MAXPATHLEN usage in libjava ams at gnu dot org
2005-05-30 [Bug libgcj/21821] MAXPATHLEN usage in libjava cvs-commit at gcc dot gnu dot org
2005-05-30 [Bug libgcj/21821] MAXPATHLEN usage in libjava mckinlay at redhat dot com
2005-05-30 [Bug AWT/17254] [java-gui-branch] Hang when resizing AWT window on Alpha fitzsim at redhat dot com
2005-05-30 [Bug fastjar/20941] Incorrect case for META-INF with fastjar pinskia at gcc dot gnu dot org
2005-05-30 [Bug fastjar/13020] zip-style comments pinskia at gcc dot gnu dot org
2005-05-30 [Bug libgcj/21821] MAXPATHLEN usage in libjava pinskia at gcc dot gnu dot org
2005-05-30 [Bug fastjar/21822] fastjar/jartool.c's usage of MAXPATHLEN pinskia at gcc dot gnu dot org
2005-05-30 [Bug fastjar/21822] fastjar/jartool.c's usage of MAXPATHLEN pinskia at gcc dot gnu dot org
2005-05-30 [Bug libgcj/21822] fastjar/jartool.c's usage of MAXPATHLEN pinskia at gcc dot gnu dot org
2005-05-30 [Bug java/21822] New: fastjar/jartool.c's usage of MAXPATHLEN ams at gnu dot org
2005-05-30 [Bug libgcj/21821] MAXPATHLEN usage in libjava schwinge-bugzilla-gcc dot gnu dot org at nic-nac-project dot de
2005-05-30 [Bug libgcj/21821] MAXPATHLEN usage in libjava ams at gnu dot org
2005-05-30 [Bug libgcj/21821] MAXPATHLEN usage in natFileChannelPosix.cc pinskia at gcc dot gnu dot org
2005-05-30 [Bug libgcj/21821] MAXPATHLEN usage in natFileChannelImpl.cc pinskia at gcc dot gnu dot org
2005-05-30 [Bug java/21821] New: MAXPATHLEN usage in [gcc]/libjava/gnu/java/nio/channels/natFileChannelImpl.cc ams at gnu dot org
2005-05-30 [Bug java/21818] "Methods can't be overridden to be more private." pinskia at gcc dot gnu dot org
2005-05-30 [Bug SWING/21818] "Methods can't be overridden to be more private." pinskia at gcc dot gnu dot org
2005-05-30 [Bug java/21818] New: "Methods can't be overridden to be more private." timo dot lindfors at iki dot fi
2005-05-30 [Bug libgcj/20273] LinkedHashMap breaks linked list when access() is called tromey at gcc dot gnu dot org
2005-05-30 [Bug libgcj/20273] LinkedHashMap breaks linked list when access() is called cvs-commit at gcc dot gnu dot org
2005-05-30 [Bug libgcj/20273] LinkedHashMap breaks linked list when access() is called cvs-commit at gcc dot gnu dot org
2005-05-29 [Bug java/21695] ICE when building gnu-xml.lo in libjava directory brian at dessent dot net
2005-05-29 [Bug libgcj/13708] static java program crashes at startup, UTF-8 environment gerrit at gcc dot gnu dot org
2005-05-28 [Bug libgcj/20435] regex pattern compiling bug ziga at gcc dot gnu dot org
2005-05-28 [Bug libgcj/20435] regex pattern compiling bug ziga at gcc dot gnu dot org
2005-05-28 [Bug libgcj/21798] New: Generational garbage collector? greenrd at greenrd dot org
2005-05-28 [Bug libgcj/13708] static java program crashes at startup, UTF-8 environment pinskia at gcc dot gnu dot org
2005-05-28 [Bug java/21793] java doesn't work with Cygwin pinskia at gcc dot gnu dot org
2005-05-28 [Bug java/21793] java doesn't work with Cygwin gerrit at gcc dot gnu dot org
2005-05-28 [Bug java/21793] New: java doesn't work with Cygwin gerrit at gcc dot gnu dot org
2005-05-27 [Bug libgcj/21775] NPE in java::util::logging::Logger::getCallerStackFrame caused by incorrect hand-optimization tromey at gcc dot gnu dot org
2005-05-27 [Bug libgcj/21775] NPE in java::util::logging::Logger::getCallerStackFrame caused by incorrect hand-optimization cvs-commit at gcc dot gnu dot org
2005-05-27 [Bug libgcj/21775] NPE in java::util::logging::Logger::getCallerStackFrame caused by incorrect hand-optimization tromey at gcc dot gnu dot org
2005-05-27 [Bug libgcj/21775] NPE in java::util::logging::Logger::getCallerStackFrame caused by incorrect hand-optimization greenrd at greenrd dot org
2005-05-27 [Bug libgcj/21785] [4.1 regression] ClassNotFound during deserialization pinskia at gcc dot gnu dot org
2005-05-27 [Bug libgcj/21785] [regression] ClassNotFound during deserialization bonniot at users dot sf dot net
2005-05-27 [Bug libgcj/20169] Serialization: readResolve does not work bonniot at users dot sf dot net
2005-05-27 [Bug libgcj/21785] New: [regression] ClassNotFound during deserialization bonniot at users dot sf dot net
2005-05-27 [Bug middle-end/21779] unknown bug pinskia at gcc dot gnu dot org
2005-05-27 [Bug middle-end/21779] unknown bug pinskia at gcc dot gnu dot org
2005-05-27 [Bug libgcj/20169] Serialization: readResolve does not work bonniot at users dot sf dot net
2005-05-27 [Bug java/21779] New: unknown bug slawchod at wp dot pl
2005-05-27 [Bug java/19870] gcj -C doesn't generate accessors for private members across nested class boundaries rmathew at gcc dot gnu dot org
2005-05-27 [Bug java/19870] gcj -C doesn't generate accessors for private members across nested class boundaries cvs-commit at gcc dot gnu dot org
2005-05-27 [Bug java/19870] gcj -C doesn't generate accessors for private members across nested class boundaries cvs-commit at gcc dot gnu dot org
2005-05-27 [Bug libgcj/20169] Serialization: readResolve does not work pinskia at gcc dot gnu dot org
2005-05-27 [Bug libgcj/21775] NPE in java::util::logging::Logger::getCallerStackFrame caused by incorrect hand-optimization greenrd at greenrd dot org
2005-05-27 [Bug java/20215] gcj does not accept classes with same name fields pinskia at gcc dot gnu dot org
2005-05-27 [Bug libgcj/13137] [eclipse 3.0] need java.nio file locking pinskia at gcc dot gnu dot org
2005-05-27 [Bug libgcj/21775] NPE in java::util::logging::Logger::getCallerStackFrame caused by incorrect hand-optimization greenrd at greenrd dot org
2005-05-26 [Bug libgcj/13806] linking libgcj.so requires excessive time/memory pinskia at gcc dot gnu dot org
2005-05-26 [Bug libgcj/21775] New: NPE in java::util::logging::Logger::getCallerStackFrame caused by incorrect hand-optimization greenrd at greenrd dot org
2005-05-26 [Bug java/21428] [3.4/4.0/4.1 Regression] bogus warning: unused parameter 'this' pinskia at gcc dot gnu dot org
2005-05-26 [Bug java/19870] gcj -C doesn't generate accessors for private members across nested class boundaries rmathew at gcc dot gnu dot org
2005-05-26 [Bug java/9861] method name mangling ignores return type rmathew at gcc dot gnu dot org
2005-05-25 [Bug libgcj/21692] [4.1 Regression] unexpected java.lang.NoClassDefFoundError rth at gcc dot gnu dot org
2005-05-25 [Bug libgcj/21692] [4.1 Regression] unexpected java.lang.NoClassDefFoundError cvs-commit at gcc dot gnu dot org
2005-05-25 [Bug libgcj/21692] [4.1 Regression] unexpected java.lang.NoClassDefFoundError cvs-commit at gcc dot gnu dot org
2005-05-25 [Bug libgcj/20699] gij -ms segfaults fitzsim at redhat dot com
2005-05-25 [Bug libgcj/20699] gij -ms segfaults fitzsim at redhat dot com
2005-05-25 [Bug libgcj/21754] ./libtool: /mingw/bin/ar: Invalid argument pinskia at gcc dot gnu dot org
2005-05-25 [Bug libgcj/21753] String.substring sharing heuristic should be improved pinskia at gcc dot gnu dot org
2005-05-25 [Bug libgcj/21736] MessageFormat("{0,time,medium}") fails tromey at gcc dot gnu dot org
2005-05-25 [Bug libgcj/21736] MessageFormat("{0,time,medium}") fails cvs-commit at gcc dot gnu dot org
2005-05-25 [Bug libgcj/21703] hang when rapidly calling String.intern() tromey at gcc dot gnu dot org
2005-05-25 [Bug libgcj/21703] hang when rapidly calling String.intern() cvs-commit at gcc dot gnu dot org
2005-05-25 [Bug AWT/21649] errors when exiting gcjappletviewer tromey at gcc dot gnu dot org
2005-05-25 [Bug AWT/21604] strange refresh behavior when moving mouse tromey at gcc dot gnu dot org
2005-05-25 [Bug libgcj/14781] disable bytecode verification for bootclasspath tromey at gcc dot gnu dot org
2005-05-25 [Bug java/21754] New: ./libtool: /mingw/bin/ar: Invalid argument Christopher dot Dawes at retail-logic dot com
2005-05-25 [Bug java/15735] Should be able to disable bytecode verification tromey at gcc dot gnu dot org
2005-05-25 [Bug libgcj/21753] New: String.substring sharing heuristic should be improved mckinlay at redhat dot com
2005-05-25 [Bug libgcj/21736] MessageFormat("{0,time,medium}") fails gbenson at redhat dot com
2005-05-25 [Bug java/19870] gcj -C doesn't generate accessors for private members across nested class boundaries rmathew at gcc dot gnu dot org
2005-05-25 [Bug AWT/21747] JAWT_X11DrawingSurfaceInfo missing depth field pinskia at gcc dot gnu dot org
2005-05-25 [Bug libgcj/21747] New: JAWT_X11DrawingSurfaceInfo missing depth field green at redhat dot com
2005-05-25 [Bug AWT/21660] FileDialog.SAVE broken fitzsim at redhat dot com
2005-05-25 [Bug AWT/21649] errors when exiting gcjappletviewer fitzsim at redhat dot com
2005-05-25 [Bug AWT/21604] strange refresh behavior when moving mouse fitzsim at redhat dot com
2005-05-25 [Bug AWT/21600] race condition with java applet fitzsim at redhat dot com
2005-05-25 [Bug AWT/21599] transparent images don't work fitzsim at redhat dot com
2005-05-25 [Bug AWT/21598] rendering problem with button text fitzsim at redhat dot com
2005-05-24 [Bug libgcj/21692] [4.1 Regression] unexpected java.lang.NoClassDefFoundError rth at gcc dot gnu dot org
2005-05-24 [Bug libgcj/21741] Need configure option to set java.library.path pinskia at gcc dot gnu dot org
2005-05-24 [Bug libgcj/21741] New: Need configure option to set java.library.path green at redhat dot com
2005-05-24 [Bug libgcj/21736] MessageFormat("{0,time,medium}") fails tromey at gcc dot gnu dot org
2005-05-24 [Bug libgcj/21736] MessageFormat("{0,time,medium}") fails cvs-commit at gcc dot gnu dot org
2005-05-24 [Bug libgcj/21692] [4.1 Regression] unexpected java.lang.NoClassDefFoundError pinskia at gcc dot gnu dot org
2005-05-24 [Bug libgcj/21736] MessageFormat("{0,time,medium}") fails tromey at gcc dot gnu dot org
2005-05-24 [Bug libgcj/21736] MessageFormat("{0,time,medium}") fails gbenson at redhat dot com
2005-05-24 [Bug libgcj/21736] MessageFormat("{0,time,medium}") fails gbenson at redhat dot com
2005-05-24 [Bug libgcj/21736] New: MessageFormat("{0,time,medium}") fails gbenson at redhat dot com
2005-05-23 [Bug libgcj/21714] [4.0/4.1 Regression] libjava bootstrap failure in java/lang/natConcreteProcess.cc cato at df dot lth dot se
2005-05-23 [Bug libgcj/21692] [4.1 Regression] unexpected java.lang.NoClassDefFoundError pinskia at gcc dot gnu dot org
2005-05-23 [Bug libgcj/21692] unexpected java.lang.NoClassDefFoundError rguenth at gcc dot gnu dot org
2005-05-23 [Bug libgcj/21692] unexpected java.lang.NoClassDefFoundError rth at gcc dot gnu dot org
2005-05-23 [Bug libgcj/21714] [4.0/4.1 Regression] libjava bootstrap failure in java/lang/natConcreteProcess.cc tromey at gcc dot gnu dot org
2005-05-23 [Bug java/21722] gcj miscompiles accesses to static final vars with indirect dispatch pinskia at gcc dot gnu dot org
2005-05-23 [Bug libgcj/21725] use new sync built-ins pinskia at gcc dot gnu dot org
2005-05-23 [Bug libgcj/21725] use new sync built-ins pinskia at gcc dot gnu dot org
2005-05-23 [Bug libgcj/21725] New: use new sync built-ins tromey at gcc dot gnu dot org
2005-05-23 [Bug java/21722] gcj miscompiles accesses to static final vars with indirect dispatch pinskia at gcc dot gnu dot org
2005-05-23 [Bug java/21722] gcj miscompiles accesses to static final vars with indirect dispatch skh at suse dot de
2005-05-23 [Bug java/21722] gcj miscompiles accesses to static final vars with indirect dispatch matz at suse dot de
2005-05-23 [Bug java/21722] New: gcj miscompiles accesses to static final vars with indirect dispatch matz at suse dot de
2005-05-23 [Bug libgcj/21714] [4.0/4.1 Regression] libjava bootstrap failure in java/lang/natConcreteProcess.cc daney at gcc dot gnu dot org
2005-05-23 [Bug libgcj/21714] [4.0/4.1 Regression] libjava bootstrap failure in java/lang/natConcreteProcess.cc pinskia at gcc dot gnu dot org
2005-05-23 [Bug libgcj/21714] libjava bootstrap failure in java/lang/natConcreteProcess.cc kristerw at netbsd dot org
2005-05-23 [Bug java/19870] gcj -C doesn't generate accessors for private members across nested class boundaries rmathew at gcc dot gnu dot org
2005-05-22 [Bug libgcj/21714] libjava bootstrap failure in java/lang/natConcreteProcess.cc pinskia at gcc dot gnu dot org
2005-05-22 [Bug libgcj/21714] libjava bootstrap failure in java/lang/natConcreteProcess.cc pinskia at gcc dot gnu dot org
2005-05-22 [Bug java/21714] New: libjava bootstrap failure in java/lang/natConcreteProcess.cc cato at df dot lth dot se
2005-05-22 [Bug AWT/21598] rendering problem with button text tromey at gcc dot gnu dot org
2005-05-22 [Bug java/21697] gcj segfaults with Jabref.jar tromey at gcc dot gnu dot org
2005-05-22 [Bug libgcj/21703] hang when rapidly calling String.intern() tromey at gcc dot gnu dot org
2005-05-22 [Bug libgcj/21703] hang when rapidly calling String.intern() cvs-commit at gcc dot gnu dot org
2005-05-22 [Bug libgcj/21703] hang when rapidly calling String.intern() tromey at gcc dot gnu dot org
2005-05-21 [Bug libgcj/21703] hang when rapidly calling String.intern() tromey at gcc dot gnu dot org
2005-05-21 [Bug libgcj/21703] hang when rapidly calling String.intern() tromey at gcc dot gnu dot org
2005-05-21 [Bug libgcj/21703] hang when rapidly calling String.intern() pinskia at gcc dot gnu dot org
2005-05-21 [Bug libgcj/21703] hang when rapidly calling String.intern() pinskia at gcc dot gnu dot org
2005-05-21 [Bug java/21703] New: hang when rapidly calling String.intern() debian-gcc at lists dot debian dot org
2005-05-21 [Bug java/21697] gcj segfaults with Jabref.jar pinskia at gcc dot gnu dot org
2005-05-21 [Bug java/21697] New: gcj segfaults with Jabref.jar debian-gcc at lists dot debian dot org
2005-05-21 [Bug java/21662] [3.4/4.0/4.1 Regression] Fields in interfaces not optimized when read from *.class, but optimized when read from *.java pinskia at gcc dot gnu dot org
2005-05-21 [Bug java/21662] [3.4/4.0/4.1 Regression] Fields in interfaces not optimized when read from *.class, but optimized when read from *.java pinskia at gcc dot gnu dot org
2005-05-21 [Bug java/21695] New: ICE when building gnu-xml.lo in libjava directory brian at dessent dot net
2005-05-21 [Bug libgcj/21692] New: unexpected java.lang.NoClassDefFoundError kkojima at gcc dot gnu dot org
2005-05-20 [Bug libgcj/21637] URL.openStream doesn't throw a FileNotFoundException with some urls tromey at gcc dot gnu dot org
2005-05-20 [Bug libgcj/21637] URL.openStream doesn't throw a FileNotFoundException with some urls cvs-commit at gcc dot gnu dot org
2005-05-20 [Bug libgcj/19877] sometimes reconfiguring leads to incorrect config.h tromey at gcc dot gnu dot org
2005-05-19 [Bug java/19870] gcj -C doesn't generate accessors for private members in inner class rmathew at gcc dot gnu dot org
2005-05-19 [Bug java/17255] [meta-bug] Fixes should be back-ported to 3.4 branch mckinlay at redhat dot com
2005-05-19 [Bug java/17255] [meta-bug] Fixes should be back-ported to 3.4 branch tromey at gcc dot gnu dot org
2005-05-19 [Bug java/17255] [meta-bug] Fixes should be back-ported to 3.4 branch mmitchel at gcc dot gnu dot org
2005-05-19 [Bug java/21540] switch stmt problem falk at debian dot org
2005-05-19 [Bug java/21540] switch stmt problem hchapman-gcc-bugs at 3gfp dot com
2005-05-19 [Bug java/21662] New: Fields in interfaces not optimized when read from *.class, but optimized when read from *.java jakub at gcc dot gnu dot org
2005-05-19 [Bug java/17845] [4.1 Regression] More problems with simple type names as superclasses cvs-commit at gcc dot gnu dot org
2005-05-19 [Bug java/17845] [4.1 Regression] More problems with simple type names as superclasses bonzini at gcc dot gnu dot org
2005-05-19 [Bug AWT/21660] FileDialog.SAVE broken hendrich at informatik dot uni-hamburg dot de
2005-05-19 [Bug AWT/21660] FileDialog.SAVE broken hendrich at informatik dot uni-hamburg dot de
2005-05-19 [Bug AWT/21660] New: FileDialog.SAVE broken hendrich at informatik dot uni-hamburg dot de
2005-05-19 [Bug libgcj/21637] URL.openStream doesn't throw a FileNotFoundException with some urls tromey at gcc dot gnu dot org
2005-05-18 [Bug AWT/21649] New: errors when exiting gcjappletviewer tromey at gcc dot gnu dot org
2005-05-18 [Bug libgcj/19729] libgcj DSASignature.java null pointer exception pinskia at gcc dot gnu dot org
2005-05-18 [Bug libgcj/19729] libgcj DSASignature.java null pointer exception cvs-commit at gcc dot gnu dot org
2005-05-18 [Bug libgcj/19729] libgcj DSASignature.java null pointer exception cvs-commit at gcc dot gnu dot org
2005-05-18 [Bug libgcj/18220] Test case libjava.lang/Process_3 does not end if "sed" not available daney at gcc dot gnu dot org
2005-05-18 [Bug libgcj/18220] Test case libjava.lang/Process_3 does not end if "sed" not available cvs-commit at gcc dot gnu dot org
2005-05-18 [Bug libgcj/18220] Test case libjava.lang/Process_3 does not end if "sed" not available cvs-commit at gcc dot gnu dot org
2005-05-17 [Bug libgcj/21637] New: URL.openStream doesn't throw a FileNotFoundException with some urls bkonrath at redhat dot com
2005-05-17 [Bug SWING/21635] New: GLib-GObject-WARNING with jython sbodomerle at gmail dot com
2005-05-17 [Bug libgcj/18266] SIGSEGV in GC_register_finalizer_inner () pinskia at gcc dot gnu dot org
2005-05-17 [Bug libgcj/18893] null pointer exception in the Logger.getCallerStackFrame() daney at gcc dot gnu dot org
2005-05-17 [Bug libgcj/18266] SIGSEGV in GC_register_finalizer_inner () daney at gcc dot gnu dot org
2005-05-17 [Bug libgcj/18220] Test case libjava.lang/Process_3 does not end if "sed" not available daney at gcc dot gnu dot org
2005-05-17 [Bug java/21624] java source files cannot be compiled to bcabi [indirect dispatch] aph at gcc dot gnu dot org
2005-05-17 [Bug java/20088] -findirect-dispatch: error: final field 'text' may not have been initialized aph at gcc dot gnu dot org
2005-05-17 [Bug java/20088] -findirect-dispatch: error: final field 'text' may not have been initialized aph at gcc dot gnu dot org
2005-05-17 [Bug java/21624] java source files cannot be compiled to bcabi [indirect dispatch] aph at gcc dot gnu dot org
2005-05-17 [Bug java/18945] gcj ICE with -findirect-dispatch aph at gcc dot gnu dot org
2005-05-17 [Bug java/20088] -findirect-dispatch: error: final field 'text' may not have been initialized aph at gcc dot gnu dot org
2005-05-17 [Bug java/21624] java source files cannot be compiled to bcabi [indirect dispatch] aph at gcc dot gnu dot org
2005-05-17 [Bug bootstrap/20155] [4.0/4.1 Regression] libgcj build fails with "execvp: /bin/sh: Argument list too long" bonzini at gcc dot gnu dot org
2005-05-17 [Bug bootstrap/20155] [4.0/4.1 Regression] libgcj build fails with "execvp: /bin/sh: Argument list too long" bonzini at gcc dot gnu dot org
2005-05-17 [Bug java/21624] New: java files cannot be compiled to bcabi bonzini at gcc dot gnu dot org
2005-05-17 [Bug libgcj/21140] [4.0 only] Charset.encode and Charset.decode broken tromey at gcc dot gnu dot org
2005-05-17 [Bug libgcj/21140] [4.0 only] Charset.encode and Charset.decode broken cvs-commit at gcc dot gnu dot org
2005-05-16 [Bug AWT/20790] libjawt.so must be renamed fitzsim at redhat dot com
2005-05-16 [Bug libgcj/21606] java.net.URI fails to decode lowercase hex codes tromey at gcc dot gnu dot org
2005-05-16 [Bug libgcj/21606] java.net.URI fails to decode lowercase hex codes cvs-commit at gcc dot gnu dot org
2005-05-16 [Bug libgcj/21606] java.net.URI fails to decode lowercase hex codes cvs-commit at gcc dot gnu dot org
2005-05-16 [Bug libgcj/21606] java.net.URI fails to decode lowercase hex codes tromey at gcc dot gnu dot org
2005-05-16 [Bug libgcj/20504] java.util.regex implementation doesn't support quoting constructs ziga dot mahkovec at klika dot si
2005-05-16 [Bug libgcj/20504] java.util.regex implementation doesn't support quoting constructs tromey at gcc dot gnu dot org
2005-05-16 [Bug libgcj/20504] java.util.regex implementation doesn't support quoting constructs cvs-commit at gcc dot gnu dot org
2005-05-16 [Bug libgcj/20504] java.util.regex implementation doesn't support quoting constructs cvs-commit at gcc dot gnu dot org
2005-05-16 [Bug libgcj/20504] java.util.regex implementation doesn't support quoting constructs mark at gcc dot gnu dot org
2005-05-16 [Bug java/20044] Wrong method call semantics (maybe instanceof/invokespecial) aph at gcc dot gnu dot org
2005-05-16 [Bug java/21428] [3.4/4.0/4.1 Regression] bogus warning: unused parameter 'this' aph at gcc dot gnu dot org
2005-05-16 [Bug libgcj/21606] java.net.URI fails to decode lowercase hex codes brion at pobox dot com
2005-05-16 [Bug libgcj/21606] New: java.net.URI fails to decode lowercase hex codes brion at pobox dot com
2005-05-16 [Bug AWT/21604] New: strange refresh behavior when moving mouse tromey at gcc dot gnu dot org
2005-05-16 [Bug AWT/21600] New: race condition with java applet tromey at gcc dot gnu dot org
2005-05-16 [Bug AWT/21599] New: transparent images don't work tromey at gcc dot gnu dot org
2005-05-16 [Bug AWT/21598] New: rendering problem with button text tromey at gcc dot gnu dot org
2005-05-15 [Bug java/21519] ICE in generate_bytecode_conditional, at java/jcf-write.c:1337 tromey at gcc dot gnu dot org
2005-05-15 [Bug java/21519] ICE in generate_bytecode_conditional, at java/jcf-write.c:1337 cvs-commit at gcc dot gnu dot org
2005-05-15 [Bug java/21519] ICE in generate_bytecode_conditional, at java/jcf-write.c:1337 cvs-commit at gcc dot gnu dot org
2005-05-14 [Bug libgcj/21557] Hash synchronization: Thread.interrupt() can make _Jv_MonitorEnter hang pinskia at gcc dot gnu dot org
2005-05-14 [Bug libgcj/21557] Hash synchronization: Thread.interrupt() can make _Jv_MonitorEnter hang mckinlay at redhat dot com
2005-05-14 [Bug libgcj/21557] Hash synchronization: Thread.interrupt() can make _Jv_MonitorEnter hang cvs-commit at gcc dot gnu dot org
2005-05-14 [Bug libgcj/21557] Hash synchronization: Thread.interrupt() can make _Jv_MonitorEnter hang cvs-commit at gcc dot gnu dot org
2005-05-13 [Bug java/9369] wrong bytecode generated for static inner class with private constructor tromey at gcc dot gnu dot org
2005-05-13 [Bug libgcj/21557] Hash synchronization: Thread.interrupt() can make _Jv_MonitorEnter hang pinskia at gcc dot gnu dot org
2005-05-13 [Bug java/21519] ICE in generate_bytecode_conditional, at java/jcf-write.c:1337 tromey at gcc dot gnu dot org
2005-05-13 [Bug java/21519] ICE in generate_bytecode_conditional, at java/jcf-write.c:1337 tromey at gcc dot gnu dot org
2005-05-13 [Bug libgcj/21557] New: Hash synchronization: Thread.interrupt() can make _Jv_MonitorEnter hang mckinlay at redhat dot com
2005-05-13 [Bug java/21519] ICE in generate_bytecode_conditional, at java/jcf-write.c:1337 tromey at gcc dot gnu dot org
2005-05-13 [Bug java/21519] ICE in generate_bytecode_conditional, at java/jcf-write.c:1337 tromey at gcc dot gnu dot org
2005-05-13 [Bug libgcj/21524] Cancelling a TimerTask puts Timer binary heap in inconsistent state tromey at gcc dot gnu dot org
2005-05-12 [Bug java/21540] switch stmt problem pinskia at gcc dot gnu dot org
2005-05-12 [Bug java/21540] switch stmt problem green at redhat dot com
2005-05-12 [Bug java/21540] New: switch stmt problem green at redhat dot com
2005-05-12 [Bug libgcj/21524] Cancelling a TimerTask puts Timer binary heap in inconsistent state jradel at 2wire dot com
2005-05-12 [Bug java/17845] [4.1 Regression] More problems with simple type names as superclasses bonzini at gcc dot gnu dot org
2005-05-12 [Bug libffi/21285] gij fails to handle NullPointerException exception pinskia at gcc dot gnu dot org
2005-05-12 [Bug libgcj/21285] gij fails to handle NullPointerException exception tsv at solvo dot ru
2005-05-12 [Bug java/17845] [4.1 Regression] More problems with simple type names as superclasses bonzini at gcc dot gnu dot org
2005-05-12 [Bug java/9369] wrong bytecode generated for static inner class with private constructor pinskia at gcc dot gnu dot org
2005-05-11 [Bug libgcj/21524] Cancelling a TimerTask puts Timer binary heap in inconsistent state pinskia at gcc dot gnu dot org
2005-05-11 [Bug java/21524] Cancelling a TimerTask puts Timer binary heap in inconsistent state jradel at 2wire dot com
2005-05-11 [Bug java/21524] New: Cancelling a TimerTask puts Timer binary heap in inconsistent state jradel at 2wire dot com
2005-05-11 [Bug java/21519] ICE in generate_bytecode_conditional, at java/jcf-write.c:1337 pinskia at gcc dot gnu dot org
2005-05-11 [Bug java/21519] New: ICE in generate_bytecode_conditional, pluto at agmk dot net
2005-05-11 [Bug java/21517] Bytecode -> native code mis-compilation overholt at redhat dot com
2005-05-11 [Bug java/21517] Bytecode -> native code mis-compilation pinskia at gcc dot gnu dot org
2005-05-11 [Bug java/21517] Bytecode -> native code mis-compilation overholt at redhat dot com
2005-05-11 [Bug java/21517] Bytecode -> native code mis-compilation overholt at redhat dot com
2005-05-11 [Bug java/21517] Bytecode -> native code mis-compilation overholt at redhat dot com
2005-05-11 [Bug java/21517] Bytecode -> native code mis-compilation overholt at redhat dot com
2005-05-11 [Bug java/21517] New: Bytecode -> native code mis-compilation overholt at redhat dot com
2005-05-11 [Bug java/17845] [4.1 Regression] More problems with simple type names as superclasses paolo dot bonzini at lu dot unisi dot ch
2005-05-11 [Bug java/17845] [4.1 Regression] More problems with simple type names as superclasses pinskia at gcc dot gnu dot org
2005-05-11 [Bug java/17845] [4.1 Regression] More problems with simple type names as superclasses bonzini at gcc dot gnu dot org
2005-05-11 [Bug java/17845] [4.1 Regression] More problems with simple type names as superclasses bonzini at gcc dot gnu dot org
2005-05-11 [Bug java/17845] [4.1 Regression] More problems with simple type names as superclasses bonzini at gcc dot gnu dot org
2005-05-11 [Bug java/17845] [4.1 Regression] More problems with simple type names as superclasses bonzini at gcc dot gnu dot org
2005-05-11 [Bug java/18281] Backslashes in CLASSPATH cause jc1 to hang pinskia at gcc dot gnu dot org
2005-05-10 [Bug java/12725] [meta-bug] gcj does not conform to Binary Compatibility specification tromey at gcc dot gnu dot org
2005-05-10 [Bug java/19285] Interfaces not initialized by static field access tromey at gcc dot gnu dot org
2005-05-10 [Bug java/21418] Order of source files matters when compiling bonzini at gcc dot gnu dot org
2005-05-10 [Bug java/21436] imports not remembered for previously compiled files bonzini at gcc dot gnu dot org
2005-05-10 [Bug java/21436] imports not remembered for previously compiled files cvs-commit at gcc dot gnu dot org
2005-05-09 [Bug java/19285] Interfaces not initialized by static field access cvs-commit at gcc dot gnu dot org
2005-05-09 [Bug libffi/21285] gij fails to handle NullPointerException exception cvs-commit at gcc dot gnu dot org
2005-05-09 [Bug libffi/21285] gij fails to handle NullPointerException exception cvs-commit at gcc dot gnu dot org
2005-05-09 [Bug java/19285] Interfaces not initialized by static field access cvs-commit at gcc dot gnu dot org
2005-05-09 [Bug libffi/21285] gij fails to handle NullPointerException exception rth at gcc dot gnu dot org
2005-05-09 [Bug java/19285] Interfaces not initialized by static field access cvs-commit at gcc dot gnu dot org
2005-05-09 [Bug java/21418] Order of source files matters when compiling bonzini at gcc dot gnu dot org
2005-05-09 [Bug java/21436] imports not remembered for previously compiled files bonzini at gcc dot gnu dot org
2005-05-09 [Bug java/21442] problem with imports and multifile builds bonzini at gcc dot gnu dot org
2005-05-09 [Bug java/21442] problem with imports and multifile builds bonzini at gcc dot gnu dot org
2005-05-08 [Bug libffi/21285] gij fails to handle NullPointerException exception cvs-commit at gcc dot gnu dot org
2005-05-08 [Bug libffi/21285] gij fails to handle NullPointerException exception tsv at solvo dot ru
2005-05-08 [Bug libffi/21285] gij fails to handle NullPointerException exception rth at gcc dot gnu dot org
2005-05-07 [Bug java/21070] [4.1 Regression]: java compiler generates wrong code on ia64 hjl at lucon dot org
2005-05-07 [Bug SWING/21444] Swing JList can't do multiple selection pinskia at gcc dot gnu dot org
2005-05-07 [Bug SWING/21444] New: Swing JList can't do multiple selection kho at redhat dot com
2005-05-07 [Bug java/21436] imports not remembered for previously compiled files bonzini at gcc dot gnu dot org
2005-05-07 [Bug java/21442] New: problem with imports and multifile builds bonzini at gcc dot gnu dot org
2005-05-07 [Bug java/21436] imports not remembered for previously compiled files bonzini at gcc dot gnu dot org
2005-05-07 [Bug java/21436] New: imports not remembered for previously compiled files bonzini at gcc dot gnu dot org
2005-05-06 [Bug java/20309] gcjh needs a -force option pinskia at gcc dot gnu dot org
2005-05-06 [Bug java/20309] gcjh needs a -force option cvs-commit at gcc dot gnu dot org
2005-05-06 [Bug libffi/21285] gij fails to handle NullPointerException exception pinskia at gcc dot gnu dot org
2005-05-06 [Bug middle-end/21285] gij fails to handle NullPointerException exception tsv at solvo dot ru
2005-05-06 [Bug middle-end/21285] gij fails to handle NullPointerException exception tsv at solvo dot ru
2005-05-06 [Bug java/21428] [3.4/4.0/4.1 Regression] bogus warning: unused parameter 'this' pinskia at gcc dot gnu dot org
2005-05-06 [Bug java/21428] bogus warning: unused parameter 'this' mark at gcc dot gnu dot org
2005-05-06 [Bug java/21428] New: bogus warning: unused parameter 'this' kon at iki dot fi
2005-05-06 [Bug java/21418] Order of source files matters when compiling mark at gcc dot gnu dot org
2005-05-06 [Bug java/21418] Order of source files matters when compiling pinskia at gcc dot gnu dot org
2005-05-06 [Bug java/21418] New: Order of source files matters when compiling mark at gcc dot gnu dot org
2005-05-06 [Bug java/21070] [4.1 Regression]: java compiler generates wrong code on ia64 schwab at suse dot de
2005-05-06 [Bug libgcj/21058] [4.1 Regression] libgcj can't find class green at redhat dot com
2005-05-06 [Bug libgcj/20693] [4.1 Regression] javax-imageio.lo failed to build green at redhat dot com
2005-05-06 [Bug java/21070] [4.1 Regression]: java compiler generates wrong code on ia64 hjl at lucon dot org
2005-05-05 [Bug middle-end/21362] ICE in make_edges, at cfgbuild.c:327 aph at gcc dot gnu dot org
2005-05-05 [Bug middle-end/21362] ICE in make_edges, at cfgbuild.c:327 pinskia at gcc dot gnu dot org
2005-05-05 [Bug java/21070] [4.1 Regression]: java compiler generates wrong code on ia64 schwab at suse dot de
2005-05-05 [Bug middle-end/21285] gij fails to handle NullPointerException exception tsv at solvo dot ru
2005-05-04 [Bug libgcj/21140] [4.0 only] Charset.encode and Charset.decode broken tromey at gcc dot gnu dot org
2005-05-04 [Bug java/20044] Wrong method call semantics (maybe instanceof/invokespecial) tromey at gcc dot gnu dot org
2005-05-04 [Bug libgcj/21326] seg fault in _Jv_Linker rspencer at x10sys dot com
2005-05-04 [Bug java/20044] Wrong method call semantics (maybe instanceof/invokespecial) bkonrath at redhat dot com
2005-05-04 [Bug libgcj/21326] seg fault in _Jv_Linker rspencer at x10sys dot com
2005-05-04 [Bug libgcj/20504] java.util.regex implementation doesn't support quoting constructs ziga dot mahkovec at klika dot si
2005-05-04 [Bug libgcj/20504] java.util.regex implementation doesn't support quoting constructs overholt at redhat dot com
2005-05-04 [Bug java/20309] gcjh needs a -force option fitzsim at redhat dot com
2005-05-04 [Bug java/20309] gcjh needs a -force option cvs-commit at gcc dot gnu dot org
2005-05-03 [Bug libgcj/8995] race cases in interpreter tromey at gcc dot gnu dot org
2005-05-03 [Bug middle-end/21285] gij fails to handle NullPointerException exception tsv at solvo dot ru
2005-05-03 [Bug libgcj/21372] FileChannel.tryLock() return value incorrect tromey at gcc dot gnu dot org
2005-05-03 [Bug libgcj/21372] FileChannel.tryLock() return value incorrect cvs-commit at gcc dot gnu dot org
2005-05-03 [Bug libgcj/21372] FileChannel.tryLock() return value incorrect cvs-commit at gcc dot gnu dot org
2005-05-03 [Bug libgcj/21326] seg fault in _Jv_Linker rspencer at x10sys dot com
2005-05-03 [Bug java/21245] gcjh creates invalid/empty header files pinskia at gcc dot gnu dot org
2005-05-03 [Bug libgcj/21372] FileChannel.tryLock() return value incorrect mckinlay at redhat dot com
2005-05-03 [Bug libgcj/21372] FileChannel.tryLock() return value incorrect pinskia at gcc dot gnu dot org
2005-05-03 [Bug libgcj/21372] FileChannel.tryLock() return value incorrect tromey at gcc dot gnu dot org
2005-05-03 [Bug middle-end/21285] gij fails to handle NullPointerException exception pinskia at gcc dot gnu dot org
2005-05-03 [Bug libgcj/21285] gij fails to handle NullPointerException exception tsv at solvo dot ru
2005-05-03 [Bug libgcj/21372] FileChannel.tryLock() return value incorrect overholt at redhat dot com
2005-05-03 [Bug libgcj/21372] FileChannel.tryLock() return value incorrect overholt at redhat dot com
2005-05-03 [Bug libgcj/21372] FileChannel.tryLock() return value incorrect overholt at redhat dot com
2005-05-03 [Bug libgcj/21372] FileChannel.tryLock() return value incorrect overholt at redhat dot com
2005-05-03 [Bug libgcj/21372] New: FileChannel.tryLock() return value incorrect overholt at redhat dot com
2005-05-03 [Bug java/21245] gcjh creates invalid/empty header files tromey at gcc dot gnu dot org
2005-05-03 [Bug libgcj/21285] gij fails to handle NullPointerException exception tsv at solvo dot ru
2005-05-03 [Bug java/21245] gcjh creates invalid/empty header files cvs-commit at gcc dot gnu dot org
2005-05-03 [Bug libgcj/21285] gij fails to handle NullPointerException exception pinskia at gcc dot gnu dot org
2005-05-03 [Bug libgcj/21285] gij fails to handle NullPointerException exception tsv at solvo dot ru
2005-05-03 [Bug libgcj/21285] gij fails to handle NullPointerException exception tsv at solvo dot ru
2005-05-03 [Bug libgcj/21326] seg fault in _Jv_Linker tromey at gcc dot gnu dot org
2005-05-03 [Bug libgcj/21285] gij fails to handle NullPointerException exception tromey at gcc dot gnu dot org
2005-05-03 [Bug middle-end/20606] ICE in make_edges, at cfgbuild.c:327 on x86_64 (with O2 - not with no optimizations) pinskia at gcc dot gnu dot org
2005-05-03 [Bug middle-end/20606] ICE in make_edges, at cfgbuild.c:327 on x86_64 (with O2 - not with no optimizations) pinskia at gcc dot gnu dot org
2005-05-03 [Bug middle-end/20606] ICE in make_edges, at cfgbuild.c:327 on x86_64 (with O2 - not with no optimizations) aph at gcc dot gnu dot org
2005-05-03 [Bug java/21362] ICE in make_edges, at cfgbuild.c:327 aph at gcc dot gnu dot org
2005-05-03 [Bug java/21362] ICE in make_edges, at cfgbuild.c:327 gbenson at redhat dot com
2005-05-03 [Bug java/21362] ICE in make_edges, at cfgbuild.c:327 gbenson at redhat dot com
2005-05-03 [Bug java/21362] ICE in make_edges, at cfgbuild.c:327 gbenson at redhat dot com
2005-05-03 [Bug java/21362] New: ICE in make_edges, at cfgbuild.c:327 gbenson at redhat dot com
2005-05-03 [Bug middle-end/20606] ICE in make_edges, at cfgbuild.c:327 on x86_64 (with O2 - not with no optimizations) aph at gcc dot gnu dot org
2005-05-03 [Bug SWING/20804] JFrames not using insets to calculate size. kho at redhat dot com
2005-05-03 [Bug java/12911] Class initialization optimization pessimization aph at gcc dot gnu dot org
2005-05-03 [Bug java/17574] [meta-bug] gcj and libgcj 4.0 tracking PR aph at gcc dot gnu dot org
2005-05-03 [Bug java/18399] [4.0/4.1 Regression] Class initialization optimization does not work with the inliner aph at gcc dot gnu dot org
2005-05-02 [Bug libgcj/21326] seg fault in _Jv_Linker pinskia at gcc dot gnu dot org
2005-05-02 [Bug libgcj/21326] New: _Jv_Linker rspencer at x10sys dot com
2005-05-01 [Bug java/17845] can't build GNU Classpath pinskia at gcc dot gnu dot org
2005-05-01 [Bug java/17845] can't build GNU Classpath dog at bluezoo dot org
2005-05-01 [Bug java/17845] can't build GNU Classpath pinskia at gcc dot gnu dot org
2005-05-01 [Bug java/21313] Incorrect visibility of "package" scope methods (compilation problem) pinskia at gcc dot gnu dot org
2005-05-01 [Bug java/21313] New: Incorrect visibility of "package" scope methods (compilation problem) lhofhansl at yahoo dot com
2005-05-01 [Bug java/20309] gcjh needs a -force option fitzsim at redhat dot com
2005-05-01 [Bug java/15525] suggestion to enable cast elimination tromey at gcc dot gnu dot org
2005-04-30 [Bug debug/21022] [4.0 only] ICE while compiling GdkFontMetrics.class with stabs debugging pinskia at gcc dot gnu dot org
2005-04-30 [Bug java/20910] gcc-4_0-brach GCJ ICE pinskia at gcc dot gnu dot org
2005-04-30 [Bug other/19688] gcc-3.4.3 failed to compile on a Slackware Linux system pinskia at gcc dot gnu dot org
2005-04-30 [Bug libgcj/19621] Network-performance issue in java.io.PrintStream pinskia at gcc dot gnu dot org
2005-04-30 [Bug java/15735] Should be able to disable bytecode verification pinskia at gcc dot gnu dot org
2005-04-29 [Bug java/21115] false boolean argument passed from pre-compiled to interpreted method is true pinskia at gcc dot gnu dot org
2005-04-29 [Bug java/21115] false boolean argument passed from pre-compiled to interpreted method is true cvs-commit at gcc dot gnu dot org
2005-04-29 [Bug java/19285] Interfaces not initialized by static field access cvs-commit at gcc dot gnu dot org
2005-04-29 [Bug java/21115] false boolean argument passed from pre-compiled to interpreted method is true cvs-commit at gcc dot gnu dot org
2005-04-29 [Bug java/19285] Interfaces not initialized by static field access cvs-commit at gcc dot gnu dot org
2005-04-29 [Bug libgcj/21136] [4.0 only] tryLock waits for the lock, and lock doesn't tromey at gcc dot gnu dot org
2005-04-29 [Bug libgcj/21136] [4.0 only] tryLock waits for the lock, and lock doesn't cvs-commit at gcc dot gnu dot org
2005-04-29 [Bug java/19285] Interfaces not initialized by static field access cvs-commit at gcc dot gnu dot org
2005-04-29 [Bug libgcj/21285] New: gij fails to handle NullPointerException exception tsv at solvo dot ru
2005-04-28 [Bug libgcj/18376] java.io.BufferedWriter outputing extraneous characters? greenrd at greenrd dot org
2005-04-28 [Bug libgcj/18376] java.io.BufferedWriter outputing extraneous characters? pinskia at gcc dot gnu dot org
2005-04-28 [Bug libgcj/21270] BufferedReader.read( char[], int, int ) returns less than expected number of read chars pinskia at gcc dot gnu dot org
2005-04-28 [Bug libgcj/21270] BufferedReader.read( char[], int, int ) returns less than expected number of read chars pinskia at gcc dot gnu dot org
2005-04-28 [Bug libgcj/21270] New: BufferedReader.read( char[], int, int ) returns less than expected number of read chars mnefedov at rogers dot com
2005-04-28 [Bug libgcj/21267] [win32] Non-English File Names processed incorrectly pinskia at gcc dot gnu dot org
2005-04-28 [Bug libgcj/21267] New: Non-English File Names processed incorrectly in Windows. mnefedov at rogers dot com
2005-04-28 [Bug java/20768] [4.0 only] Bytecode -> native code doesn't handle exception properly pinskia at gcc dot gnu dot org
2005-04-28 [Bug debug/21022] [4.0 only] ICE while compiling GdkFontMetrics.class with stabs debugging pinskia at gcc dot gnu dot org
2005-04-28 [Bug java/20768] [4.0 only] Bytecode -> native code doesn't handle exception properly cvs-commit at gcc dot gnu dot org
2005-04-28 [Bug java/21115] false boolean argument passed from pre-compiled to interpreted method is true cvs-commit at gcc dot gnu dot org
2005-04-28 [Bug debug/21022] [4.0 only] ICE while compiling GdkFontMetrics.class with stabs debugging cvs-commit at gcc dot gnu dot org
2005-04-28 [Bug libgcj/21140] [4.0 only] Charset.encode and Charset.decode broken aph at gcc dot gnu dot org
2005-04-28 [Bug libgcj/21136] [4.0 only] tryLock waits for the lock, and lock doesn't aph at gcc dot gnu dot org
2005-04-28 [Bug libgcj/21140] [4.0 only] Charset.encode and Charset.decode broken pinskia at gcc dot gnu dot org
2005-04-27 [Bug java/21245] gcjh creates invalid/empty header files pinskia at gcc dot gnu dot org
2005-04-27 [Bug java/21245] gcjh creates invalid/empty header files konqueror at gmx dot de
2005-04-27 [Bug java/21245] New: gcjh creates invalid/empty header files konqueror at gmx dot de
2005-04-27 [Bug libgcj/21164] libjava tests uses absolute paths pinskia at gcc dot gnu dot org
2005-04-26 [Bug libgcj/21058] [4.1 Regression] libgcj can't find class pinskia at gcc dot gnu dot org
2005-04-26 [Bug libgcj/21136] [4.0 only] tryLock waits for the lock, and lock doesn't pinskia at gcc dot gnu dot org
2005-04-26 [Bug libgcj/21136] [4.0 only] tryLock waits for the lock, and lock doesn't pinskia at gcc dot gnu dot org
2005-04-26 [Bug libgcj/21136] tryLock waits for the lock, and lock doesn't cvs-commit at gcc dot gnu dot org
2005-04-26 [Bug libgcj/21136] tryLock waits for the lock, and lock doesn't tromey at gcc dot gnu dot org
2005-04-26 [Bug java/21036] [4.0 only] gcj ICE compiling Azureus 2.2.0.2 to native code pinskia at gcc dot gnu dot org
2005-04-26 [Bug java/21036] gcj ICE compiling Azureus 2.2.0.2 to native code tromey at gcc dot gnu dot org
2005-04-26 [Bug libgcj/21233] [4.0 only] gij -version returns unquoted version number tromey at gcc dot gnu dot org
2005-04-26 [Bug libgcj/21233] [4.0 only] gij -version returns unquoted version number cvs-commit at gcc dot gnu dot org
2005-04-26 [Bug libgcj/21020] java.lang.NoSuchFieldError regression from earlier 4.0.0 snapshot cvs-commit at gcc dot gnu dot org
2005-04-26 [Bug libgcj/21020] java.lang.NoSuchFieldError regression from earlier 4.0.0 snapshot tromey at gcc dot gnu dot org
2005-04-26 [Bug libgcj/21058] libgcj can't find class green at redhat dot com
2005-04-26 [Bug SWING/21065] javax.swing.event.EventListenerList.getListenerList() implemented wrong tromey at gcc dot gnu dot org
2005-04-26 [Bug libgcj/21058] libgcj can't find class tromey at gcc dot gnu dot org
2005-04-26 [Bug java/20768] [4.0 only] Bytecode -> native code doesn't handle exception properly pinskia at gcc dot gnu dot org
2005-04-26 [Bug java/20768] Bytecode -> native code doesn't handle exception properly pinskia at gcc dot gnu dot org
2005-04-26 [Bug java/20768] Bytecode -> native code doesn't handle exception properly overholt at redhat dot com
2005-04-26 [Bug libgcj/21233] [4.0 only] gij -version returns unquoted version number pinskia at gcc dot gnu dot org
2005-04-26 [Bug java/21233] gij -version returns unquoted version number rmathew at gcc dot gnu dot org
2005-04-26 [Bug java/21233] New: gij -version returns unquoted version number caolanm at redhat dot com
2005-04-26 [Bug bootstrap/20155] [4.0/4.1 Regression] libgcj build fails with "execvp: /bin/sh: Argument list too long" htl10 at users dot sourceforge dot net
2005-04-26 [Bug bootstrap/20155] [4.0/4.1 Regression] libgcj build fails with "execvp: /bin/sh: Argument list too long" htl10 at users dot sourceforge dot net
2005-04-25 [Bug debug/21022] [4.0 only] ICE while compiling GdkFontMetrics.class with stabs debugging pinskia at gcc dot gnu dot org
2005-04-25 [Bug debug/21022] [4.0 only] ICE while compiling GdkFontMetrics.class with stabs debugging pinskia at gcc dot gnu dot org
2005-04-25 [Bug libgcj/21225] gnu/xml/dom/DomDOMException.java:171: internal compiler error: Segmentation fault pinskia at gcc dot gnu dot org
2005-04-25 [Bug libgcj/21225] New: gnu/xml/dom/DomDOMException.java:171: internal compiler error: Segmentation fault htl10 at users dot sourceforge dot net
2005-04-25 [Bug libgcj/21222] must restrict access to gnu.classpath.* mark at gcc dot gnu dot org
2005-04-25 [Bug libgcj/21222] must restrict access to gnu.classpath.* pinskia at gcc dot gnu dot org
2005-04-25 [Bug java/1305] [JSR133] GCJ ignores volatile modifier pinskia at gcc dot gnu dot org
2005-04-25 [Bug libgcj/21222] New: must restrict access to gnu.classpath.* tromey at gcc dot gnu dot org
2005-04-25 [Bug libgcj/21221] [Win32] File.isHidden() method always returns 'true' in windows. pinskia at gcc dot gnu dot org
2005-04-25 [Bug java/21221] New: File.isHidden() method always returns 'true' in windows. mnefedov at rogers dot com
2005-04-25 [Bug libgcj/21217] "Argument list too long" when guilding gcj pinskia at gcc dot gnu dot org
2005-04-25 [Bug libgcj/21217] "Argument list too long" when guilding gcj pinskia at gcc dot gnu dot org
2005-04-25 [Bug java/21217] New: "Argument list too long" when guilding gcj conveycj at npt dot nuwc dot navy dot mil
2005-04-25 [Bug SWING/21065] javax.swing.event.EventListenerList.getListenerList() implemented wrong konqueror at gmx dot de
2005-04-25 [Bug SWING/21065] javax.swing.event.EventListenerList.getListenerList() implemented wrong roman at kennke dot org
2005-04-23 [Bug SWING/21065] javax.swing.event.EventListenerList.getListenerList() implemented wrong pinskia at gcc dot gnu dot org
2005-04-23 [Bug libgcj/21065] javax.swing.event.EventListenerList.getListenerList() implemented wrong rmathew at gcc dot gnu dot org
2005-04-22 [Bug libgcj/21164] libjava tests uses absolute paths pinskia at gcc dot gnu dot org
2005-04-22 [Bug java/21164] New: libjava tests uses absolute paths dpatel at apple dot com
2005-04-22 [Bug AWT/20720] crash when pressing laptop arrow keys fitzsim at redhat dot com
2005-04-22 [Bug SWING/20015] JMenu stays open but should not fitzsim at redhat dot com
2005-04-21 [Bug java/8608] segmentation fault on compiling bad program pinskia at gcc dot gnu dot org
2005-04-21 [Bug java/21115] false boolean argument passed from pre-compiled to interpreted method is true cvs-commit at gcc dot gnu dot org
2005-04-21 [Bug java/21115] false boolean argument passed from pre-compiled to interpreted method is true pinskia at gcc dot gnu dot org
2005-04-21 [Bug libgcj/21115] false boolean argument passed from pre-compiled to interpreted method is true mark at gcc dot gnu dot org
2005-04-21 [Bug java/19285] Interfaces not initialized by static field access aph at gcc dot gnu dot org
2005-04-21 [Bug java/21115] false boolean argument passed from pre-compiled to interpreted method is true aph at gcc dot gnu dot org
2005-04-21 [Bug libgcj/21115] false boolean argument passed from pre-compiled to interpreted method is true aph at gcc dot gnu dot org
2005-04-21 [Bug java/20312] No warning on bad method bothner at gcc dot gnu dot org
2005-04-21 [Bug libgcj/21140] Charset.encode and Charset.decode broken konqueror at gmx dot de
2005-04-21 [Bug libgcj/21140] Charset.encode and Charset.decode broken konqueror at gmx dot de
2005-04-21 [Bug bootstrap/20155] [4.0/4.1 Regression] libgcj build fails with "execvp: /bin/sh: Argument list too long" mmitchel at gcc dot gnu dot org
2005-04-21 [Bug libgcj/21140] New: Charset.encode and Charset.decode broken luca dot barbieri at gmail dot com
2005-04-21 [Bug libgcj/21136] tryLock waits for the lock, and lock doesn't luca dot barbieri at gmail dot com
2005-04-21 [Bug libgcj/21136] New: tryLock waits for the lock, and lock doesn't luca dot barbieri at gmail dot com
2005-04-20 [Bug libgcj/20504] java.util.regex implementation doesn't support quoting constructs ziga dot mahkovec at klika dot si
2005-04-20 [Bug libgcj/20504] java.util.regex implementation doesn't support quoting constructs mckinlay at redhat dot com
2005-04-20 [Bug libgcj/21115] false boolean argument passed from pre-compiled to interpreted method is true aph at gcc dot gnu dot org
2005-04-20 [Bug libgcj/21115] false boolean argument passed from pre-compiled to interpreted method is true mark at gcc dot gnu dot org
2005-04-20 [Bug libgcj/21115] false boolean argument passed from pre-compiled to interpreted method is true pinskia at gcc dot gnu dot org
2005-04-20 [Bug libgcj/21115] false boolean argument passed from pre-compiled to interpreted method is true green at redhat dot com
2005-04-20 [Bug libffi/20104] gij fails on ppc and not on x86 pinskia at gcc dot gnu dot org
2005-04-20 [Bug java/20522] ICE in update_aliases, at java/decl.c:163 pinskia at gcc dot gnu dot org
2005-04-20 [Bug libffi/9614] libffi handles multiple floats wrong on powerpc-unkonwn-linux-gnu 3.2.x pinskia at gcc dot gnu dot org
2005-04-20 [Bug libgcj/20761] fastjar not correctly defined when compiling with cross compilers. pinskia at gcc dot gnu dot org
2005-04-20 [Bug java/12734] gcj verifier doesn't merge interface types correctly pinskia at gcc dot gnu dot org
2005-04-20 [Bug AWT/19453] AWT FileDialog gives warnings pinskia at gcc dot gnu dot org
2005-04-20 [Bug libgcj/20975] Remove scripts/TexinfoDoclet.java pinskia at gcc dot gnu dot org
2005-04-20 [Bug libgcj/20958] Compile Errors In two files in gnu.gcj pinskia at gcc dot gnu dot org
2005-04-20 [Bug libgcj/19527] libgij fails to install in a temporary directory pinskia at gcc dot gnu dot org
2005-04-20 [Bug AWT/16722] AWT application leaks memory pinskia at gcc dot gnu dot org
2005-04-20 [Bug java/18931] Java bytecode ICE in except.c remove_unreachable_regions pinskia at gcc dot gnu dot org
2005-04-20 [Bug libgcj/14070] gij and -jar argument should set the manifest Class-path recursively pinskia at gcc dot gnu dot org
2005-04-20 [Bug libgcj/21115] false boolean argument passed from pre-compiled to interpreted method is true tromey at gcc dot gnu dot org
2005-04-20 [Bug libgcj/21115] false boolean argument passed from pre-compiled to interpreted method is true pinskia at gcc dot gnu dot org
2005-04-20 [Bug libgcj/21115] false boolean argument passed from pre-compiled to interpreted method is true green at redhat dot com
2005-04-19 [Bug libgcj/21115] false boolean argument passed from pre-compiled to interpreted method is true pinskia at gcc dot gnu dot org
2005-04-19 [Bug java/21115] false boolean argument passed from pre-compiled to interpreted method is true daney at gcc dot gnu dot org
2005-04-19 [Bug java/21115] New: false boolean argument passed from pre-compiled to interpreted method is true mark at gcc dot gnu dot org
2005-04-19 [Bug java/21070] [4.1 Regression]: java compiler generates wrong code on ia64 pinskia at gcc dot gnu dot org
2005-04-19 [Bug debug/21022] [4.0 only] ICE while compiling GdkFontMetrics.class with stabs debugging andreast at gcc dot gnu dot org
2005-04-19 [Bug libgcj/20775] Crash in libgcj.so on linux alpha tsv at solvo dot ru
2005-04-19 [Bug java/21016] Indirect dispatch code generated when using -findirect-dispatch has wrong line numbers pinskia at gcc dot gnu dot org
2005-04-19 [Bug libgcj/20775] Crash in libgcj.so on linux alpha pinskia at gcc dot gnu dot org
2005-04-19 [Bug libgcj/20775] Crash in libgcj.so on linux alpha tsv at solvo dot ru
2005-04-19 [Bug debug/21022] [4.0 only] ICE while compiling GdkFontMetrics.class with stabs debugging pinskia at gcc dot gnu dot org
2005-04-19 [Bug java/21022] ICE while compiling GdkFontMetrics.class with stabs debugging andreast at gcc dot gnu dot org
2005-04-19 [Bug java/21022] ICE while compiling GdkFontMetrics.class with stabs debugging cvs-commit at gcc dot gnu dot org
2005-04-19 [Bug java/21022] ICE while compiling GdkFontMetrics.class with stabs debugging aph at gcc dot gnu dot org
2005-04-19 [Bug SWING/21064] [4.0 only] StyleContext.addStyle causes NullPointerException pinskia at gcc dot gnu dot org
2005-04-19 [Bug java/20768] Bytecode -> native code doesn't handle exception properly aph at gcc dot gnu dot org
2005-04-19 [Bug SWING/21064] StyleContext.addStyle causes NullPointerException cvs-commit at gcc dot gnu dot org
2005-04-19 [Bug java/12758] Binary Compatibility: CNI code is not binary compatible pinskia at gcc dot gnu dot org
2005-04-19 [Bug java/12758] Binary Compatibility: CNI code is not binary compatible pinskia at gcc dot gnu dot org
2005-04-18 [Bug libgcj/10353] [3.3/3.4/4.0/4.1 regression] Java testsuite failures mckinlay at redhat dot com
2005-04-17 [Bug libgcj/16032] libgcj should reject class files with incorrect version numbers cvs-commit at gcc dot gnu dot org
2005-04-17 [Bug java/21070] [4.1 Regression]: java compiler generates wrong code on ia64 hjl at lucon dot org
2005-04-17 [Bug libgcj/21074] Trivial bug in the method getHeaderFieldKey() in the file java/net/protocol/http/HTTPURLConnection.java pinskia at gcc dot gnu dot org
2005-04-17 [Bug java/21074] New: Trivial bug in the method getHeaderFieldKey() in the file java/net/protocol/http/HTTPURLConnection.java kreijack at inwind dot it
2005-04-17 [Bug java/21070] [4.1 Regression]: java compiler generates wrong code on ia64 pinskia at gcc dot gnu dot org
2005-04-17 [Bug middle-end/21070] [4.1 Regression]: java compiler generates wrong code on ia64 hjl at lucon dot org
2005-04-17 [Bug middle-end/21070] [4.1 Regression]: java compiler generates wrong code on ia64 hjl at lucon dot org
2005-04-17 [Bug libgcj/21068] String(strBytes, "UTF-16LE"); thorws java.io.UnsupportedEncodingException gruni dot ca at gmail dot com
2005-04-17 [Bug middle-end/21070] [4.1 Regression]: java compiler generates wrong code on ia64 hjl at lucon dot org
2005-04-17 [Bug middle-end/21070] [4.1 Regression]: java compiler generates wrong code on ia64 pinskia at gcc dot gnu dot org
2005-04-17 [Bug java/21070] New: [4.1 Regression]: java compiler generates wrong code on ia64 hjl at lucon dot org
2005-04-17 [Bug libgcj/20693] [4.1 Regression] javax-imageio.lo failed to build pinskia at gcc dot gnu dot org
2005-04-17 [Bug libgcj/21068] String(strBytes, "UTF-16LE"); thorws java.io.UnsupportedEncodingException ovidr at users dot sourceforge dot net
2005-04-17 [Bug libgcj/21068] String(strBytes, "UTF-16LE"); thorws java.io.UnsupportedEncodingException pinskia at gcc dot gnu dot org
2005-04-17 [Bug libgcj/21068] String(strBytes, "UTF-16LE"); thorws java.io.UnsupportedEncodingException pinskia at gcc dot gnu dot org
2005-04-17 [Bug libgcj/10353] [3.3/3.4/4.0/4.1 regression] Java testsuite failures ebotcazou at gcc dot gnu dot org
2005-04-17 [Bug java/21068] String(strBytes, "UTF-16LE"); thorws java.io.UnsupportedEncodingException gruni dot ca at gmail dot com
2005-04-17 [Bug java/21068] New: String(strBytes, "UTF-16LE"); thorws java.io.UnsupportedEncodingException gruni dot ca at gmail dot com
2005-04-17 [Bug libgcj/20693] javax-imageio.lo failed to build cvs-commit at gcc dot gnu dot org
2005-04-17 [Bug java/21065] javax.swing.event.EventListenerList.getListenerList() implemented wrong gruni dot ca at gmail dot com
2005-04-17 [Bug java/21065] javax.swing.event.EventListenerList.getListenerList() implemented wrong gruni dot ca at gmail dot com
2005-04-17 [Bug libgcj/20693] javax-imageio.lo failed to build green at redhat dot com
2005-04-17 [Bug java/21065] New: javax.swing.event.EventListenerList.getListenerList() implemented wrong gruni dot ca at gmail dot com
2005-04-16 [Bug SWING/21064] StyleContext.addStyle causes NullPointerException bothner at gcc dot gnu dot org
2005-04-16 [Bug SWING/21064] New: StyleContext.addStyle causes NullPointerException bothner at gcc dot gnu dot org
2005-04-16 [Bug java/18212] nativ compilation with multiple jars fails / gives internal compiler error pinskia at gcc dot gnu dot org
2005-04-16 [Bug bootstrap/20155] [4.0/4.1 Regression] libgcj build fails with "execvp: /bin/sh: Argument list too long" pinskia at gcc dot gnu dot org
2005-04-16 [Bug java/21022] bootstrap error compiling libgcj with awt support on darwin-ppc andreast at gcc dot gnu dot org
2005-04-16 [Bug java/21022] bootstrap error compiling libgcj with awt support on darwin-ppc pinskia at gcc dot gnu dot org
2005-04-16 [Bug java/21022] bootstrap error compiling libgcj with awt support on darwin-ppc pinskia at gcc dot gnu dot org
2005-04-16 [Bug java/18399] [4.0/4.1 Regression] Class initialization optimization does not work with the inliner pinskia at gcc dot gnu dot org
2005-04-16 [Bug java/18399] [4.0/4.1 Regression] Class initialization optimization does not work with the inliner pinskia at gcc dot gnu dot org
2005-04-16 [Bug java/21044] [4.0/4.1 Regression] Static class init optimization is broken pinskia at gcc dot gnu dot org
2005-04-16 [Bug java/21044] [4.0/4.1 Regression] Static class init optimization is broken aph at gcc dot gnu dot org
2005-04-16 [Bug java/12911] Class initialization optimization pessimization aph at gcc dot gnu dot org
2005-04-16 [Bug java/21044] [4.0/4.1 Regression] Static class init optimization is broken aph at gcc dot gnu dot org
2005-04-16 [Bug libgcj/21058] New: libgcj can't find class green at redhat dot com
2005-04-16 [Bug libgcj/11900] java.rmi.Naming does not parse rmi: URIs correctly gnu_andrew at member dot fsf dot org
2005-04-15 [Bug libgcj/10353] [3.3/3.4/4.0/4.1 regression] Java testsuite failures ebotcazou at gcc dot gnu dot org
2005-04-15 [Bug java/21045] Anonymous inner class constructor's exceptions can't be caught or thrown pinskia at gcc dot gnu dot org
2005-04-15 [Bug java/21044] [4.0/4.1 Regression] Static class init optimization is broken pinskia at gcc dot gnu dot org
2005-04-15 [Bug java/21045] Anonymous inner class constructor's exceptions can't be caught or thrown brion at pobox dot com
2005-04-15 [Bug java/21044] [4.0/4.1 Regression] Static class init optimization is broken giovannibajo at libero dot it
2005-04-15 [Bug java/21045] Anonymous inner class constructor's exceptions can't be caught or thrown brion at pobox dot com
2005-04-15 [Bug java/21045] Anonymous inner class constructor's exceptions can't be caught or thrown brion at pobox dot com
2005-04-15 [Bug java/21045] Anonymous inner class constructor's exceptions can't be caught or thrown brion at pobox dot com
2005-04-15 [Bug java/21045] New: Anonymous inner class constructor's exceptions can't be caught or thrown brion at pobox dot com
2005-04-15 [Bug java/21044] Static class init optimization is broken aph at gcc dot gnu dot org
2005-04-15 [Bug java/21044] New: Static class init optimization is broken aph at gcc dot gnu dot org
2005-04-15 [Bug java/21022] bootstrap error compiling libgcj with awt support on darwin-ppc pinskia at gcc dot gnu dot org
2005-04-15 [Bug java/21036] New: gcj ICE compiling Azureus 2.2.0.2 to native code luca dot barbieri at gmail dot com
2005-04-14 [Bug libgcj/21020] java.lang.NoSuchFieldError regression from earlier 4.0.0 snapshot mark at gcc dot gnu dot org
2005-04-14 [Bug libgcj/21020] java.lang.NoSuchFieldError regression from earlier 4.0.0 snapshot aph at gcc dot gnu dot org
2005-04-14 [Bug libgcj/21020] java.lang.NoSuchFieldError regression from earlier 4.0.0 snapshot tromey at gcc dot gnu dot org
2005-04-14 [Bug tree-optimization/20773] ICE: SEGV building jar file belyshev at depni dot sinp dot msu dot ru
2005-04-14 [Bug java/21022] New: bootstrap error compiling libgcj with awt support on darwin-ppc andreast at gcc dot gnu dot org
2005-04-14 [Bug libgcj/21020] java.lang.NoSuchFieldError regression from earlier 4.0.0 snapshot aph at gcc dot gnu dot org
2005-04-14 [Bug libgcj/21020] java.lang.NoSuchFieldError regression from earlier 4.0.0 snapshot aph at gcc dot gnu dot org
2005-04-14 [Bug libgcj/21020] java.lang.NoSuchFieldError regression from earlier 4.0.0 snapshot mark at gcc dot gnu dot org
2005-04-14 [Bug libgcj/21020] java.lang.NoSuchFieldError regression from earlier 4.0.0 snapshot caolanm at redhat dot com
2005-04-14 [Bug libgcj/21020] java.lang.NoSuchFieldError regression from earlier 4.0.0 snapshot caolanm at redhat dot com
2005-04-14 [Bug libgcj/21020] java.lang.NoSuchFieldError regression from earlier 4.0.0 snapshot caolanm at redhat dot com
2005-04-14 [Bug libgcj/21020] java.lang.NoSuchFieldError regression from earlier 4.0.0 snapshot caolanm at redhat dot com
2005-04-14 [Bug libgcj/21020] java.lang.NoSuchFieldError regression from earlier 4.0.0 snapshot caolanm at redhat dot com
2005-04-14 [Bug libgcj/21020] New: java.lang.NoSuchFieldError regression from earlier 4.0.0 snapshot caolanm at redhat dot com
2005-04-14 [Bug java/21016] Indirect dispatch code generated when using -findirect-dispatch has wrong line numbers greenrd at greenrd dot org
2005-04-14 [Bug java/21016] Indirect dispatch code generated when using -findirect-dispatch has wrong line numbers greenrd at greenrd dot org
2005-04-14 [Bug java/21016] New: Indirect dispatch code generated when using -findirect-dispatch has wrong line numbers greenrd at greenrd dot org
2005-04-13 [Bug java/17092] gcj should use unlock_getc instead of getc pinskia at gcc dot gnu dot org
2005-04-13 [Bug libgcj/20997] gij -verbose fails with a VM error pinskia at gcc dot gnu dot org
2005-04-13 [Bug libgcj/20997] gij -verbose fails with a VM error ziga dot mahkovec at klika dot si
2005-04-13 [Bug libgcj/20997] New: gij -verbose fails with a VM error ziga dot mahkovec at klika dot si
2005-04-12 [Bug libgcj/20958] Compile Errors In two files in gnu.gcj mckinlay at redhat dot com
2005-04-12 [Bug libgcj/20958] Compile Errors In two files in gnu.gcj cvs-commit at gcc dot gnu dot org
2005-04-12 [Bug java/20977] Invalid long to int promotion permitted in array initializer pinskia at gcc dot gnu dot org
2005-04-12 [Bug java/20978] Failure to detect unhandled exception pinskia at gcc dot gnu dot org
2005-04-12 [Bug java/20978] New: Failure to detect unhandled exception mckinlay at redhat dot com
2005-04-12 [Bug java/20977] New: Invalid long to int promotion permitted in array initializer mckinlay at redhat dot com
2005-04-12 [Bug libgcj/20975] Remove scripts/TexinfoDoclet.java mckinlay at redhat dot com
2005-04-12 [Bug libgcj/20975] Remove scripts/TexinfoDoclet.java cvs-commit at gcc dot gnu dot org
2005-04-12 [Bug libgcj/20975] Remove scripts/TexinfoDoclet.java mckinlay at redhat dot com
2005-04-12 [Bug libgcj/20975] Remove scripts/TexinfoDoclet.java aluchko at redhat dot com
2005-04-12 [Bug libgcj/20975] New: Remove scripts/TexinfoDoclet.java aluchko at redhat dot com
2005-04-11 [Bug libgcj/20958] Compile Errors In two files in gnu.gcj aluchko at redhat dot com
2005-04-11 [Bug libgcj/20958] New: Compile Errors In two files in gnu.gcj aluchko at redhat dot com
2005-04-11 [Bug libgcj/20693] javax-imageio.lo failed to build hjl at lucon dot org
2005-04-11 [Bug libgcj/20941] Incorrect case for META-INF with fastjar pinskia at gcc dot gnu dot org
2005-04-11 [Bug java/20941] Incorrect case for META-INF with fastjar phil at mkdoc dot com
2005-04-11 [Bug java/20941] Incorrect case for META-INF with fastjar phil at mkdoc dot com
2005-04-11 [Bug java/20941] Incorrect case for META-INF with fastjar phil at mkdoc dot com
2005-04-11 [Bug java/20941] Incorrect case for META-INF with fastjar phil at mkdoc dot com
2005-04-11 [Bug java/20941] Incorrect case for META-INF with fastjar phil at mkdoc dot com
2005-04-11 [Bug java/20941] Incorrect case for META-INF with fastjar phil at mkdoc dot com
2005-04-11 [Bug java/20941] Incorrect case for META-INF with fastjar phil at mkdoc dot com
2005-04-11 [Bug java/20941] New: Incorrect case for META-INF with fastjar phil at mkdoc dot com
2005-04-08 [Bug java/20910] gcc-4_0-brach GCJ ICE pinskia at gcc dot gnu dot org
2005-04-08 [Bug java/20910] New: gcc-4_0-brach GCJ ICE steve at netfuel dot com
2005-04-08 [Bug libgcj/20908] New: [m68k-linux] libjava testsuite fails about 600 tests debian-gcc at lists dot debian dot org
2005-04-08 [Bug testsuite/16230] Spurious test failures with --disable-static pinskia at gcc dot gnu dot org
2005-04-08 [Bug java/20768] Bytecode -> native code doesn't handle exception properly aph at gcc dot gnu dot org
2005-04-08 [Bug libgcj/20699] gij -ms segfaults Hans dot Boehm at hp dot com
2005-04-07 [Bug SWING/20804] JFrames not using insets to calculate size. pinskia at gcc dot gnu dot org
2005-04-07 [Bug libgcj/20693] javax-imageio.lo failed to build hjl at lucon dot org
2005-04-07 [Bug middle-end/20648] [4.0 regression] ICE in cfg_layout_redirect_edge_and_branch_force schwab at suse dot de
2005-04-07 [Bug middle-end/20648] [4.0 regression] ICE in cfg_layout_redirect_edge_and_branch_force cvs-commit at gcc dot gnu dot org
2005-04-07 [Bug middle-end/20648] [4.0 regression] ICE in cfg_layout_redirect_edge_and_branch_force steven at gcc dot gnu dot org
2005-04-07 [Bug middle-end/20648] [4.0 regression] ICE in cfg_layout_redirect_edge_and_branch_force pinskia at gcc dot gnu dot org
2005-04-07 [Bug middle-end/20648] [4.0 regression] ICE in cfg_layout_redirect_edge_and_branch_force steven at gcc dot gnu dot org
2005-04-07 [Bug middle-end/20648] [4.0/4.1 regression] ICE in cfg_layout_redirect_edge_and_branch_force schwab at suse dot de
2005-04-07 [Bug SWING/20804] New: JFrames not using insets to calculate size. kho at redhat dot com
2005-04-06 [Bug AWT/20790] libjawt.so must be renamed pinskia at gcc dot gnu dot org
2005-04-06 [Bug middle-end/20606] ICE in make_edges, at cfgbuild.c:327 on x86_64 (with O2 - not with no optimizations) aph at gcc dot gnu dot org
2005-04-06 [Bug AWT/20790] New: libjawt.so must be renamed fitzsim at redhat dot com
2005-04-06 [Bug libgcj/20775] Crash in libgcj.so on linux alpha tsv at solvo dot ru
2005-04-06 [Bug libgcj/20750] libgcj needs a --with-java-home configure option pinskia at gcc dot gnu dot org
2005-04-06 [Bug libgcj/20750] libgcj needs a --with-java-home configure option fitzsim at redhat dot com
2005-04-06 [Bug libgcj/20782] jawt assertion failure green at redhat dot com
2005-04-06 [Bug libgcj/20782] jawt assertion failure green at redhat dot com
2005-04-06 [Bug libgcj/20782] New: jawt assertion failure: green at redhat dot com
2005-04-06 [Bug libgcj/20750] libgcj needs a --with-java-home configure option cvs-commit at gcc dot gnu dot org
2005-04-06 [Bug tree-optimization/20773] ICE: SEGV building jar file green at redhat dot com
2005-04-05 [Bug tree-optimization/20773] ICE: SEGV building jar file pinskia at gcc dot gnu dot org
2005-04-05 [Bug libgcj/20750] libgcj needs a --with-java-home configure option cvs-commit at gcc dot gnu dot org
2005-04-05 [Bug AWT/20757] FontMetrics.getStringBounds() missing pinskia at gcc dot gnu dot org
2005-04-05 [Bug tree-optimization/20773] ICE: SEGV building jar file pinskia at gcc dot gnu dot org
2005-04-05 [Bug libgcj/20775] Crash in libgcj.so on linux alpha mckinlay at redhat dot com
2005-04-05 [Bug bootstrap/20155] [4.0/4.1 Regression] libgcj build fails with "execvp: /bin/sh: Argument list too long" mmitchel at gcc dot gnu dot org
2005-04-05 [Bug libgcj/20775] New: Crash in libgcj.so on linux alpha tsv at solvo dot ru
2005-04-05 [Bug java/20768] Bytecode -> native code doesn't handle exception properly tromey at gcc dot gnu dot org
2005-04-05 [Bug tree-optimization/20773] ICE: SEGV building jar file pinskia at gcc dot gnu dot org
2005-04-05 [Bug java/20773] ICE: SEGV building jar file green at redhat dot com
2005-04-05 [Bug java/20773] New: ICE: SEGV building jar file green at redhat dot com
2005-04-05 [Bug java/20768] Bytecode -> native code doesn't handle exception properly mckinlay at redhat dot com
2005-04-05 [Bug java/20768] Bytecode -> native code doesn't handle exception properly overholt at redhat dot com
2005-04-05 [Bug java/20768] Bytecode -> native code doesn't handle exception properly overholt at redhat dot com
2005-04-05 [Bug java/20768] New: Bytecode -> native code doesn't handle exception properly overholt at redhat dot com
2005-04-05 [Bug java/17092] gcj should use unlock_getc instead of getc ghazi at gcc dot gnu dot org
2005-04-04 [Bug libgcj/20761] fastjar not correctly defined when compiling with cross compilers. mckinlay at redhat dot com
2005-04-04 [Bug libgcj/20761] fastjar not correctly defined when compiling with cross compilers. cvs-commit at gcc dot gnu dot org
2005-04-04 [Bug libgcj/20761] fastjar not correctly defined when compiling with cross compilers. cvs-commit at gcc dot gnu dot org
2005-04-04 [Bug libgcj/20761] fastjar not correctly defined when compiling with cross compilers. mckinlay at redhat dot com
2005-04-04 [Bug java/20761] fastjar not correctly defined when compiling with cross compilers. steve at netfuel dot com
2005-04-04 [Bug java/20761] New: fastjar not correctly defined for cross compilers. steve at netfuel dot com
2005-04-04 [Bug libgcj/20750] libgcj needs a --with-java-home configure option fitzsim at redhat dot com
2005-04-04 [Bug libgcj/20750] libgcj needs a --with-java-home configure option mckinlay at redhat dot com
2005-04-04 [Bug AWT/20757] New: FontMetrics.getStringBounds() missing konqueror at gmx dot de
2005-04-04 [Bug libgcj/20750] libgcj needs a --with-java-home configure option fitzsim at redhat dot com
2005-04-04 [Bug libgcj/20750] libgcj needs a --with-java-home configure option fitzsim at redhat dot com
2005-04-04 [Bug libgcj/20750] libgcj needs a --with-java-home configure option mckinlay at redhat dot com
2005-04-04 [Bug libgcj/20750] libgcj needs a --with-java-home configure option pinskia at gcc dot gnu dot org
2005-04-04 [Bug libgcj/20750] libgcj needs a --with-java-home configure option fitzsim at redhat dot com
2005-04-04 [Bug java/20750] New: libgcj needs a --with-java-home configure option fitzsim at redhat dot com
2005-04-03 [Bug middle-end/20648] [4.0/4.1 regression] ICE in cfg_layout_redirect_edge_and_branch_force schwab at suse dot de
2005-04-03 [Bug libgcj/20727] double free or corruption pinskia at gcc dot gnu dot org
2005-04-03 [Bug middle-end/20648] [4.0/4.1 regression] ICE in cfg_layout_redirect_edge_and_branch_force steven at gcc dot gnu dot org
2005-04-03 [Bug middle-end/20648] [4.0/4.1 regression] ICE in cfg_layout_redirect_edge_and_branch_force cvs-commit at gcc dot gnu dot org
2005-04-03 [Bug libgcj/20727] double free or corruption green at redhat dot com
2005-04-03 [Bug libgcj/20727] double free or corruption green at redhat dot com
2005-04-03 [Bug libgcj/20727] double free or corruption cvs-commit at gcc dot gnu dot org
2005-04-03 [Bug libgcj/20727] double free or corruption cvs-commit at gcc dot gnu dot org
2005-04-03 [Bug java/20735] New: gcj writes bogus source filenames for inner classes read from .class files greenrd at greenrd dot org
2005-04-02 [Bug libgcj/20090] gij should be implemented in Java pinskia at gcc dot gnu dot org
2005-04-02 [Bug libgcj/20090] gij should be implemented in Java fitzsim at redhat dot com
2005-04-02 [Bug java/20526] gij -X reports no options are recognized, while -Xmx and -Xms seem to be pinskia at gcc dot gnu dot org
2005-04-02 [Bug java/20526] gij -X reports no options are recognized, while -Xmx and -Xms seem to be fitzsim at redhat dot com
2005-04-02 [Bug libgcj/20727] New: double free or corruption green at redhat dot com
2005-04-02 [Bug libgcj/20699] gij -ms segfaults vektor at dumbterm dot net
2005-04-02 [Bug libgcj/20090] gij should be implemented in Java cvs-commit at gcc dot gnu dot org
2005-04-02 [Bug java/20526] gij -X reports no options are recognized, while -Xmx and -Xms seem to be cvs-commit at gcc dot gnu dot org
2005-04-02 [Bug libgcj/20090] gij should be implemented in Java cvs-commit at gcc dot gnu dot org
2005-04-02 [Bug java/20526] gij -X reports no options are recognized, while -Xmx and -Xms seem to be cvs-commit at gcc dot gnu dot org
2005-04-02 [Bug libgcj/20693] javax-imageio.lo failed to build hjl at lucon dot org
2005-04-01 [Bug AWT/20720] New: crash when pressing laptop arrow keys fitzsim at redhat dot com
2005-04-01 [Bug java/20715] gcj compilation error jack dot rong at cloakware dot com
2005-04-01 [Bug java/20715] gcj link error jack dot rong at cloakware dot com
2005-04-01 [Bug java/20715] gcj link error pinskia at gcc dot gnu dot org
2005-04-01 [Bug java/20715] gcj link error pinskia at gcc dot gnu dot org
2005-04-01 [Bug libgcj/20715] New: gcj link error jack dot rong at cloakware dot com
Indexes: [Date Index] [Subject Index] [Author Index] [Thread Index]
Site Nav: [Browse other archives for this mailing list]
[Browse other mailing lists at this site]
Search: Limit to:

Mail converted by MHonArc 2.6.3