This is the mail archive of the gcc@gcc.gnu.org mailing list for the GCC project.


Index Nav: [Date Index] [Subject Index] [Author Index] [Thread Index]
Message Nav: [Date Prev] [Date Next] [Thread Prev] [Thread Next]
Other format: [Raw text]

FW: Build failed in Jenkins: BuildThunderX_native_gcc_upstream #1267


One of the following revision caused a bootstrap comparison failure on aarch64-linux-gnu:
r246225 
r246226
r246227

Thanks,
Andrew Pinski

Ignore the URLs in the log file below, this is a Jenkins to Cavium.

-----Original Message-----
From: jenkins@cavium.com [mailto:jenkins@cavium.com] 
Sent: Friday, March 17, 2017 11:00 AM
To: Pinski, Andrew <Andrew.Pinski@cavium.com>
Subject: Build failed in Jenkins: BuildThunderX_native_gcc_upstream #1267

------------------------------------------
rm -f stage_current
make[3]: Leaving directory '<http://toolchain-releases.caveonetworks.com:8080/job/BuildThunderX_native_gcc_upstream/ws/objdir'>
Comparing stages 2 and 3
Bootstrap comparison failure!
gcc/lto/lto.o differs
libcpp/line-map.o differs
Makefile:24072: recipe for target 'compare' failed
make[2]: *** [compare] Error 1
make[2]: Leaving directory '<http://toolchain-releases.caveonetworks.com:8080/job/BuildThunderX_native_gcc_upstream/ws/objdir'>
Makefile:24051: recipe for target 'stage3-bubble' failed
make[1]: *** [stage3-bubble] Error 2
make[1]: Leaving directory '<http://toolchain-releases.caveonetworks.com:8080/job/BuildThunderX_native_gcc_upstream/ws/objdir'>
Makefile:931: recipe for target 'all' failed
make: *** [all] Error 2
Build step 'Execute shell' marked build as failure
[WARNINGS] Skipping publisher since build result is FAILURE
Archiving artifacts

Index Nav: [Date Index] [Subject Index] [Author Index] [Thread Index]
Message Nav: [Date Prev] [Date Next] [Thread Prev] [Thread Next]