This is the mail archive of the gcc@gcc.gnu.org mailing list for the GCC project.


Index Nav: [Date Index] [Subject Index] [Author Index] [Thread Index]
Message Nav: [Date Prev] [Date Next] [Thread Prev] [Thread Next]
Other format: [Raw text]

gcc 4.3.0 revision 129794 on hppa2.0w-hp-hpux11.00


-----BEGIN PGP SIGNED MESSAGE-----
Hash: SHA1

Builds fine with gcc 4.1.2 as boostrap compiler:
Target: hppa2.0w-hp-hpux11.00
Configured with:
/raid/tecosim/it/devel/projects/develtools/src/gcc-4.3.0/configure
- --prefix=/appl/shared/gcc/HP-UX/hppa2.0w-hp-hpux11.00/gcc-4.3.0 --with-gnu-as
- --with-as=/appl/shared/gcc/HP-UX/hppa2.0w-hp-hpux11.00/gcc-4.3.0/bin/as
- --with-ld=/usr/ccs/bin/ld --enable-threads=posix --enable-shared
- --enable-checking=release
- --enable-languages=c,ada,c++,fortran,java,objc,obj-c++,treelang
- --with-gmp=/SCRATCH/gcc-build/HP-UX/hppa2.0w-hp-hpux11.00/install
- --with-mpfr=/SCRATCH/gcc-build/HP-UX/hppa2.0w-hp-hpux11.00/install
- --with-local-prefix=/appl/shared/gnu/HP-UX/hppa2.0w-hp-hpux11.00
Thread model: posix
gcc version 4.3.0 20071031 (experimental) (GCC)

But using this as bootstrap compiler for itself results in the following error
in stage 1:

gcc   -g -fkeep-inline-functions -DIN_GCC   -W -Wall -Wwrite-strings
- -Wstrict-prototypes -Wmissing-prototypes -Wold-style-definition
- -Wmissing-format-attribute -pedantic -Wno-long-long -Wno-variadic-macros
                                     -Wno-overlength-strings    -DHAVE_CONFIG_H
- -DGENERATOR_FILE  -o build/genconstants \
            build/genconstants.o build/rtl.o build/read-rtl.o build/ggc-none.o
build/vec.o build/min-insn-modes.o build/gensupport.o build/print-rtl.o
build/errors.o ../build-hppa2.0w-hp-hpux11.00/libiberty
/libiberty.a
/usr/ccs/bin/ld: Unsatisfied symbols:
   ggc_free (first referenced in build/rtl.o) (data)
/usr/ccs/bin/ld: (Warning) Linker features were used that may not be supported
in future releases. The +vallcompatwarnings option can be used to display more
details, and the ld(1) man page contains additio
nal information. This warning can be suppressed with the +vnocompatwarnings option.
collect2: ld returned 1 exit status
gmake[3]: *** [build/genconstants] Error 1
gmake[3]: Leaving directory
`/disk1/SCRATCH/gcc-build/HP-UX/hppa2.0w-hp-hpux11.00/gcc-4.3.0/gcc-4.3.0/gcc'
gmake[2]: *** [all-stage1-gcc] Error 2
gmake[2]: Leaving directory
`/disk1/SCRATCH/gcc-build/HP-UX/hppa2.0w-hp-hpux11.00/gcc-4.3.0/gcc-4.3.0'
gmake[1]: *** [stage1-bubble] Error 2
gmake[1]: Leaving directory
`/disk1/SCRATCH/gcc-build/HP-UX/hppa2.0w-hp-hpux11.00/gcc-4.3.0/gcc-4.3.0'
gmake: *** [all] Error 2

Comments? Should I file a bug report?

Rainer

- --
Mit freundlichen GrÃÃen / Best Regards

Dipl.-Ing. Rainer Emrich
Dept. Manager IT/Softwareentwicklung
TECOSIM Technische Simulation GmbH
Ferdinand-Stuttmann-StraÃe 15
D-65428 RÃsselsheim
Phone  +49 (0) 6142 8272-330
Fax    +49 (0) 6142 8272-249
Mobile +49 (0) 163 5694920
www.tecosim.com
best partner for simulation
_ _ _ _ _ _ _ _ _ _ _ _ _ _ _ _ _ _ _ _ _ _ _ _ _ _ _ _ _ _ _ _ _ _

TECOSIM Technische Simulation GmbH, RÃsselsheim
Firmensitz: Ferdinand-Stuttmann-StraÃe 15, 65428 RÃsselsheim
Registergericht: Amtsgericht Darmstadt, HRB 83704
GeschÃftsfÃhrer: Udo Jankowski, JÃrgen Veith
-----BEGIN PGP SIGNATURE-----
Version: GnuPG v1.4.7 (MingW32)
Comment: Using GnuPG with Mozilla - http://enigmail.mozdev.org

iD8DBQFHKQat3s6elE6CYeURAmIaAJ0Uqn3O6QM9Mf/0ZuaP7cKg7epuLgCgxSO4
t4aj2y8VtOYN3OG9odntFPI=
=1+CX
-----END PGP SIGNATURE-----


Index Nav: [Date Index] [Subject Index] [Author Index] [Thread Index]
Message Nav: [Date Prev] [Date Next] [Thread Prev] [Thread Next]