This is the mail archive of the gcc@gcc.gnu.org mailing list for the GCC project.


Index Nav: [Date Index] [Subject Index] [Author Index] [Thread Index]
Message Nav: [Date Prev] [Date Next] [Thread Prev] [Thread Next]
Other format: [Raw text]

another build failure on solaris-2.6


Hi,

so far I get after I removed the emit_cmp_insn aligns which are not
needed anymore. The same failure I had before.

Andreas

./xgcc -B./ -B/home/a_tobler/local/sparc-sun-solaris2.6/bin/ -isystem
/home/a_tobler/local/sparc-sun-solaris2.6/include -isystem
/home/a_tobler/local/sparc-sun-solaris2.6/sys-include -O2   -DIN_GCC   
-W -Wall -Wwrite-strings -Wstrict-prototypes -Wmissing-prototypes
-isystem ./include  -fPIC -g1 -DHAVE_GTHR_DEFAULT -DIN_LIBGCC2
-D__GCC_FLOAT_NOT_NEEDED  -I. -I. -I../../gcc/gcc -I../../gcc/gcc/.
-I../../gcc/gcc/config -I../../gcc/gcc/../include -fexceptions -c
../../gcc/gcc/unwind-dw2-fde.c -o libgcc/./unwind-dw2-fde.o
../../gcc/gcc/unwind-dw2-fde.c:48: warning: missing braces around initializer
../../gcc/gcc/unwind-dw2-fde.c:48: warning: (near initialization for `object_mutex.__pthread_mutex_flags')
../../gcc/gcc/unwind-dw2-fde.c:48: warning: missing initializer
../../gcc/gcc/unwind-dw2-fde.c:48: warning: (near initialization for `object_mutex.__pthread_mutex_flags.__pthread_mutex_type')
../../gcc/gcc/unwind-dw2-fde.c:48: warning: missing initializer
../../gcc/gcc/unwind-dw2-fde.c:48: warning: (near initialization for `object_mutex.__pthread_mutex_lock')
../../gcc/gcc/unwind-dw2-fde.c: In function `fde_single_encoding_compare':
../../gcc/gcc/unwind-dw2-fde.c:324: Internal error: Segmentation Fault
Please submit a full bug report,
with preprocessed source if appropriate.
See <URL:http://www.gnu.org/software/gcc/bugs.html> for instructions.
make[3]: *** [libgcc/./unwind-dw2-fde.o] Error 1
make[3]: Leaving directory `/home/a_tobler/cvs/objdir/gcc'
make[2]: *** [libgcc.a] Error 2
make[2]: Leaving directory `/home/a_tobler/cvs/objdir/gcc'
make[1]: *** [stage1_build] Error 2
make[1]: Leaving directory `/home/a_tobler/cvs/objdir/gcc'
make: *** [bootstrap] Error 2


Index Nav: [Date Index] [Subject Index] [Author Index] [Thread Index]
Message Nav: [Date Prev] [Date Next] [Thread Prev] [Thread Next]