This is the mail archive of the gcc@gcc.gnu.org mailing list for the GCC project.


Index Nav: [Date Index] [Subject Index] [Author Index] [Thread Index]
Message Nav: [Date Prev] [Date Next] [Thread Prev] [Thread Next]

new breakage on 3.0branch


My nightly build of the 3.0 branch croaked last night.  It passed the
night before.  Without digging deeper at this moment, the smoking gun
looks to be the c++config change.

Are others seeing this?

RJL

Updating CVS tree
P gcc/ChangeLog
P gcc/config.gcc
P gcc/version.c
P gcc/config/freebsd.h
P gcc/config/ia64/elf.h
U gcc/config/ia64/freebsd.h
P gcc/config/ia64/hpux.h
P gcc/config/ia64/ia64.h
P gcc/config/ia64/linux.h
P gcc/doc/extend.texi
P gcc/doc/gcc.texi
P gcc/doc/install.texi
P gcc/doc/tm.texi
P gcc/f/version.c
M gcc/java/parse.c
P gcc/po/ChangeLog
U gcc/po/POTFILES.in
cvs server: [01:09:30] waiting for anoncvs's lock in /cvs/gcc/egcs/gcc/testsuite/g77.f-torture/execute
cvs server: [01:10:00] obtained lock in /cvs/gcc/egcs/gcc/testsuite/g77.f-torture/execute
P libf2c/libF77/Version.c
P libf2c/libI77/Version.c
P libf2c/libU77/Version.c
P libstdc++-v3/include/bits/c++config
Adjusting file timestamps
   undeclared identifier is reported only once for each function it appears 
   in.)
/play/negcs/i686-pc-sco3.2v5.0.6/libstdc++-v3/include/bits/locale_facets.tcc: In
   member function `_InIter std::num_get<_CharT, _InIter>::do_get(_InIter, 
   _InIter, std::ios_base&, std::_Ios_Iostate&, long long unsigned int&) const 
   [with _CharT = char, _InIter = std::istreambuf_iterator<char, 
   std::char_traits<char> >]':
/play/egcs/libstdc++-v3/src/locale-inst.cc:78:   instantiated from here
/play/negcs/i686-pc-sco3.2v5.0.6/libstdc++-v3/include/bits/locale_facets.tcc:547: `strtoull'
   undeclared (first use this function)
make[4]: *** [locale-inst.lo] Error 1
make[3]: *** [all-recursive] Error 1
make[2]: *** [all-recursive-am] Error 2
make[1]: *** [all-target-libstdc++-v3] Error 2
make: *** [bootstrap] Error 2
=-=-=-=-=-=-=-=-=-=-=-=-=-=-=-=-=-=-=-=-=-=-
make: *** No rule to make target `clean'.  Stop.
make: *** No rule to make target `bootstrap'.  Stop.
/home/robertl/bin/nightly[64]: /play/tmp/7/gcc:  not found

----- End forwarded message -----


Index Nav: [Date Index] [Subject Index] [Author Index] [Thread Index]
Message Nav: [Date Prev] [Date Next] [Thread Prev] [Thread Next]