This is the mail archive of the gcc@gcc.gnu.org mailing list for the GCC project.


Index Nav: [Date Index] [Subject Index] [Author Index] [Thread Index]
Message Nav: [Date Prev] [Date Next] [Thread Prev] [Thread Next]

Re: Ada files now checked in


I did "touch treeprs.ads a-[es]info.h nmake.ad[bs]" (as documented in
the regular GNAT release tarballs, documentation not yet installed in
CVS I assume) to get over the first error but I got into the second
one.

This is on a RedHat 6.1 system, gcc is the one from GNAT 3.14a1 binary
customer release tarball.

I tried to find a Makefile target for building xnmake but found none,
may be some essential generated file is not included or up to date in
CVS?

-- 
Laurent Guerby <guerby@acm.org>

<first error>

make bootstrap
...
make -C ada "AR_FLAGS_FOR_TARGET=" "AR_CREATE_FOR_TARGET=` if [ -f /home/guerby/work/gcc/build/gcc/../binutils/ar ] ; then echo /home/guerby/work/gcc/build/gcc/../binutils/ar ; else if [ "i686-pc-linux-gnu" = "i686-pc-linux-gnu" ] ; then echo ar; else t='s,^,i686-pc-linux-gnu-,'; echo ar | sed -e $t ; fi; fi`  rc" "AR_EXTRACT_FOR_TARGET=` if [ -f /home/guerby/work/gcc/build/gcc/../binutils/ar ] ; then echo /home/guerby/work/gcc/build/gcc/../binutils/ar ; else if [ "i686-pc-linux-gnu" = "i686-pc-linux-gnu" ] ; then echo ar; else t='s,^,i686-pc-linux-gnu-,'; echo ar | sed -e $t ; fi; fi`  x" "AR_FOR_TARGET=` if [ -f /home/guerby/work/gcc/build/gcc/../binutils/ar ] ; then echo /home/guerby/work/gcc/build/gcc/../binutils/ar ; else if [ "i686-pc-linux-gnu" = "i686-pc-linux-gnu" ] ; then echo ar; else t='s,^,i686-pc-linux-gnu-,'; echo ar | sed -e $t ; fi; fi`" "BISON=bison" "BISONFLAGS=" "CFLAGS=-g  -W -Wall -Wwrite-strings -Wstrict-prototypes -Wmissing-prototypes -Wtraditional " "GCC_FOR_TARGET=./xgcc -B./ -B/home/guerby/work/gcc/install/i686-pc-linux-gnu/bin/ -isystem /home/guerby/work/gcc/install/i686-pc-linux-gnu/include" "LDFLAGS=" "FLEX=flex" "FLEXFLAGS=" "LN=ln" "LN_S=ln -s" "MAKEINFO=makeinfo " "MAKEINFOFLAGS=" "MAKEOVERRIDES=" "RANLIB_FOR_TARGET=` if [ -f /home/guerby/work/gcc/build/gcc/../binutils/ranlib ] ; then echo /home/guerby/work/gcc/build/gcc/../binutils/ranlib ; else if [ "i686-pc-linux-gnu" = "i686-pc-linux-gnu" ] ; then echo ranlib; else t='s,^,i686-pc-linux-gnu-,'; echo ranlib | sed -e $t ; fi; fi`" "RANLIB_TEST_FOR_TARGET=[ -f ` if [ -f /home/guerby/work/gcc/build/gcc/../binutils/ranlib ] ; then echo /home/guerby/work/gcc/build/gcc/../binutils/ranlib ; else if [ "i686-pc-linux-gnu" = "i686-pc-linux-gnu" ] ; then echo ranlib; else t='s,^,i686-pc-linux-gnu-,'; echo ranlib | sed -e $t ; fi; fi` ] || ( [ "i686-pc-linux-gnu" = "i686-pc-linux-gnu" ] && [ -f /usr/bin/ranlib -o -f /bin/ranlib ] )" "SHELL=/bin/sh" "STAGE_PREFIX=" "exeext=" "build_exeext=" "objext=.o" "exec_prefix=/home/guerby/work/g!
cc/install" "prefix=/home/guerby/work/gcc/install" "local_prefix=/usr/local" "gxx_include_dir=/home/guerby/work/gcc/install/lib/gcc-lib/i686-pc-linux-gnu/3.1/../../../..`echo /home/guerby/work/gcc/install | sed -e 's|^/home/guerby/work/gcc/install||' -e 's|/[^/]*|/..|g'`/include/g++-v3" "tooldir=/home/guerby/work/gcc/install/i686-pc-linux-gnu" "gcc_tooldir=/home/guerby/work/gcc/install/lib/gcc-lib/i686-pc-linux-gnu/3.1/../../../../i686-pc-linux-gnu" "bindir=/home/guerby/work/gcc/install/bin" "libsubdir=/home/guerby/work/gcc/install/lib/gcc-lib/i686-pc-linux-gnu/3.1" "datadir=/home/guerby/work/gcc/install/share" "localedir=/home/guerby/work/gcc/install/share/locale" "CC=gcc" "ADA_FOR_BUILD=" "ADA_INCLUDE_DIR=/home/guerby/work/gcc/install/lib/gcc-lib/i686-pc-linux-gnu/3.1/adainclude" "ADA_RTL_OBJ_DIR=/home/guerby/work/gcc/install/lib/gcc-lib/i686-pc-linux-gnu/3.1/adalib" "ADAFLAGS=-gnatpg -gnata" "ADA_FOR_TARGET=" "INSTALL_DATA=/usr/bin/install -c -m 644" "INSTALL_PROGRAM=/usr/bin/install -c" \
	../gnat1
make[3]: Entering directory `/home/guerby/work/gcc/build/gcc/ada'
make[3]: *** No rule to make target `xnmake.spt', needed by `../../../gcc/gcc/ada/nmake.ads'.  Stop.
make[3]: Leaving directory `/home/guerby/work/gcc/build/gcc/ada'
make[2]: *** [gnat1] Error 2
make[2]: Leaving directory `/home/guerby/work/gcc/build/gcc'
make[1]: *** [stage1_build] Error 2
make[1]: Leaving directory `/home/guerby/work/gcc/build/gcc'
make: *** [bootstrap] Error 2

<second error>

../../../gcc/gcc/ada/decl.c:298: `E_Component' undeclared (first use in this function)
../../../gcc/gcc/ada/decl.c:299: `E_Label' undeclared (first use in this function)
../../../gcc/gcc/ada/decl.c:299: `E_Constant' undeclared (first use in this function)
../../../gcc/gcc/ada/decl.c:301: `Type_Kind__First' undeclared (first use in this function)
../../../gcc/gcc/ada/decl.c:301: `Type_Kind__Last' undeclared (first use in this function)
../../../gcc/gcc/ada/decl.c:312: warning: implicit declaration of function `Is_Statically_Allocated'
../../../gcc/gcc/ada/decl.c:317: warning: implicit declaration of function `Has_Gigi_Rep_Item'
../../../gcc/gcc/ada/decl.c:338: warning: implicit declaration of function `Expression'
../../../gcc/gcc/ada/decl.c:339: warning: implicit declaration of function `No_Initialization'
../../../gcc/gcc/ada/decl.c:351: warning: implicit declaration of function `Renamed_Object'
../../../gcc/gcc/ada/decl.c:368: `E_Exception' undeclared (first use in this function)
../../../gcc/gcc/ada/decl.c:373: warning: implicit declaration of function `Is_VMS_Exception'
../../../gcc/gcc/ada/decl.c:379: warning: implicit declaration of function `Interface_Name'
../../../gcc/gcc/ada/decl.c:412: warning: implicit declaration of function `Base_Type'
../../../gcc/gcc/ada/decl.c:414: `E_Record_Subtype_With_Private' undeclared (first use in this function)
../../../gcc/gcc/ada/decl.c:414: `E_Record_Type_With_Private' undeclared (first use in this function)
../../../gcc/gcc/ada/decl.c:415: warning: implicit declaration of function `Original_Record_Component'
../../../gcc/gcc/ada/decl.c:432: warning: implicit declaration of function `Corresponding_Discriminant'
../../../gcc/gcc/ada/decl.c:433: warning: implicit declaration of function `Is_Tagged_Type'
../../../gcc/gcc/ada/decl.c:437: warning: implicit declaration of function `First_Discriminant'
../../../gcc/gcc/ada/decl.c:438: warning: implicit declaration of function `First_Girder_Discriminant'
../../../gcc/gcc/ada/decl.c:469: warning: implicit declaration of function `Is_Protected_Type'
../../../gcc/gcc/ada/decl.c:493: `E_Loop_Parameter' undeclared (first use in this function)
../../../gcc/gcc/ada/decl.c:494: `E_Out_Parameter' undeclared (first use in this function)
../../../gcc/gcc/ada/decl.c:495: `E_Variable' undeclared (first use in this function)
../../../gcc/gcc/ada/decl.c:504: warning: implicit declaration of function `Is_True_Constant'
../../../gcc/gcc/ada/decl.c:506: `N_Object_Declaration' undeclared (first use in this function)
../../../gcc/gcc/ada/decl.c:516: warning: implicit declaration of function `Renamed_Entity'
../../../gcc/gcc/ada/decl.c:523: warning: implicit declaration of function `Etype'
../../../gcc/gcc/ada/decl.c:559: warning: implicit declaration of function `Has_Biased_Representation'
../../../gcc/gcc/ada/decl.c:617: warning: implicit declaration of function `Is_Constr_Subt_For_UN_Aliased'
../../../gcc/gcc/ada/decl.c:618: warning: implicit declaration of function `Is_Array_Type'
../../../gcc/gcc/ada/decl.c:623: warning: implicit declaration of function `Known_Alignment'
../../../gcc/gcc/ada/decl.c:625: warning: implicit declaration of function `Alignment'
../../../gcc/gcc/ada/decl.c:638: warning: implicit declaration of function `Is_Atomic'
../../../gcc/gcc/ada/decl.c:677: warning: implicit declaration of function `Has_Atomic_Components'
../../../gcc/gcc/ada/decl.c:697: warning: implicit declaration of function `Is_Volatile'
../../../gcc/gcc/ada/decl.c:698: warning: implicit declaration of function `Is_Exported'
../../../gcc/gcc/ada/decl.c:770: `E_Class_Wide_Type' undeclared (first use in this function)
../../../gcc/gcc/ada/decl.c:777: warning: implicit declaration of function `Materialize_Entity'
../../../gcc/gcc/ada/decl.c:1041: warning: implicit declaration of function `Address_Taken'
../../../gcc/gcc/ada/decl.c:1042: warning: implicit declaration of function `Is_Aliased'
../../../gcc/gcc/ada/decl.c:1055: warning: implicit declaration of function `Has_Nested_Block_With_Handler'
../../../gcc/gcc/ada/decl.c:1063: warning: implicit declaration of function `Unknown_Alignment'
../../../gcc/gcc/ada/decl.c:1083: `E_Void' undeclared (first use in this function)
../../../gcc/gcc/ada/decl.c:1088: `E_Enumeration_Type' undeclared (first use in this function)
../../../gcc/gcc/ada/decl.c:1092: warning: implicit declaration of function `First_Literal'
../../../gcc/gcc/ada/decl.c:1113: warning: implicit declaration of function `Is_Unsigned_Type'
../../../gcc/gcc/ada/decl.c:1122: warning: implicit declaration of function `Next_Literal'
../../../gcc/gcc/ada/decl.c:1124: warning: implicit declaration of function `Enumeration_Rep'
../../../gcc/gcc/ada/decl.c:1143: `E_Signed_Integer_Type' undeclared (first use in this function)
../../../gcc/gcc/ada/decl.c:1144: `E_Ordinary_Fixed_Point_Type' undeclared (first use in this function)
../../../gcc/gcc/ada/decl.c:1145: `E_Decimal_Fixed_Point_Type' undeclared (first use in this function)
../../../gcc/gcc/ada/decl.c:1151: `E_Modular_Integer_Type' undeclared (first use in this function)
../../../gcc/gcc/ada/decl.c:1159: warning: implicit declaration of function `Is_Packed_Array_Type'
../../../gcc/gcc/ada/decl.c:1160: warning: implicit declaration of function `RM_Size'
../../../gcc/gcc/ada/decl.c:1178: warning: implicit declaration of function `Modulus'
../../../gcc/gcc/ada/decl.c:1215: `E_Signed_Integer_Subtype' undeclared (first use in this function)
../../../gcc/gcc/ada/decl.c:1216: `E_Enumeration_Subtype' undeclared (first use in this function)
../../../gcc/gcc/ada/decl.c:1217: `E_Modular_Integer_Subtype' undeclared (first use in this function)
../../../gcc/gcc/ada/decl.c:1218: `E_Ordinary_Fixed_Point_Subtype' undeclared (first use in this function)
../../../gcc/gcc/ada/decl.c:1219: `E_Decimal_Fixed_Point_Subtype' undeclared (first use in this function)
../../../gcc/gcc/ada/decl.c:1237: warning: implicit declaration of function `Ancestor_Subtype'
../../../gcc/gcc/ada/decl.c:1239: warning: implicit declaration of function `Type_Low_Bound'
../../../gcc/gcc/ada/decl.c:1240: warning: implicit declaration of function `Type_High_Bound'
../../../gcc/gcc/ada/decl.c:1312: `E_Floating_Point_Type' undeclared (first use in this function)
../../../gcc/gcc/ada/decl.c:1315: warning: implicit declaration of function `Vax_Float'
../../../gcc/gcc/ada/decl.c:1320: warning: implicit declaration of function `Digits_Value'
../../../gcc/gcc/ada/decl.c:1331: `E_Floating_Point_Subtype' undeclared (first use in this function)
../../../gcc/gcc/ada/decl.c:1398: `E_String_Type' undeclared (first use in this function)
../../../gcc/gcc/ada/decl.c:1399: `E_Array_Type' undeclared (first use in this function)
../../../gcc/gcc/ada/decl.c:1405: warning: implicit declaration of function `Number_Dimensions'
../../../gcc/gcc/ada/decl.c:1469: warning: implicit declaration of function `First_Index'
../../../gcc/gcc/ada/decl.c:1471: warning: implicit declaration of function `Implementation_Base_Type'
../../../gcc/gcc/ada/decl.c:1474: warning: implicit declaration of function `Next_Index'
../../../gcc/gcc/ada/decl.c:1541: warning: implicit declaration of function `Component_Type'
../../../gcc/gcc/ada/decl.c:1547: warning: implicit declaration of function `Component_Size'
../../../gcc/gcc/ada/decl.c:1549: warning: implicit declaration of function `Is_Bit_Packed_Array'
../../../gcc/gcc/ada/decl.c:1551: warning: implicit declaration of function `Has_Component_Size_Clause'
../../../gcc/gcc/ada/decl.c:1570: warning: implicit declaration of function `Has_Volatile_Components'
../../../gcc/gcc/ada/decl.c:1576: warning: implicit declaration of function `Unknown_Component_Size'
../../../gcc/gcc/ada/decl.c:1593: warning: implicit declaration of function `Has_Aliased_Components'
../../../gcc/gcc/ada/decl.c:1598: warning: implicit declaration of function `Packed_Array_Type'
../../../gcc/gcc/ada/decl.c:1658: `E_String_Subtype' undeclared (first use in this function)
../../../gcc/gcc/ada/decl.c:1659: `E_Array_Subtype' undeclared (first use in this function)
../../../gcc/gcc/ada/decl.c:1674: warning: implicit declaration of function `Is_Constrained'
../../../gcc/gcc/ada/decl.c:2085: warning: implicit declaration of function `Is_Packed'
../../../gcc/gcc/ada/decl.c:2090: `E_String_Literal_Subtype' undeclared (first use in this function)
../../../gcc/gcc/ada/decl.c:2094: `Private_Kind__First' undeclared (first use in this function)
../../../gcc/gcc/ada/decl.c:2094: `Private_Kind__Last' undeclared (first use in this function)
../../../gcc/gcc/ada/decl.c:2104: warning: implicit declaration of function `String_Literal_Low_Bound'
../../../gcc/gcc/ada/decl.c:2105: warning: implicit declaration of function `String_Literal_Length'
../../../gcc/gcc/ada/decl.c:2152: `E_Record_Type' undeclared (first use in this function)
../../../gcc/gcc/ada/decl.c:2175: warning: implicit declaration of function `Type_Definition'
../../../gcc/gcc/ada/decl.c:2181: warning: implicit declaration of function `Component_Alignment'
../../../gcc/gcc/ada/decl.c:2182: `Calign_Storage_Unit' undeclared (first use in this function)
../../../gcc/gcc/ada/decl.c:2184: warning: implicit declaration of function `Has_Specified_Layout'
../../../gcc/gcc/ada/decl.c:2188: `N_Derived_Type_Definition' undeclared (first use in this function)
../../../gcc/gcc/ada/decl.c:2192: warning: implicit declaration of function `First_Entity'
../../../gcc/gcc/ada/decl.c:2194: warning: implicit declaration of function `Next_Entity'
../../../gcc/gcc/ada/decl.c:2197: warning: implicit declaration of function `Component_Clause'
../../../gcc/gcc/ada/decl.c:2205: warning: implicit declaration of function `Record_Extension_Part'
../../../gcc/gcc/ada/decl.c:2208: warning: implicit declaration of function `Parent_Subtype'
../../../gcc/gcc/ada/decl.c:2271: warning: implicit declaration of function `Has_Discriminants'
../../../gcc/gcc/ada/decl.c:2274: warning: implicit declaration of function `Next_Girder_Discriminant'
../../../gcc/gcc/ada/decl.c:2301: warning: implicit declaration of function `Is_Unchecked_Union'
../../../gcc/gcc/ada/decl.c:2338: warning: implicit declaration of function `Component_List'
../../../gcc/gcc/ada/decl.c:2344: warning: implicit declaration of function `Is_By_Reference_Type'
../../../gcc/gcc/ada/decl.c:2370: warning: implicit declaration of function `Is_Limited_Record'
../../../gcc/gcc/ada/decl.c:2389: `E_Class_Wide_Subtype' undeclared (first use in this function)
../../../gcc/gcc/ada/decl.c:2394: warning: implicit declaration of function `Equivalent_Type'
../../../gcc/gcc/ada/decl.c:2403: `E_Record_Subtype' undeclared (first use in this function)
../../../gcc/gcc/ada/decl.c:2409: warning: implicit declaration of function `Cloned_Subtype'
../../../gcc/gcc/ada/decl.c:2458: `Record_Kind__First' undeclared (first use in this function)
../../../gcc/gcc/ada/decl.c:2458: `Record_Kind__Last' undeclared (first use in this function)
../../../gcc/gcc/ada/decl.c:2459: warning: implicit declaration of function `Is_For_Access_Subtype'
../../../gcc/gcc/ada/decl.c:2462: warning: implicit declaration of function `Girder_Constraint'
../../../gcc/gcc/ada/decl.c:2463: warning: implicit declaration of function `Discriminant_Constraint'
../../../gcc/gcc/ada/decl.c:2685: `E_Access_Subprogram_Type' undeclared (first use in this function)
../../../gcc/gcc/ada/decl.c:2696: warning: implicit declaration of function `Directly_Designated_Type'
../../../gcc/gcc/ada/decl.c:2712: `E_Allocator_Type' undeclared (first use in this function)
../../../gcc/gcc/ada/decl.c:2713: `E_Access_Type' undeclared (first use in this function)
../../../gcc/gcc/ada/decl.c:2714: `E_Access_Attribute_Type' undeclared (first use in this function)
../../../gcc/gcc/ada/decl.c:2715: `E_Anonymous_Access_Type' undeclared (first use in this function)
../../../gcc/gcc/ada/decl.c:2716: `E_General_Access_Type' undeclared (first use in this function)
../../../gcc/gcc/ada/decl.c:2743: warning: implicit declaration of function `Root_Type'
../../../gcc/gcc/ada/decl.c:2748: warning: implicit declaration of function `Is_Concurrent_Type'
../../../gcc/gcc/ada/decl.c:2749: warning: implicit declaration of function `Corresponding_Record_Type'
../../../gcc/gcc/ada/decl.c:2850: warning: implicit declaration of function `Is_Record_Type'
../../../gcc/gcc/ada/decl.c:2938: warning: implicit declaration of function `Freeze_Node'
../../../gcc/gcc/ada/decl.c:2962: warning: implicit declaration of function `Is_Frozen'
../../../gcc/gcc/ada/decl.c:3034: `E_Subprogram_Type' undeclared (first use in this function)
../../../gcc/gcc/ada/decl.c:3035: `E_Function' undeclared (first use in this function)
../../../gcc/gcc/ada/decl.c:3036: `E_Procedure' undeclared (first use in this function)
../../../gcc/gcc/ada/decl.c:3058: warning: implicit declaration of function `Is_Inlined'
../../../gcc/gcc/ada/decl.c:3062: warning: implicit declaration of function `Is_Pure'
../../../gcc/gcc/ada/decl.c:3063: warning: implicit declaration of function `No_Return'
../../../gcc/gcc/ada/decl.c:3079: warning: implicit declaration of function `Alias'
../../../gcc/gcc/ada/decl.c:3081: `E_Enumeration_Literal' undeclared (first use in this function)
../../../gcc/gcc/ada/decl.c:3088: warning: implicit declaration of function `First_Formal'
../../../gcc/gcc/ada/decl.c:3090: warning: implicit declaration of function `Next_Formal_With_Extras'
../../../gcc/gcc/ada/decl.c:3102: warning: implicit declaration of function `Returns_By_Ref'
../../../gcc/gcc/ada/decl.c:3134: warning: implicit declaration of function `Has_Foreign_Convention'
../../../gcc/gcc/ada/decl.c:3156: warning: implicit declaration of function `Is_Valued_Procedure'
../../../gcc/gcc/ada/decl.c:3158: warning: implicit declaration of function `Mechanism'
../../../gcc/gcc/ada/decl.c:3196: `E_In_Parameter' undeclared (first use in this function)
../../../gcc/gcc/ada/decl.c:3379: warning: implicit declaration of function `Function_Returns_With_DSP'
../../../gcc/gcc/ada/decl.c:3452: `E_Incomplete_Type' undeclared (first use in this function)
../../../gcc/gcc/ada/decl.c:3453: `E_Private_Type' undeclared (first use in this function)
../../../gcc/gcc/ada/decl.c:3454: `E_Limited_Private_Type' undeclared (first use in this function)
../../../gcc/gcc/ada/decl.c:3456: `E_Private_Subtype' undeclared (first use in this function)
../../../gcc/gcc/ada/decl.c:3457: `E_Limited_Private_Subtype' undeclared (first use in this function)
../../../gcc/gcc/ada/decl.c:3469: warning: implicit declaration of function `Underlying_Full_View'
../../../gcc/gcc/ada/decl.c:3523: `E_Task_Subtype' undeclared (first use in this function)
../../../gcc/gcc/ada/decl.c:3524: `E_Protected_Type' undeclared (first use in this function)
../../../gcc/gcc/ada/decl.c:3525: `E_Protected_Subtype' undeclared (first use in this function)
../../../gcc/gcc/ada/decl.c:3538: `E_Block' undeclared (first use in this function)
../../../gcc/gcc/ada/decl.c:3539: `E_Loop' undeclared (first use in this function)
../../../gcc/gcc/ada/decl.c:3546: warning: unreachable code at beginning of switch statement
../../../gcc/gcc/ada/decl.c:3833: warning: implicit declaration of function `Associated_Node_For_Itype'
../../../gcc/gcc/ada/decl.c: In function `elaborate_entity':
../../../gcc/gcc/ada/decl.c:3850: `E_Signed_Integer_Subtype' undeclared (first use in this function)
../../../gcc/gcc/ada/decl.c:3851: `E_Modular_Integer_Subtype' undeclared (first use in this function)
../../../gcc/gcc/ada/decl.c:3852: `E_Enumeration_Subtype' undeclared (first use in this function)
../../../gcc/gcc/ada/decl.c:3853: `E_Ordinary_Fixed_Point_Subtype' undeclared (first use in this function)
../../../gcc/gcc/ada/decl.c:3854: `E_Decimal_Fixed_Point_Subtype' undeclared (first use in this function)
../../../gcc/gcc/ada/decl.c:3855: `E_Floating_Point_Subtype' undeclared (first use in this function)
../../../gcc/gcc/ada/decl.c:3864: warning: implicit declaration of function `Raises_Constraint_Error'
../../../gcc/gcc/ada/decl.c:3873: `E_Record_Type' undeclared (first use in this function)
../../../gcc/gcc/ada/decl.c:3880: `N_Derived_Type_Definition' undeclared (first use in this function)
../../../gcc/gcc/ada/decl.c:3885: `E_Record_Subtype' undeclared (first use in this function)
../../../gcc/gcc/ada/decl.c:3886: `E_Private_Subtype' undeclared (first use in this function)
../../../gcc/gcc/ada/decl.c:3887: `E_Limited_Private_Subtype' undeclared (first use in this function)
../../../gcc/gcc/ada/decl.c:3888: `E_Record_Subtype_With_Private' undeclared (first use in this function)
../../../gcc/gcc/ada/decl.c:3900: warning: implicit declaration of function `Next_Discriminant'
../../../gcc/gcc/ada/decl.c:3903: warning: implicit declaration of function `Is_Access_Type'
../../../gcc/gcc/ada/decl.c:3910: warning: unreachable code at beginning of switch statement
../../../gcc/gcc/ada/decl.c: In function `mark_out_of_scope':
../../../gcc/gcc/ada/decl.c:3924: `Class_Wide_Kind__First' undeclared (first use in this function)
../../../gcc/gcc/ada/decl.c:3924: `Class_Wide_Kind__Last' undeclared (first use in this function)
../../../gcc/gcc/ada/decl.c:3924: `Concurrent_Kind__First' undeclared (first use in this function)
../../../gcc/gcc/ada/decl.c:3924: `Concurrent_Kind__Last' undeclared (first use in this function)
../../../gcc/gcc/ada/decl.c:3925: `Private_Kind__First' undeclared (first use in this function)
../../../gcc/gcc/ada/decl.c:3925: `Private_Kind__Last' undeclared (first use in this function)
../../../gcc/gcc/ada/decl.c:3926: `E_Block' undeclared (first use in this function)
../../../gcc/gcc/ada/decl.c:3926: `E_Entry' undeclared (first use in this function)
../../../gcc/gcc/ada/decl.c:3927: `E_Entry_Family' undeclared (first use in this function)
../../../gcc/gcc/ada/decl.c:3927: `E_Function' undeclared (first use in this function)
../../../gcc/gcc/ada/decl.c:3928: `E_Generic_Function' undeclared (first use in this function)
../../../gcc/gcc/ada/decl.c:3928: `E_Generic_Package' undeclared (first use in this function)
../../../gcc/gcc/ada/decl.c:3929: `E_Generic_Procedure' undeclared (first use in this function)
../../../gcc/gcc/ada/decl.c:3929: `E_Loop' undeclared (first use in this function)
../../../gcc/gcc/ada/decl.c:3929: `E_Operator' undeclared (first use in this function)
../../../gcc/gcc/ada/decl.c:3930: `E_Package' undeclared (first use in this function)
../../../gcc/gcc/ada/decl.c:3930: `E_Package_Body' undeclared (first use in this function)
../../../gcc/gcc/ada/decl.c:3931: `E_Procedure' undeclared (first use in this function)
../../../gcc/gcc/ada/decl.c:3931: `E_Record_Type' undeclared (first use in this function)
../../../gcc/gcc/ada/decl.c:3932: `E_Record_Subtype' undeclared (first use in this function)
../../../gcc/gcc/ada/decl.c:3932: `E_Subprogram_Body' undeclared (first use in this function)
../../../gcc/gcc/ada/decl.c:3932: `E_Subprogram_Type' undeclared (first use in this function)
../../../gcc/gcc/ada/decl.c:3945: `Formal_Kind__First' undeclared (first use in this function)
../../../gcc/gcc/ada/decl.c:3945: `Formal_Kind__Last' undeclared (first use in this function)
../../../gcc/gcc/ada/decl.c: In function `make_dummy_type':
../../../gcc/gcc/ada/decl.c:4023: warning: implicit declaration of function `Is_Class_Wide_Type'
../../../gcc/gcc/ada/decl.c:4025: `E_Class_Wide_Type' undeclared (first use in this function)
../../../gcc/gcc/ada/decl.c:4029: `Incomplete_Or_Private_Kind__First' undeclared (first use in this function)
../../../gcc/gcc/ada/decl.c:4029: `Incomplete_Or_Private_Kind__Last' undeclared (first use in this function)
../../../gcc/gcc/ada/decl.c: In function `build_attr_list':
../../../gcc/gcc/ada/decl.c:4087: warning: implicit declaration of function `First_Rep_Item'
../../../gcc/gcc/ada/decl.c:4088: warning: implicit declaration of function `Next_Rep_Item'
../../../gcc/gcc/ada/decl.c:4089: `N_Pragma' undeclared (first use in this function)
../../../gcc/gcc/ada/decl.c:4093: warning: implicit declaration of function `Pragma_Argument_Associations'
../../../gcc/gcc/ada/decl.c:4099: `N_String_Literal' undeclared (first use in this function)
../../../gcc/gcc/ada/decl.c:4115: warning: implicit declaration of function `Chars'
../../../gcc/gcc/ada/decl.c: In function `elaborate_expression':
../../../gcc/gcc/ada/decl.c:4221: `N_Identifier' undeclared (first use in this function)
../../../gcc/gcc/ada/decl.c:4221: warning: implicit declaration of function `Entity'
../../../gcc/gcc/ada/decl.c:4221: `E_Discriminant' undeclared (first use in this function)
../../../gcc/gcc/ada/decl.c: In function `maybe_pad_type':
../../../gcc/gcc/ada/decl.c:4589: `E_Component' undeclared (first use in this function)
../../../gcc/gcc/ada/decl.c:4589: `E_Discriminant' undeclared (first use in this function)
../../../gcc/gcc/ada/decl.c:4591: warning: implicit declaration of function `Last_Bit'
../../../gcc/gcc/ada/decl.c:4592: warning: implicit declaration of function `Size_Clause'
../../../gcc/gcc/ada/decl.c:4603: warning: implicit declaration of function `Is_Internal'
../../../gcc/gcc/ada/decl.c: In function `choices_to_gnu':
../../../gcc/gcc/ada/decl.c:4629: `N_Range' undeclared (first use in this function)
../../../gcc/gcc/ada/decl.c:4630: warning: implicit declaration of function `Low_Bound'
../../../gcc/gcc/ada/decl.c:4631: warning: implicit declaration of function `High_Bound'
../../../gcc/gcc/ada/decl.c:4644: `N_Subtype_Indication' undeclared (first use in this function)
../../../gcc/gcc/ada/decl.c:4645: warning: implicit declaration of function `Range_Expression'
../../../gcc/gcc/ada/decl.c:4645: warning: implicit declaration of function `Constraint'
../../../gcc/gcc/ada/decl.c:4657: `N_Identifier' undeclared (first use in this function)
../../../gcc/gcc/ada/decl.c:4658: `N_Expanded_Name' undeclared (first use in this function)
../../../gcc/gcc/ada/decl.c:4663: `E_Enumeration_Literal' undeclared (first use in this function)
../../../gcc/gcc/ada/decl.c:4663: `E_Constant' undeclared (first use in this function)
../../../gcc/gcc/ada/decl.c:4679: `N_Character_Literal' undeclared (first use in this function)
../../../gcc/gcc/ada/decl.c:4680: `N_Integer_Literal' undeclared (first use in this function)
../../../gcc/gcc/ada/decl.c:4686: `N_Others_Choice' undeclared (first use in this function)
../../../gcc/gcc/ada/decl.c:4690: warning: unreachable code at beginning of switch statement
../../../gcc/gcc/ada/decl.c: In function `gnat_to_gnu_field':
../../../gcc/gcc/ada/decl.c:4723: warning: implicit declaration of function `Strict_Alignment'
../../../gcc/gcc/ada/decl.c:4739: warning: implicit declaration of function `Known_Static_Esize'
../../../gcc/gcc/ada/decl.c:4761: warning: implicit declaration of function `Component_Bit_Offset'
../../../gcc/gcc/ada/decl.c:4778: warning: implicit declaration of function `First_Bit'
../../../gcc/gcc/ada/decl.c:4923: `E_Discriminant' undeclared (first use in this function)
../../../gcc/gcc/ada/decl.c:4925: warning: implicit declaration of function `Discriminant_Number'
../../../gcc/gcc/ada/decl.c: In function `components_to_record':
../../../gcc/gcc/ada/decl.c:4982: warning: implicit declaration of function `Component_Items'
../../../gcc/gcc/ada/decl.c:5011: warning: implicit declaration of function `Variant_Part'
../../../gcc/gcc/ada/decl.c:5016: warning: implicit declaration of function `Variants'
../../../gcc/gcc/ada/decl.c:5037: warning: implicit declaration of function `Name'
../../../gcc/gcc/ada/decl.c:5079: warning: implicit declaration of function `Discrete_Choices'
../../../gcc/gcc/ada/decl.c: In function `annotate_value':
../../../gcc/gcc/ada/decl.c:5284: warning: comparison between signed and unsigned
../../../gcc/gcc/ada/decl.c: In function `annotate_rep':
../../../gcc/gcc/ada/decl.c:5374: `E_Component' undeclared (first use in this function)
../../../gcc/gcc/ada/decl.c:5375: `E_Discriminant' undeclared (first use in this function)
../../../gcc/gcc/ada/decl.c: In function `validate_size':
../../../gcc/gcc/ada/decl.c:5461: `E_Component' undeclared (first use in this function)
../../../gcc/gcc/ada/decl.c:5461: `E_Discriminant' undeclared (first use in this function)
../../../gcc/gcc/ada/decl.c: In function `set_rm_size':
../../../gcc/gcc/ada/decl.c:5599: warning: implicit declaration of function `Is_Discrete_Or_Fixed_Point_Type'
../../../gcc/gcc/ada/decl.c: In function `validate_alignment':
../../../gcc/gcc/ada/decl.c:5726: warning: implicit declaration of function `Alignment_Clause'
../../../gcc/gcc/ada/decl.c:5740: warning: implicit declaration of function `From_At_Mod'
../../../gcc/gcc/ada/decl.c: In function `check_ok_for_atomic':
../../../gcc/gcc/ada/decl.c:5811: `N_Pragma' undeclared (first use in this function)
make[3]: *** [decl.o] Error 1
make[3]: Leaving directory `/home/guerby/work/gcc/build/gcc/ada'
make[2]: *** [gnat1] Error 2
make[2]: Leaving directory `/home/guerby/work/gcc/build/gcc'
make[1]: *** [stage1_build] Error 2
make[1]: Leaving directory `/home/guerby/work/gcc/build/gcc'
make: *** [bootstrap] Error 2


Index Nav: [Date Index] [Subject Index] [Author Index] [Thread Index]
Message Nav: [Date Prev] [Date Next] [Thread Prev] [Thread Next]