This is the mail archive of the gcc@gcc.gnu.org mailing list for the GCC project.


Index Nav: [Date Index] [Subject Index] [Author Index] [Thread Index]
Message Nav: [Date Prev] [Date Next] [Thread Prev] [Thread Next]

unwind-dw2.c: 2 new branch build failures overnight.


The first target gets an ICE when building unwind-dw2.c

The second doesn't ICE when building that file, but instead
the assembler spits up at the input.

----- Forwarded message from Robert Lipe <robertl@sco.com> -----

Updating CVS tree
P gcc/ChangeLog
P gcc/Makefile.in
cvs server: warning: gcc/README.RS6000 is not (any longer) pertinent
cvs server: warning: gcc/assert.h is not (any longer) pertinent
P gcc/config.in
P gcc/configure
P gcc/configure.in
P gcc/cpplex.c
P gcc/cross-make
P gcc/dwarf2asm.c
P gcc/dwarf2asm.h
P gcc/dwarf2out.c
P gcc/except.c
P gcc/gcc.c
P gcc/libgcc-std.ver
P gcc/libgcc2.c
P gcc/mklibgcc.in
P gcc/sys-protos.h
P gcc/toplev.c
P gcc/unwind-dw2-fde.c
P gcc/unwind-dw2-fde.h
P gcc/unwind-dw2.c
P gcc/unwind-pe.h
P gcc/version.c
P gcc/config/t-freebsd
P gcc/config/t-linux
P gcc/config/t-linux-aout
P gcc/config/t-netbsd
P gcc/config/t-openbsd
P gcc/config/t-rtems
P gcc/config/x-linux
P gcc/config/alpha/t-interix
P gcc/config/i386/i386.h
P gcc/config/i386/i386.md
P gcc/config/i386/t-beos
P gcc/config/i386/t-interix
P gcc/config/mcore/t-mcore
P gcc/config/mcore/t-mcore-pe
P gcc/config/pa/pa-hpux10.h
P gcc/config/pa/pa32-regs.h
P gcc/cp/ChangeLog
P gcc/cp/spew.c
U gcc/doc/install.texi
P gcc/f/version.c
P gcc/fixinc/fixinc.dgux
P gcc/fixinc/fixinc.interix
P gcc/fixinc/fixinc.ptx
P gcc/fixinc/fixinc.svr4
P gcc/fixinc/fixinc.winnt
P gcc/fixinc/fixinc.wrap
P gcc/fixinc/fixincl.sh
P gcc/fixinc/fixincl.x
P gcc/fixinc/inclhack.def
M gcc/java/parse.c
P gcc/po/ChangeLog
P gcc/po/POTFILES.in
P gcc/testsuite/ChangeLog
U gcc/testsuite/g++.old-deja/g++.other/crash41.C
cvs server: [01:04:44] waiting for anoncvs's lock in /cvs/gcc/egcs/gcc/testsuite/gcc.dg/special
cvs server: [01:05:14] obtained lock in /cvs/gcc/egcs/gcc/testsuite/gcc.dg/special
P libf2c/ChangeLog
P libf2c/libF77/Version.c
P libf2c/libI77/Makefile.in
P libf2c/libI77/Version.c
P libf2c/libI77/backspace.c
P libf2c/libI77/close.c
U libf2c/libI77/config.h.in
P libf2c/libI77/configure
P libf2c/libI77/configure.in
P libf2c/libI77/dfe.c
P libf2c/libI77/dolio.c
P libf2c/libI77/due.c
P libf2c/libI77/endfile.c
P libf2c/libI77/err.c
P libf2c/libI77/fmt.c
P libf2c/libI77/fmtlib.c
P libf2c/libI77/ftell_.c
P libf2c/libI77/ilnw.c
P libf2c/libI77/lread.c
P libf2c/libI77/open.c
P libf2c/libI77/rdfmt.c
P libf2c/libI77/rsfe.c
P libf2c/libI77/rsne.c
P libf2c/libI77/sue.c
P libf2c/libI77/typesize.c
P libf2c/libI77/util.c
P libf2c/libI77/wrtfmt.c
P libf2c/libI77/wsle.c
P libf2c/libI77/xwsne.c
P libf2c/libU77/Version.c
cvs server: [01:06:01] waiting for schwab's lock in /cvs/gcc/egcs/libstdc++-v3/config/os/newlib/bits
cvs server: [01:06:31] obtained lock in /cvs/gcc/egcs/libstdc++-v3/config/os/newlib/bits
Adjusting file timestamps
Touching gcc/cstamp-h.in...
Touching gcc/config.in...
/play/egcs/gcc/unwind-dw2.c:219: warning: implicit declaration of function `strlen'
/play/egcs/gcc/unwind-dw2.c: In function `execute_cfa_program':
/play/egcs/gcc/unwind-dw2.c:776: warning: implicit declaration of function `alloca'
/play/egcs/gcc/unwind-dw2.c: In function `uw_frame_state_for':
/play/egcs/gcc/unwind-dw2.c:881: warning: implicit declaration of function `memset'
/play/egcs/gcc/unwind-dw2.c: In function `uw_install_context_1':
/play/egcs/gcc/unwind-dw2.c:1098: warning: implicit declaration of function `memcpy'
/play/egcs/gcc/unwind-dw2.c: At top level:
/play/egcs/gcc/unwind-dw2.c:1118: Internal compiler error in ?, at dwarf2asm.c:1001
Please submit a full bug report, with preprocessed source if appropriate.
See <URL:http://www.gnu.org/software/gcc/bugs.html> for instructions.
make[3]: *** [libgcc/./unwind-dw2.o] Error 1
make[2]: *** [libgcc.a] Error 2
make[1]: *** [stage1_build] Error 2
make: *** [bootstrap] Error 2
=-=-=-=-=-=-=-=-=-=-=-=-=-=-=-=-=-=-=-=-=-=-
UX:as: ERROR: /var/tmp/ccY4crmd.s:3318:defined relocatable values from the same section required, op -
UX:as: ERROR: /var/tmp/ccY4crmd.s:3357:defined relocatable values from the same section required, op -
UX:as: ERROR: /var/tmp/ccY4crmd.s:3392:defined relocatable values from the same section required, op -
UX:as: ERROR: /var/tmp/ccY4crmd.s:3423:defined relocatable values from the same section required, op -
UX:as: ERROR: /var/tmp/ccY4crmd.s:3458:defined relocatable values from the same section required, op -
UX:as: ERROR: /var/tmp/ccY4crmd.s:3489:defined relocatable values from the same section required, op -
UX:as: ERROR: /var/tmp/ccY4crmd.s:3532:defined relocatable values from the same section required, op -
UX:as: ERROR: /var/tmp/ccY4crmd.s:3575:defined relocatable values from the same section required, op -
UX:as: ERROR: /var/tmp/ccY4crmd.s:3612:defined relocatable values from the same section required, op -
UX:as: ERROR: /var/tmp/ccY4crmd.s:3647:defined relocatable values from the same section required, op -
UX:as: ERROR: /var/tmp/ccY4crmd.s:3686:defined relocatable values from the same section required, op -
make[3]: *** [libgcc/./unwind-dw2.o] Error 1
make[2]: *** [libgcc.a] Error 2
make[1]: *** [stage1_build] Error 2
make: *** [bootstrap] Error 2

----- End forwarded message -----


Index Nav: [Date Index] [Subject Index] [Author Index] [Thread Index]
Message Nav: [Date Prev] [Date Next] [Thread Prev] [Thread Next]