This is the mail archive of the gcc-testresults@gcc.gnu.org mailing list for the GCC project.


Index Nav: [Date Index] [Subject Index] [Author Index] [Thread Index]
Message Nav: [Date Prev] [Date Next] [Thread Prev] [Thread Next]
Other format: [Raw text]

Results for 4.5.0 (GCC) testsuite on alphaev68-dec-osf5.1a


gcc built with "make -j 3".

(There are small differences between plain "make" and "bootstrap4-lean",
which I'll file a later report)

----
Testing and re-testing all recent gcc versions, due to
discovering about mpfr 3.1.x not working correctly.

This test built and ran with:
gmp-4.3.2
mpfr-3.0.0
mpc-0.9

See also:
Bug 44959 - [4.6 Regression] bootstrap failed at Comparing stages 2 and 3
Bug 40894 - [4.4/4.5/4.6/4.7 Regression] bootstrap4-lean failed crtfastmath.o comparision
Bug 40947 - Invalid flag usage: Wl,-rpath, -Wx,-option must appear after -_SYSTYPE_SVR4
---
LAST_UPDATED: Obtained from SVN: tags/gcc_4_5_0_release revision 158339

Native configuration is alphaev68-dec-osf5.1a

		=== libffi tests ===


Running target unix
FAIL: libffi.call/huge_struct.c -O0 -W -Wall execution test
FAIL: libffi.call/huge_struct.c -O2 execution test
FAIL: libffi.call/huge_struct.c -O3 execution test
FAIL: libffi.call/huge_struct.c -Os execution test
FAIL: libffi.call/huge_struct.c -O2 -fomit-frame-pointer execution test
FAIL: libffi.special/unwindtest.cc  -shared-libgcc -lstdc++ execution test
FAIL: libffi.special/unwindtest_ffi_call.cc  -shared-libgcc -lstdc++ execution test
FAIL: libffi.special/unwindtest.cc  -shared-libgcc -lstdc++ execution test
FAIL: libffi.special/unwindtest_ffi_call.cc  -shared-libgcc -lstdc++ execution test
FAIL: libffi.special/unwindtest.cc  -shared-libgcc -lstdc++ execution test
FAIL: libffi.special/unwindtest_ffi_call.cc  -shared-libgcc -lstdc++ execution test
FAIL: libffi.special/unwindtest.cc  -shared-libgcc -lstdc++ execution test
FAIL: libffi.special/unwindtest_ffi_call.cc  -shared-libgcc -lstdc++ execution test

		=== libffi Summary ===

# of expected passes		1598
# of unexpected failures	13
# of expected failures		10
# of unsupported tests		15
		=== libgomp tests ===


Running target unix

		=== libgomp Summary ===

# of expected passes		2456
# of unsupported tests		2
		=== libjava tests ===


Running target unix
FAIL: linking PR9577
FAIL: linking longfield
FAIL: linking shortfield
FAIL: linking TestClosureGC
FAIL: linking simple
FAIL: linking PR15133
FAIL: linking PR18116
FAIL: linking PR28178
FAIL: linking bytebuffer
FAIL: linking calls
FAIL: linking cxxtest
FAIL: linking directbuffer
FAIL: linking field
FAIL: linking final_method
FAIL: linking findclass
FAIL: linking findclass2
FAIL: linking iface
FAIL: linking init
FAIL: linking invoke
FAIL: linking jniutf
FAIL: linking martin
FAIL: linking noclass
FAIL: linking overload
FAIL: linking pr11951
FAIL: linking pr18278
FAIL: linking pr23739
FAIL: linking register
FAIL: linking register2
FAIL: linking simple_int
FAIL: linking throwit
FAIL: linking virtual
FAIL: PR16923 run
ERROR:  does not exist in unix_load.
UNRESOLVED: getargssize run
ERROR:  does not exist in unix_load.
UNRESOLVED: getlocalvartable run
ERROR:  does not exist in unix_load.
UNRESOLVED: getstacktrace run
FAIL: natevents.cc compilation
FAIL: natgetallthreads.cc compilation
FAIL: natgeterrorname.cc compilation
FAIL: natgetmethodname.cc compilation
FAIL: ArrayStore compilation from source
FAIL: ArrayStore -findirect-dispatch compilation from source
FAIL: ArrayStore -O3 compilation from source
FAIL: ArrayStore -O3 -findirect-dispatch compilation from source
FAIL: ArrayStore2 compilation from source
FAIL: ArrayStore2 -findirect-dispatch compilation from source
FAIL: ArrayStore2 -O3 compilation from source
FAIL: ArrayStore2 -O3 -findirect-dispatch compilation from source
FAIL: Array_1 compilation from source
FAIL: Array_1 -findirect-dispatch compilation from source
FAIL: Array_1 -O3 compilation from source
FAIL: Array_1 -O3 -findirect-dispatch compilation from source
FAIL: Array_2 compilation from source
FAIL: Array_2 -findirect-dispatch compilation from source
FAIL: Array_2 -O3 compilation from source
FAIL: Array_2 -O3 -findirect-dispatch compilation from source
FAIL: Array_3 compilation from source
FAIL: Array_3 -findirect-dispatch compilation from source
FAIL: Array_3 -O3 compilation from source
FAIL: Array_3 -O3 -findirect-dispatch compilation from source
FAIL: Class_1 compilation from source
FAIL: Class_1 -findirect-dispatch compilation from source
FAIL: Class_1 -O3 compilation from source
FAIL: Class_1 -O3 -findirect-dispatch compilation from source
FAIL: CompareNaN compilation from source
FAIL: CompareNaN -findirect-dispatch compilation from source
FAIL: CompareNaN -O3 compilation from source
FAIL: CompareNaN -O3 -findirect-dispatch compilation from source
FAIL: Divide_1 compilation from source
FAIL: Divide_1 -findirect-dispatch compilation from source
FAIL: Divide_1 -O3 compilation from source
FAIL: Divide_1 -O3 -findirect-dispatch compilation from source
FAIL: Divide_2 compilation from source
FAIL: Divide_2 -findirect-dispatch compilation from source
FAIL: Divide_2 -O3 compilation from source
FAIL: Divide_2 -O3 -findirect-dispatch compilation from source
FAIL: EvaluationOrder compilation from source
FAIL: EvaluationOrder -findirect-dispatch compilation from source
FAIL: EvaluationOrder -O3 compilation from source
FAIL: EvaluationOrder -O3 -findirect-dispatch compilation from source
FAIL: ExtraClassLoader compilation from source
FAIL: ExtraClassLoader -findirect-dispatch compilation from source
FAIL: ExtraClassLoader -O3 compilation from source
FAIL: ExtraClassLoader -O3 -findirect-dispatch compilation from source
FAIL: FileHandleGcTest compilation from source
FAIL: FileHandleGcTest -findirect-dispatch compilation from source
FAIL: FileHandleGcTest -O3 compilation from source
FAIL: FileHandleGcTest -O3 -findirect-dispatch compilation from source
FAIL: Final compilation from source
FAIL: Final -findirect-dispatch compilation from source
FAIL: Final -O3 compilation from source
FAIL: Final -O3 -findirect-dispatch compilation from source
FAIL: Float_1 compilation from source
FAIL: Float_1 -findirect-dispatch compilation from source
FAIL: Float_1 -O3 compilation from source
FAIL: Float_1 -O3 -findirect-dispatch compilation from source
FAIL: Float_2 compilation from source
FAIL: Float_2 -findirect-dispatch compilation from source
FAIL: Float_2 -O3 compilation from source
FAIL: Float_2 -O3 -findirect-dispatch compilation from source
FAIL: G19990301_01 compilation from source
FAIL: G19990301_01 -findirect-dispatch compilation from source
FAIL: G19990301_01 -O3 compilation from source
FAIL: G19990301_01 -O3 -findirect-dispatch compilation from source
FAIL: G19990302_02 compilation from source
FAIL: G19990302_02 -findirect-dispatch compilation from source
FAIL: G19990302_02 -O3 compilation from source
FAIL: G19990302_02 -O3 -findirect-dispatch compilation from source
FAIL: G19990303_01 compilation from source
FAIL: G19990303_01 -findirect-dispatch compilation from source
FAIL: G19990303_01 -O3 compilation from source
FAIL: G19990303_01 -O3 -findirect-dispatch compilation from source
FAIL: G19990303_02 compilation from source
FAIL: G19990303_02 -findirect-dispatch compilation from source
FAIL: G19990303_02 -O3 compilation from source
FAIL: G19990303_02 -O3 -findirect-dispatch compilation from source
FAIL: G19990304_01 compilation from source
FAIL: G19990304_01 -findirect-dispatch compilation from source
FAIL: G19990304_01 -O3 compilation from source
FAIL: G19990304_01 -O3 -findirect-dispatch compilation from source
FAIL: G19990310_01 compilation from source
FAIL: G19990310_01 -findirect-dispatch compilation from source
FAIL: G19990310_01 -O3 compilation from source
FAIL: G19990310_01 -O3 -findirect-dispatch compilation from source
FAIL: II compilation from source
FAIL: II -findirect-dispatch compilation from source
FAIL: II -O3 compilation from source
FAIL: II -O3 -findirect-dispatch compilation from source
FAIL: InterfaceDispatch compilation from source
FAIL: InterfaceDispatch -findirect-dispatch compilation from source
FAIL: InterfaceDispatch -O3 compilation from source
FAIL: InterfaceDispatch -O3 -findirect-dispatch compilation from source
FAIL: InvokeInterface compilation from source
FAIL: InvokeInterface -findirect-dispatch compilation from source
FAIL: InvokeInterface -O3 compilation from source
FAIL: InvokeInterface -O3 -findirect-dispatch compilation from source
FAIL: InvokeReturn compilation from source
FAIL: InvokeReturn -findirect-dispatch compilation from source
FAIL: InvokeReturn -O3 compilation from source
FAIL: InvokeReturn -O3 -findirect-dispatch compilation from source
FAIL: Invoke_1 compilation from source
FAIL: Invoke_1 -findirect-dispatch compilation from source
FAIL: Invoke_1 -O3 compilation from source
FAIL: Invoke_1 -O3 -findirect-dispatch compilation from source
FAIL: Invoke_2 compilation from source
FAIL: Invoke_2 -findirect-dispatch compilation from source
FAIL: Invoke_2 -O3 compilation from source
FAIL: Invoke_2 -O3 -findirect-dispatch compilation from source
FAIL: KeepInline compilation from source
FAIL: KeepInline -findirect-dispatch compilation from source
FAIL: KeepInline -O3 compilation from source
FAIL: KeepInline -O3 -findirect-dispatch compilation from source
FAIL: LargeFile compilation from source
FAIL: LargeFile -findirect-dispatch compilation from source
FAIL: LargeFile -O3 compilation from source
FAIL: LargeFile -O3 -findirect-dispatch compilation from source
FAIL: MathBuiltin compilation from source
FAIL: MathBuiltin -findirect-dispatch compilation from source
FAIL: MathBuiltin -O3 compilation from source
FAIL: MathBuiltin -O3 -findirect-dispatch compilation from source
FAIL: Matrix4f compilation from source
FAIL: Matrix4f -findirect-dispatch compilation from source
FAIL: Matrix4f -O3 compilation from source
FAIL: Matrix4f -O3 -findirect-dispatch compilation from source
FAIL: N19990310_02 compilation from source
FAIL: N19990310_02 -findirect-dispatch compilation from source
FAIL: N19990310_02 -O3 compilation from source
FAIL: N19990310_02 -O3 -findirect-dispatch compilation from source
FAIL: N19990310_3 compilation from source
FAIL: N19990310_3 -findirect-dispatch compilation from source
FAIL: N19990310_3 -O3 compilation from source
FAIL: N19990310_3 -O3 -findirect-dispatch compilation from source
FAIL: N19990310_4 compilation from source
FAIL: N19990310_4 -findirect-dispatch compilation from source
FAIL: N19990310_4 -O3 compilation from source
FAIL: N19990310_4 -O3 -findirect-dispatch compilation from source
FAIL: N19990310_5 compilation from source
FAIL: N19990310_5 -findirect-dispatch compilation from source
FAIL: N19990310_5 -O3 compilation from source
FAIL: N19990310_5 -O3 -findirect-dispatch compilation from source
FAIL: Overflow compilation from source
FAIL: Overflow -findirect-dispatch compilation from source
FAIL: Overflow -O3 compilation from source
FAIL: Overflow -O3 -findirect-dispatch compilation from source
FAIL: PR12350 compilation from source
FAIL: PR12350 -findirect-dispatch compilation from source
FAIL: PR12350 -O3 compilation from source
FAIL: PR12350 -O3 -findirect-dispatch compilation from source
FAIL: PR12416 compilation from source
FAIL: PR12416 -findirect-dispatch compilation from source
FAIL: PR12416 -O3 compilation from source
FAIL: PR12416 -O3 -findirect-dispatch compilation from source
FAIL: PR12656 compilation from source
FAIL: PR12656 -findirect-dispatch compilation from source
FAIL: PR12656 -O3 compilation from source
FAIL: PR12656 -O3 -findirect-dispatch compilation from source
FAIL: PR12915 compilation from source
FAIL: PR12915 -findirect-dispatch compilation from source
FAIL: PR12915 -O3 compilation from source
FAIL: PR12915 -O3 -findirect-dispatch compilation from source
FAIL: PR141 compilation from source
FAIL: PR141 -findirect-dispatch compilation from source
FAIL: PR141 -O3 compilation from source
FAIL: PR141 -O3 -findirect-dispatch compilation from source
FAIL: PR160 compilation from source
FAIL: PR160 -findirect-dispatch compilation from source
FAIL: PR160 -O3 compilation from source
FAIL: PR160 -O3 -findirect-dispatch compilation from source
FAIL: PR162 compilation from source
FAIL: PR162 -findirect-dispatch compilation from source
FAIL: PR162 -O3 compilation from source
FAIL: PR162 -O3 -findirect-dispatch compilation from source
FAIL: PR16867 compilation from source
FAIL: PR16867 -findirect-dispatch compilation from source
FAIL: PR16867 -O3 compilation from source
FAIL: PR16867 -O3 -findirect-dispatch compilation from source
FAIL: PR18699 compilation from source
FAIL: PR18699 -findirect-dispatch compilation from source
FAIL: PR18699 -O3 compilation from source
FAIL: PR18699 -O3 -findirect-dispatch compilation from source
FAIL: PR19870 compilation from source
FAIL: PR19870 -findirect-dispatch compilation from source
FAIL: PR19870 -O3 compilation from source
FAIL: PR19870 -O3 -findirect-dispatch compilation from source
FAIL: PR19870_2 compilation from source
FAIL: PR19870_2 -findirect-dispatch compilation from source
FAIL: PR19870_2 -O3 compilation from source
FAIL: PR19870_2 -O3 -findirect-dispatch compilation from source
FAIL: PR19921 compilation from source
FAIL: PR19921 -findirect-dispatch compilation from source
FAIL: PR19921 -O3 compilation from source
FAIL: PR19921 -O3 -findirect-dispatch compilation from source
FAIL: PR20056 compilation from source
FAIL: PR20056 -findirect-dispatch compilation from source
FAIL: PR20056 -O3 compilation from source
FAIL: PR20056 -O3 -findirect-dispatch compilation from source
FAIL: PR218 compilation from source
FAIL: PR218 -findirect-dispatch compilation from source
FAIL: PR218 -O3 compilation from source
FAIL: PR218 -O3 -findirect-dispatch compilation from source
FAIL: PR242 compilation from source
FAIL: PR242 -findirect-dispatch compilation from source
FAIL: PR242 -O3 compilation from source
FAIL: PR242 -O3 -findirect-dispatch compilation from source
FAIL: PR25535 compilation from source
FAIL: PR25535 -findirect-dispatch compilation from source
FAIL: PR25535 -O3 compilation from source
FAIL: PR25535 -O3 -findirect-dispatch compilation from source
FAIL: PR260 compilation from source
FAIL: PR260 -findirect-dispatch compilation from source
FAIL: PR260 -O3 compilation from source
FAIL: PR260 -O3 -findirect-dispatch compilation from source
FAIL: PR26858 compilation from source
FAIL: PR26858 -findirect-dispatch compilation from source
FAIL: PR26858 -O3 compilation from source
FAIL: PR26858 -O3 -findirect-dispatch compilation from source
FAIL: PR27908 compilation from source
FAIL: PR27908 -findirect-dispatch compilation from source
FAIL: PR27908 -O3 compilation from source
FAIL: PR27908 -O3 -findirect-dispatch compilation from source
FAIL: PR29013 compilation from source
FAIL: PR29013 -findirect-dispatch compilation from source
FAIL: PR29013 -O3 compilation from source
FAIL: PR29013 -O3 -findirect-dispatch compilation from source
FAIL: PR29495 compilation from source
FAIL: PR29495 -findirect-dispatch compilation from source
FAIL: PR29495 -O3 compilation from source
FAIL: PR29495 -O3 -findirect-dispatch compilation from source
FAIL: PR3096 compilation from source
FAIL: PR3096 -findirect-dispatch compilation from source
FAIL: PR3096 -O3 compilation from source
FAIL: PR3096 -O3 -findirect-dispatch compilation from source
FAIL: PR31264 compilation from source
FAIL: PR31264 -findirect-dispatch compilation from source
FAIL: PR31264 -O3 compilation from source
FAIL: PR31264 -O3 -findirect-dispatch compilation from source
FAIL: PR35020 compilation from source
FAIL: PR35020 -findirect-dispatch compilation from source
FAIL: PR35020 -O3 compilation from source
FAIL: PR35020 -O3 -findirect-dispatch compilation from source
FAIL: PR36252 compilation from source
FAIL: PR36252 -findirect-dispatch compilation from source
FAIL: PR36252 -O3 compilation from source
FAIL: PR36252 -O3 -findirect-dispatch compilation from source
FAIL: PR3731 compilation from source
FAIL: PR3731 -findirect-dispatch compilation from source
FAIL: PR3731 -O3 compilation from source
FAIL: PR3731 -O3 -findirect-dispatch compilation from source
FAIL: PR5057 compilation from source
FAIL: PR5057 -findirect-dispatch compilation from source
FAIL: PR5057 -O3 compilation from source
FAIL: PR5057 -O3 -findirect-dispatch compilation from source
FAIL: PR5057_2 compilation from source
FAIL: PR5057_2 -findirect-dispatch compilation from source
FAIL: PR5057_2 -O3 compilation from source
FAIL: PR5057_2 -O3 -findirect-dispatch compilation from source
FAIL: PR55 compilation from source
FAIL: PR55 -findirect-dispatch compilation from source
FAIL: PR55 -O3 compilation from source
FAIL: PR55 -O3 -findirect-dispatch compilation from source
FAIL: PR56 compilation from source
FAIL: PR56 -findirect-dispatch compilation from source
FAIL: PR56 -O3 compilation from source
FAIL: PR56 -O3 -findirect-dispatch compilation from source
FAIL: PR6085 compilation from source
FAIL: PR6085 -findirect-dispatch compilation from source
FAIL: PR6085 -O3 compilation from source
FAIL: PR6085 -O3 -findirect-dispatch compilation from source
FAIL: PR6204 compilation from source
FAIL: PR6204 -findirect-dispatch compilation from source
FAIL: PR6204 -O3 compilation from source
FAIL: PR6204 -O3 -findirect-dispatch compilation from source
FAIL: PR6729 compilation from source
FAIL: PR6729 -findirect-dispatch compilation from source
FAIL: PR6729 -O3 compilation from source
FAIL: PR6729 -O3 -findirect-dispatch compilation from source
FAIL: PR6820 compilation from source
FAIL: PR6820 -findirect-dispatch compilation from source
FAIL: PR6820 -O3 compilation from source
FAIL: PR6820 -O3 -findirect-dispatch compilation from source
FAIL: PR7482 compilation from source
FAIL: PR7482 -findirect-dispatch compilation from source
FAIL: PR7482 -O3 compilation from source
FAIL: PR7482 -O3 -findirect-dispatch compilation from source
FAIL: Process_1 compilation from source
FAIL: Process_1 -findirect-dispatch compilation from source
FAIL: Process_1 -O3 compilation from source
FAIL: Process_1 -O3 -findirect-dispatch compilation from source
FAIL: Process_2 compilation from source
FAIL: Process_2 -findirect-dispatch compilation from source
FAIL: Process_2 -O3 compilation from source
FAIL: Process_2 -O3 -findirect-dispatch compilation from source
FAIL: Process_3 compilation from source
FAIL: Process_3 -findirect-dispatch compilation from source
FAIL: Process_3 -O3 compilation from source
FAIL: Process_3 -O3 -findirect-dispatch compilation from source
FAIL: Process_4 compilation from source
FAIL: Process_4 -findirect-dispatch compilation from source
FAIL: Process_4 -O3 compilation from source
FAIL: Process_4 -O3 -findirect-dispatch compilation from source
FAIL: Process_5 compilation from source
FAIL: Process_5 -findirect-dispatch compilation from source
FAIL: Process_5 -O3 compilation from source
FAIL: Process_5 -O3 -findirect-dispatch compilation from source
FAIL: Process_6 compilation from source
FAIL: Process_6 -findirect-dispatch compilation from source
FAIL: Process_6 -O3 compilation from source
FAIL: Process_6 -O3 -findirect-dispatch compilation from source
FAIL: Process_7 compilation from source
FAIL: Process_7 -findirect-dispatch compilation from source
FAIL: Process_7 -O3 compilation from source
FAIL: Process_7 -O3 -findirect-dispatch compilation from source
FAIL: ProxyTest compilation from source
FAIL: ProxyTest -findirect-dispatch compilation from source
FAIL: ProxyTest -O3 compilation from source
FAIL: ProxyTest -O3 -findirect-dispatch compilation from source
FAIL: RH194522 compilation from source
FAIL: RH194522 -findirect-dispatch compilation from source
FAIL: RH194522 -O3 compilation from source
FAIL: RH194522 -O3 -findirect-dispatch compilation from source
FAIL: Serialization compilation from source
FAIL: Serialization -findirect-dispatch compilation from source
FAIL: Serialization -O3 compilation from source
FAIL: Serialization -O3 -findirect-dispatch compilation from source
FAIL: Shazam compilation from source
FAIL: Shazam -findirect-dispatch compilation from source
FAIL: Shazam -O3 compilation from source
FAIL: Shazam -O3 -findirect-dispatch compilation from source
FAIL: StackTrace2 compilation from source
FAIL: StackTrace2 -findirect-dispatch compilation from source
FAIL: StackTrace2 -O3 compilation from source
FAIL: StackTrace2 -O3 -findirect-dispatch compilation from source
FAIL: StaticConstructor compilation from source
FAIL: StaticConstructor -findirect-dispatch compilation from source
FAIL: StaticConstructor -O3 compilation from source
FAIL: StaticConstructor -O3 -findirect-dispatch compilation from source
FAIL: StringBuffer_1 compilation from source
FAIL: StringBuffer_1 -findirect-dispatch compilation from source
FAIL: StringBuffer_1 -O3 compilation from source
FAIL: StringBuffer_1 -O3 -findirect-dispatch compilation from source
FAIL: StringBuffer_overflow compilation from source
FAIL: StringBuffer_overflow -findirect-dispatch compilation from source
FAIL: StringBuffer_overflow -O3 compilation from source
FAIL: StringBuffer_overflow -O3 -findirect-dispatch compilation from source
FAIL: String_overflow compilation from source
FAIL: String_overflow -findirect-dispatch compilation from source
FAIL: String_overflow -O3 compilation from source
FAIL: String_overflow -O3 -findirect-dispatch compilation from source
FAIL: SyncGlobal compilation from source
FAIL: SyncGlobal -findirect-dispatch compilation from source
FAIL: SyncGlobal -O3 compilation from source
FAIL: SyncGlobal -O3 -findirect-dispatch compilation from source
FAIL: SyncTest compilation from source
FAIL: SyncTest -findirect-dispatch compilation from source
FAIL: SyncTest -O3 compilation from source
FAIL: SyncTest -O3 -findirect-dispatch compilation from source
FAIL: Synch compilation from source
FAIL: Synch -findirect-dispatch compilation from source
FAIL: Synch -O3 compilation from source
FAIL: Synch -O3 -findirect-dispatch compilation from source
FAIL: TLtest compilation from source
FAIL: TLtest -findirect-dispatch compilation from source
FAIL: TLtest -O3 compilation from source
FAIL: TLtest -O3 -findirect-dispatch compilation from source
FAIL: TestProxy compilation from source
FAIL: TestProxy -findirect-dispatch compilation from source
FAIL: TestProxy -O3 compilation from source
FAIL: TestProxy -O3 -findirect-dispatch compilation from source
FAIL: Thread_Alive compilation from source
FAIL: Thread_Alive -findirect-dispatch compilation from source
FAIL: Thread_Alive -O3 compilation from source
FAIL: Thread_Alive -O3 -findirect-dispatch compilation from source
FAIL: Thread_HoldsLock compilation from source
FAIL: Thread_HoldsLock -findirect-dispatch compilation from source
FAIL: Thread_HoldsLock -O3 compilation from source
FAIL: Thread_HoldsLock -O3 -findirect-dispatch compilation from source
FAIL: Thread_Interrupt compilation from source
FAIL: Thread_Interrupt -findirect-dispatch compilation from source
FAIL: Thread_Interrupt -O3 compilation from source
FAIL: Thread_Interrupt -O3 -findirect-dispatch compilation from source
FAIL: Thread_Join compilation from source
FAIL: Thread_Join -findirect-dispatch compilation from source
FAIL: Thread_Join -O3 compilation from source
FAIL: Thread_Join -O3 -findirect-dispatch compilation from source
FAIL: Thread_Monitor compilation from source
FAIL: Thread_Monitor -findirect-dispatch compilation from source
FAIL: Thread_Monitor -O3 compilation from source
FAIL: Thread_Monitor -O3 -findirect-dispatch compilation from source
FAIL: Thread_Sleep compilation from source
FAIL: Thread_Sleep -findirect-dispatch compilation from source
FAIL: Thread_Sleep -O3 compilation from source
FAIL: Thread_Sleep -O3 -findirect-dispatch compilation from source
FAIL: Thread_Sleep_2 compilation from source
FAIL: Thread_Sleep_2 -findirect-dispatch compilation from source
FAIL: Thread_Sleep_2 -O3 compilation from source
FAIL: Thread_Sleep_2 -O3 -findirect-dispatch compilation from source
FAIL: Thread_Wait compilation from source
FAIL: Thread_Wait -findirect-dispatch compilation from source
FAIL: Thread_Wait -O3 compilation from source
FAIL: Thread_Wait -O3 -findirect-dispatch compilation from source
FAIL: Thread_Wait_2 compilation from source
FAIL: Thread_Wait_2 -findirect-dispatch compilation from source
FAIL: Thread_Wait_2 -O3 compilation from source
FAIL: Thread_Wait_2 -O3 -findirect-dispatch compilation from source
FAIL: Thread_Wait_Interrupt compilation from source
FAIL: Thread_Wait_Interrupt -findirect-dispatch compilation from source
FAIL: Thread_Wait_Interrupt -O3 compilation from source
FAIL: Thread_Wait_Interrupt -O3 -findirect-dispatch compilation from source
FAIL: Throw_1 compilation from source
FAIL: Throw_1 -findirect-dispatch compilation from source
FAIL: Throw_1 -O3 compilation from source
FAIL: Throw_1 -O3 -findirect-dispatch compilation from source
FAIL: Throw_2 compilation from source
FAIL: Throw_2 -findirect-dispatch compilation from source
FAIL: Throw_2 -O3 compilation from source
FAIL: Throw_2 -O3 -findirect-dispatch compilation from source
FAIL: Throw_3 compilation from source
FAIL: Throw_3 -findirect-dispatch compilation from source
FAIL: Throw_3 -O3 compilation from source
FAIL: Throw_3 -O3 -findirect-dispatch compilation from source
FAIL: WalkerTest compilation from source
FAIL: WalkerTest -findirect-dispatch compilation from source
FAIL: WalkerTest -O3 compilation from source
FAIL: WalkerTest -O3 -findirect-dispatch compilation from source
FAIL: anfi compilation from source
FAIL: anfi -findirect-dispatch compilation from source
FAIL: anfi -O3 compilation from source
FAIL: anfi -O3 -findirect-dispatch compilation from source
FAIL: anon compilation from source
FAIL: anon -findirect-dispatch compilation from source
FAIL: anon -O3 compilation from source
FAIL: anon -O3 -findirect-dispatch compilation from source
FAIL: anon2 compilation from source
FAIL: anon2 -findirect-dispatch compilation from source
FAIL: anon2 -O3 compilation from source
FAIL: anon2 -O3 -findirect-dispatch compilation from source
FAIL: anon3 compilation from source
FAIL: anon3 -findirect-dispatch compilation from source
FAIL: anon3 -O3 compilation from source
FAIL: anon3 -O3 -findirect-dispatch compilation from source
FAIL: anon4 compilation from source
FAIL: anon4 -findirect-dispatch compilation from source
FAIL: anon4 -O3 compilation from source
FAIL: anon4 -O3 -findirect-dispatch compilation from source
FAIL: anon_ctor_itf_arg compilation from source
FAIL: anon_ctor_itf_arg -findirect-dispatch compilation from source
FAIL: anon_ctor_itf_arg -O3 compilation from source
FAIL: anon_ctor_itf_arg -O3 -findirect-dispatch compilation from source
FAIL: anonarray compilation from source
FAIL: anonarray -findirect-dispatch compilation from source
FAIL: anonarray -O3 compilation from source
FAIL: anonarray -O3 -findirect-dispatch compilation from source
FAIL: anonarray2 compilation from source
FAIL: anonarray2 -findirect-dispatch compilation from source
FAIL: anonarray2 -O3 compilation from source
FAIL: anonarray2 -O3 -findirect-dispatch compilation from source
FAIL: anonarray3 compilation from source
FAIL: anonarray3 -findirect-dispatch compilation from source
FAIL: anonarray3 -O3 compilation from source
FAIL: anonarray3 -O3 -findirect-dispatch compilation from source
FAIL: assign compilation from source
FAIL: assign -findirect-dispatch compilation from source
FAIL: assign -O3 compilation from source
FAIL: assign -O3 -findirect-dispatch compilation from source
FAIL: assign2 compilation from source
FAIL: assign2 -findirect-dispatch compilation from source
FAIL: assign2 -O3 compilation from source
FAIL: assign2 -O3 -findirect-dispatch compilation from source
FAIL: bclink compilation from source
FAIL: bclink -findirect-dispatch compilation from source
FAIL: bclink -O3 compilation from source
FAIL: bclink -O3 -findirect-dispatch compilation from source
FAIL: bytearray compilation from source
FAIL: bytearray -findirect-dispatch compilation from source
FAIL: bytearray -O3 compilation from source
FAIL: bytearray -O3 -findirect-dispatch compilation from source
FAIL: direct_read compilation from source
FAIL: direct_read -findirect-dispatch compilation from source
FAIL: direct_read -O3 compilation from source
FAIL: direct_read -O3 -findirect-dispatch compilation from source
FAIL: direct_write compilation from source
FAIL: direct_write -findirect-dispatch compilation from source
FAIL: direct_write -O3 compilation from source
FAIL: direct_write -O3 -findirect-dispatch compilation from source
FAIL: emptystring compilation from source
FAIL: emptystring -findirect-dispatch compilation from source
FAIL: emptystring -O3 compilation from source
FAIL: emptystring -O3 -findirect-dispatch compilation from source
FAIL: err1 compilation from source
FAIL: err1 -findirect-dispatch compilation from source
FAIL: err1 -O3 compilation from source
FAIL: err1 -O3 -findirect-dispatch compilation from source
FAIL: err10 compilation from source
FAIL: err10 -findirect-dispatch compilation from source
FAIL: err10 -O3 compilation from source
FAIL: err10 -O3 -findirect-dispatch compilation from source
FAIL: err11 compilation from source
FAIL: err11 -findirect-dispatch compilation from source
FAIL: err11 -O3 compilation from source
FAIL: err11 -O3 -findirect-dispatch compilation from source
FAIL: err12 compilation from source
FAIL: err12 -findirect-dispatch compilation from source
FAIL: err12 -O3 compilation from source
FAIL: err12 -O3 -findirect-dispatch compilation from source
FAIL: err13 compilation from source
FAIL: err13 -findirect-dispatch compilation from source
FAIL: err13 -O3 compilation from source
FAIL: err13 -O3 -findirect-dispatch compilation from source
FAIL: err14 compilation from source
FAIL: err14 -findirect-dispatch compilation from source
FAIL: err14 -O3 compilation from source
FAIL: err14 -O3 -findirect-dispatch compilation from source
FAIL: err2 compilation from source
FAIL: err2 -findirect-dispatch compilation from source
FAIL: err2 -O3 compilation from source
FAIL: err2 -O3 -findirect-dispatch compilation from source
FAIL: err3 compilation from source
FAIL: err3 -findirect-dispatch compilation from source
FAIL: err3 -O3 compilation from source
FAIL: err3 -O3 -findirect-dispatch compilation from source
FAIL: err4 compilation from source
FAIL: err4 -findirect-dispatch compilation from source
FAIL: err4 -O3 compilation from source
FAIL: err4 -O3 -findirect-dispatch compilation from source
FAIL: err5 compilation from source
FAIL: err5 -findirect-dispatch compilation from source
FAIL: err5 -O3 compilation from source
FAIL: err5 -O3 -findirect-dispatch compilation from source
FAIL: err6 compilation from source
FAIL: err6 -findirect-dispatch compilation from source
FAIL: err6 -O3 compilation from source
FAIL: err6 -O3 -findirect-dispatch compilation from source
FAIL: err7 compilation from source
FAIL: err7 -findirect-dispatch compilation from source
FAIL: err7 -O3 compilation from source
FAIL: err7 -O3 -findirect-dispatch compilation from source
FAIL: err8 compilation from source
FAIL: err8 -findirect-dispatch compilation from source
FAIL: err8 -O3 compilation from source
FAIL: err8 -O3 -findirect-dispatch compilation from source
FAIL: err9 compilation from source
FAIL: err9 -findirect-dispatch compilation from source
FAIL: err9 -O3 compilation from source
FAIL: err9 -O3 -findirect-dispatch compilation from source
FAIL: final_inner compilation from source
FAIL: final_inner -findirect-dispatch compilation from source
FAIL: final_inner -O3 compilation from source
FAIL: final_inner -O3 -findirect-dispatch compilation from source
FAIL: final_int compilation from source
FAIL: final_int -findirect-dispatch compilation from source
FAIL: final_int -O3 compilation from source
FAIL: final_int -O3 -findirect-dispatch compilation from source
FAIL: final_static_and_friend compilation from source
FAIL: final_static_and_friend -findirect-dispatch compilation from source
FAIL: final_static_and_friend -O3 compilation from source
FAIL: final_static_and_friend -O3 -findirect-dispatch compilation from source
FAIL: indirect compilation from source
FAIL: indirect -findirect-dispatch compilation from source
FAIL: indirect -O3 compilation from source
FAIL: indirect -O3 -findirect-dispatch compilation from source
FAIL: indirect_read compilation from source
FAIL: indirect_read -findirect-dispatch compilation from source
FAIL: indirect_read -O3 compilation from source
FAIL: indirect_read -O3 -findirect-dispatch compilation from source
FAIL: indirect_write compilation from source
FAIL: indirect_write -findirect-dispatch compilation from source
FAIL: indirect_write -O3 compilation from source
FAIL: indirect_write -O3 -findirect-dispatch compilation from source
FAIL: initexc compilation from source
FAIL: initexc -findirect-dispatch compilation from source
FAIL: initexc -O3 compilation from source
FAIL: initexc -O3 -findirect-dispatch compilation from source
FAIL: initfield compilation from source
FAIL: initfield -findirect-dispatch compilation from source
FAIL: initfield -O3 compilation from source
FAIL: initfield -O3 -findirect-dispatch compilation from source
FAIL: inline compilation from source
FAIL: inline -findirect-dispatch compilation from source
FAIL: inline -O3 compilation from source
FAIL: inline -O3 -findirect-dispatch compilation from source
FAIL: inner1 compilation from source
FAIL: inner1 -findirect-dispatch compilation from source
FAIL: inner1 -O3 compilation from source
FAIL: inner1 -O3 -findirect-dispatch compilation from source
FAIL: inner2 compilation from source
FAIL: inner2 -findirect-dispatch compilation from source
FAIL: inner2 -O3 compilation from source
FAIL: inner2 -O3 -findirect-dispatch compilation from source
FAIL: inner3 compilation from source
FAIL: inner3 -findirect-dispatch compilation from source
FAIL: inner3 -O3 compilation from source
FAIL: inner3 -O3 -findirect-dispatch compilation from source
FAIL: inner4 compilation from source
FAIL: inner4 -findirect-dispatch compilation from source
FAIL: inner4 -O3 compilation from source
FAIL: inner4 -O3 -findirect-dispatch compilation from source
FAIL: inner_array compilation from source
FAIL: inner_array -findirect-dispatch compilation from source
FAIL: inner_array -O3 compilation from source
FAIL: inner_array -O3 -findirect-dispatch compilation from source
FAIL: inner_interface compilation from source
FAIL: inner_interface -findirect-dispatch compilation from source
FAIL: inner_interface -O3 compilation from source
FAIL: inner_interface -O3 -findirect-dispatch compilation from source
FAIL: instance compilation from source
FAIL: instance -findirect-dispatch compilation from source
FAIL: instance -O3 compilation from source
FAIL: instance -O3 -findirect-dispatch compilation from source
FAIL: instinit compilation from source
FAIL: instinit -findirect-dispatch compilation from source
FAIL: instinit -O3 compilation from source
FAIL: instinit -O3 -findirect-dispatch compilation from source
FAIL: instinit2 compilation from source
FAIL: instinit2 -findirect-dispatch compilation from source
FAIL: instinit2 -O3 compilation from source
FAIL: instinit2 -O3 -findirect-dispatch compilation from source
FAIL: invoke_from_inner compilation from source
FAIL: invoke_from_inner -findirect-dispatch compilation from source
FAIL: invoke_from_inner -O3 compilation from source
FAIL: invoke_from_inner -O3 -findirect-dispatch compilation from source
FAIL: invokethrow compilation from source
FAIL: invokethrow -findirect-dispatch compilation from source
FAIL: invokethrow -O3 compilation from source
FAIL: invokethrow -O3 -findirect-dispatch compilation from source
FAIL: klass compilation from source
FAIL: klass -findirect-dispatch compilation from source
FAIL: klass -O3 compilation from source
FAIL: klass -O3 -findirect-dispatch compilation from source
FAIL: md5test compilation from source
FAIL: md5test -findirect-dispatch compilation from source
FAIL: md5test -O3 compilation from source
FAIL: md5test -O3 -findirect-dispatch compilation from source
FAIL: multiple_finit compilation from source
FAIL: multiple_finit -findirect-dispatch compilation from source
FAIL: multiple_finit -O3 compilation from source
FAIL: multiple_finit -O3 -findirect-dispatch compilation from source
FAIL: negzero compilation from source
FAIL: negzero -findirect-dispatch compilation from source
FAIL: negzero -O3 compilation from source
FAIL: negzero -O3 -findirect-dispatch compilation from source
FAIL: nested_with_ctor compilation from source
FAIL: nested_with_ctor -findirect-dispatch compilation from source
FAIL: nested_with_ctor -O3 compilation from source
FAIL: nested_with_ctor -O3 -findirect-dispatch compilation from source
FAIL: newarray_overflow compilation from source
FAIL: newarray_overflow -findirect-dispatch compilation from source
FAIL: newarray_overflow -O3 compilation from source
FAIL: newarray_overflow -O3 -findirect-dispatch compilation from source
FAIL: override compilation from source
FAIL: override -findirect-dispatch compilation from source
FAIL: override -O3 compilation from source
FAIL: override -O3 -findirect-dispatch compilation from source
FAIL: pr109 compilation from source
FAIL: pr109 -findirect-dispatch compilation from source
FAIL: pr109 -O3 compilation from source
FAIL: pr109 -O3 -findirect-dispatch compilation from source
FAIL: pr13107 compilation from source
FAIL: pr13107 -findirect-dispatch compilation from source
FAIL: pr13107 -O3 compilation from source
FAIL: pr13107 -O3 -findirect-dispatch compilation from source
FAIL: pr13107_2 compilation from source
FAIL: pr13107_2 -findirect-dispatch compilation from source
FAIL: pr13107_2 -O3 compilation from source
FAIL: pr13107_2 -O3 -findirect-dispatch compilation from source
FAIL: pr13107_3 compilation from source
FAIL: pr13107_3 -findirect-dispatch compilation from source
FAIL: pr13107_3 -O3 compilation from source
FAIL: pr13107_3 -O3 -findirect-dispatch compilation from source
FAIL: pr133 compilation from source
FAIL: pr133 -findirect-dispatch compilation from source
FAIL: pr133 -O3 compilation from source
FAIL: pr133 -O3 -findirect-dispatch compilation from source
FAIL: pr16789 compilation from source
FAIL: pr16789 -findirect-dispatch compilation from source
FAIL: pr16789 -O3 compilation from source
FAIL: pr16789 -O3 -findirect-dispatch compilation from source
FAIL: pr17536 compilation from source
FAIL: pr17536 -findirect-dispatch compilation from source
FAIL: pr17536 -O3 compilation from source
FAIL: pr17536 -O3 -findirect-dispatch compilation from source
FAIL: pr179 compilation from source
FAIL: pr179 -findirect-dispatch compilation from source
FAIL: pr179 -O3 compilation from source
FAIL: pr179 -O3 -findirect-dispatch compilation from source
FAIL: pr184 compilation from source
FAIL: pr184 -findirect-dispatch compilation from source
FAIL: pr184 -O3 compilation from source
FAIL: pr184 -O3 -findirect-dispatch compilation from source
FAIL: pr21785 compilation from source
FAIL: pr21785 -findirect-dispatch compilation from source
FAIL: pr21785 -O3 compilation from source
FAIL: pr21785 -O3 -findirect-dispatch compilation from source
FAIL: pr21844 compilation from source
FAIL: pr21844 -findirect-dispatch compilation from source
FAIL: pr21844 -O3 compilation from source
FAIL: pr21844 -O3 -findirect-dispatch compilation from source
FAIL: pr24321 compilation from source
FAIL: pr24321 -findirect-dispatch compilation from source
FAIL: pr24321 -O3 compilation from source
FAIL: pr24321 -O3 -findirect-dispatch compilation from source
FAIL: pr25676 compilation from source
FAIL: pr25676 -findirect-dispatch compilation from source
FAIL: pr25676 -O3 compilation from source
FAIL: pr25676 -O3 -findirect-dispatch compilation from source
FAIL: pr26390 compilation from source
FAIL: pr26390 -findirect-dispatch compilation from source
FAIL: pr26390 -O3 compilation from source
FAIL: pr26390 -O3 -findirect-dispatch compilation from source
FAIL: pr26990 compilation from source
FAIL: pr26990 -findirect-dispatch compilation from source
FAIL: pr26990 -O3 compilation from source
FAIL: pr26990 -O3 -findirect-dispatch compilation from source
FAIL: pr27171 compilation from source
FAIL: pr27171 -findirect-dispatch compilation from source
FAIL: pr27171 -O3 compilation from source
FAIL: pr27171 -O3 -findirect-dispatch compilation from source
FAIL: pr6388 compilation from source
FAIL: pr6388 -findirect-dispatch compilation from source
FAIL: pr6388 -O3 compilation from source
FAIL: pr6388 -O3 -findirect-dispatch compilation from source
FAIL: pr83 compilation from source
FAIL: pr83 -findirect-dispatch compilation from source
FAIL: pr83 -O3 compilation from source
FAIL: pr83 -O3 -findirect-dispatch compilation from source
FAIL: pr8415 compilation from source
FAIL: pr8415 -findirect-dispatch compilation from source
FAIL: pr8415 -O3 compilation from source
FAIL: pr8415 -O3 -findirect-dispatch compilation from source
FAIL: pr8676 compilation from source
FAIL: pr8676 -findirect-dispatch compilation from source
FAIL: pr8676 -O3 compilation from source
FAIL: pr8676 -O3 -findirect-dispatch compilation from source
FAIL: pr8823 compilation from source
FAIL: pr8823 -findirect-dispatch compilation from source
FAIL: pr8823 -O3 compilation from source
FAIL: pr8823 -O3 -findirect-dispatch compilation from source
FAIL: pr8945 compilation from source
FAIL: pr8945 -findirect-dispatch compilation from source
FAIL: pr8945 -O3 compilation from source
FAIL: pr8945 -O3 -findirect-dispatch compilation from source
FAIL: private_direct_read compilation from source
FAIL: private_direct_read -findirect-dispatch compilation from source
FAIL: private_direct_read -O3 compilation from source
FAIL: private_direct_read -O3 -findirect-dispatch compilation from source
FAIL: search_outer compilation from source
FAIL: search_outer -findirect-dispatch compilation from source
FAIL: search_outer -O3 compilation from source
FAIL: search_outer -O3 -findirect-dispatch compilation from source
FAIL: shatest compilation from source
FAIL: shatest -findirect-dispatch compilation from source
FAIL: shatest -O3 compilation from source
FAIL: shatest -O3 -findirect-dispatch compilation from source
FAIL: stacktrace compilation from source
FAIL: stacktrace -findirect-dispatch compilation from source
FAIL: stacktrace -O3 compilation from source
FAIL: stacktrace -O3 -findirect-dispatch compilation from source
FAIL: stringconst compilation from source
FAIL: stringconst -findirect-dispatch compilation from source
FAIL: stringconst -O3 compilation from source
FAIL: stringconst -O3 -findirect-dispatch compilation from source
FAIL: stringconst2 compilation from source
FAIL: stringconst2 -findirect-dispatch compilation from source
FAIL: stringconst2 -O3 compilation from source
FAIL: stringconst2 -O3 -findirect-dispatch compilation from source
FAIL: stub compilation from source
FAIL: stub -findirect-dispatch compilation from source
FAIL: stub -O3 compilation from source
FAIL: stub -O3 -findirect-dispatch compilation from source
FAIL: test_long compilation from source
FAIL: test_long -findirect-dispatch compilation from source
FAIL: test_long -O3 compilation from source
FAIL: test_long -O3 -findirect-dispatch compilation from source
FAIL: tmi compilation from source
FAIL: tmi -findirect-dispatch compilation from source
FAIL: tmi -O3 compilation from source
FAIL: tmi -O3 -findirect-dispatch compilation from source
FAIL: tp compilation from source
FAIL: tp -findirect-dispatch compilation from source
FAIL: tp -O3 compilation from source
FAIL: tp -O3 -findirect-dispatch compilation from source
FAIL: update_outer compilation from source
FAIL: update_outer -findirect-dispatch compilation from source
FAIL: update_outer -O3 compilation from source
FAIL: update_outer -O3 -findirect-dispatch compilation from source
FAIL: utf8concat compilation from source
FAIL: utf8concat -findirect-dispatch compilation from source
FAIL: utf8concat -O3 compilation from source
FAIL: utf8concat -O3 -findirect-dispatch compilation from source
FAIL: utilTest compilation from source
FAIL: utilTest -findirect-dispatch compilation from source
FAIL: utilTest -O3 compilation from source
FAIL: utilTest -O3 -findirect-dispatch compilation from source
FAIL: verify compilation from source
FAIL: verify -findirect-dispatch compilation from source
FAIL: verify -O3 compilation from source
FAIL: verify -O3 -findirect-dispatch compilation from source
FAIL: TestEarlyGC compilation from source
FAIL: TestLeak compilation from source
FAIL: TestMultiple compilation from source
FAIL: TestParent compilation from source

		=== libjava Summary ===

# of expected passes		38
# of unexpected failures	836
# of expected failures		31
# of unresolved testcases	3
# of untested testcases		1604
		=== libstdc++ tests ===


Running target unix
FAIL: 18_support/bad_alloc/cons_virtual_derivation.cc execution test
FAIL: 18_support/bad_alloc/what.cc execution test
FAIL: 18_support/bad_cast/cons_virtual_derivation.cc execution test
FAIL: 18_support/bad_cast/what.cc execution test
FAIL: 18_support/bad_exception/cons_virtual_derivation.cc execution test
FAIL: 18_support/bad_exception/what.cc execution test
FAIL: 18_support/bad_typeid/cons_virtual_derivation.cc execution test
FAIL: 18_support/bad_typeid/what.cc execution test
FAIL: 18_support/exception/38732.cc execution test
FAIL: 18_support/exception/what.cc execution test
FAIL: 18_support/exception_ptr/current_exception.cc execution test
FAIL: 18_support/exception_ptr/lifespan.cc execution test
FAIL: 18_support/exception_ptr/move.cc execution test
FAIL: 18_support/exception_ptr/rethrow_exception.cc execution test
FAIL: 18_support/nested_exception/cons.cc execution test
FAIL: 18_support/nested_exception/nested_ptr.cc execution test
FAIL: 18_support/nested_exception/rethrow_if_nested.cc execution test
FAIL: 18_support/nested_exception/rethrow_nested.cc execution test
FAIL: 18_support/nested_exception/throw_with_nested.cc execution test
FAIL: 18_support/new_delete_placement.cc execution test
FAIL: 18_support/numeric_limits/char16_32_t.cc execution test
FAIL: 18_support/numeric_limits/denorm_min.cc execution test
FAIL: 18_support/numeric_limits/digits10.cc execution test
FAIL: 18_support/numeric_limits/dr559.cc execution test
FAIL: 18_support/numeric_limits/epsilon.cc execution test
FAIL: 18_support/numeric_limits/infinity.cc execution test
FAIL: 18_support/numeric_limits/is_iec559.cc execution test
FAIL: 18_support/numeric_limits/is_signed.cc execution test
FAIL: 18_support/numeric_limits/lowest.cc execution test
FAIL: 18_support/numeric_limits/max_digits10.cc execution test
FAIL: 18_support/numeric_limits/min_max.cc execution test
FAIL: 18_support/numeric_limits/quiet_NaN.cc execution test
FAIL: 18_support/numeric_limits/specialization_default_values.cc execution test
FAIL: 18_support/numeric_limits/traps.cc execution test
FAIL: 18_support/uncaught_exception/14026.cc execution test
FAIL: 19_diagnostics/error_category/cons/default.cc execution test
FAIL: 19_diagnostics/error_category/operators/equal.cc execution test
FAIL: 19_diagnostics/error_category/operators/not_equal.cc execution test
FAIL: 19_diagnostics/error_code/cons/1.cc execution test
FAIL: 19_diagnostics/error_code/cons/39882.cc execution test
FAIL: 19_diagnostics/error_code/modifiers/39882.cc execution test
FAIL: 19_diagnostics/error_code/operators/bool.cc execution test
FAIL: 19_diagnostics/error_code/operators/equal.cc execution test
FAIL: 19_diagnostics/error_code/operators/not_equal.cc execution test
FAIL: 19_diagnostics/error_condition/cons/1.cc execution test
FAIL: 19_diagnostics/error_condition/cons/39881.cc execution test
FAIL: 19_diagnostics/error_condition/modifiers/39881.cc execution test
FAIL: 19_diagnostics/error_condition/operators/bool.cc execution test
FAIL: 19_diagnostics/error_condition/operators/equal.cc execution test
FAIL: 19_diagnostics/error_condition/operators/not_equal.cc execution test
FAIL: 19_diagnostics/logic_error/cons_virtual_derivation.cc execution test
FAIL: 19_diagnostics/logic_error/what-1.cc execution test
FAIL: 19_diagnostics/logic_error/what-2.cc execution test
FAIL: 19_diagnostics/logic_error/what-3.cc execution test
FAIL: 19_diagnostics/logic_error/what-big.cc execution test
FAIL: 19_diagnostics/runtime_error/cons_virtual_derivation.cc execution test
FAIL: 19_diagnostics/runtime_error/what-1.cc execution test
FAIL: 19_diagnostics/runtime_error/what-2.cc execution test
FAIL: 19_diagnostics/runtime_error/what-3.cc execution test
FAIL: 19_diagnostics/runtime_error/what-big.cc execution test
FAIL: 19_diagnostics/system_error/cons-1.cc execution test
FAIL: 19_diagnostics/system_error/cons_virtual_derivation.cc execution test
FAIL: 19_diagnostics/system_error/what-1.cc execution test
FAIL: 19_diagnostics/system_error/what-2.cc execution test
FAIL: 19_diagnostics/system_error/what-3.cc execution test
FAIL: 19_diagnostics/system_error/what-4.cc execution test
FAIL: 19_diagnostics/system_error/what-big.cc execution test
FAIL: 20_util/add_lvalue_reference/value.cc execution test
FAIL: 20_util/add_rvalue_reference/value.cc execution test
FAIL: 20_util/aligned_storage/value.cc execution test
FAIL: 20_util/allocator/1.cc execution test
FAIL: 20_util/allocator/10378.cc execution test
FAIL: 20_util/allocator/14176.cc execution test
FAIL: 20_util/allocator/8230.cc execution test
FAIL: 20_util/auto_ptr/1.cc execution test
FAIL: 20_util/auto_ptr/2.cc execution test
FAIL: 20_util/auto_ptr/3.cc execution test
FAIL: 20_util/auto_ptr/3946.cc execution test
FAIL: 20_util/auto_ptr/4.cc execution test
FAIL: 20_util/auto_ptr/5.cc execution test
FAIL: 20_util/auto_ptr/6.cc execution test
FAIL: 20_util/auto_ptr/7.cc execution test
FAIL: 20_util/bad_function_call/cons_virtual_derivation.cc execution test
FAIL: 20_util/bind/all_bound.cc execution test
FAIL: 20_util/bind/conv_result.cc execution test
FAIL: 20_util/bind/cv_quals.cc execution test
FAIL: 20_util/bind/nested.cc execution test
FAIL: 20_util/bind/placeholders.cc execution test
FAIL: 20_util/bind/ref.cc execution test
FAIL: 20_util/bind/ref2.cc execution test
FAIL: 20_util/clocks/1.cc execution test
FAIL: 20_util/common_type/requirements/typedefs-1.cc execution test
FAIL: 20_util/common_type/requirements/typedefs-2.cc execution test
FAIL: 20_util/conditional/requirements/typedefs.cc execution test
FAIL: 20_util/decay/requirements/typedefs.cc execution test
FAIL: 20_util/duration/arithmetic/1.cc execution test
FAIL: 20_util/duration/arithmetic/2.cc execution test
FAIL: 20_util/duration/arithmetic/dr934-2.cc execution test
FAIL: 20_util/duration/comparisons/1.cc execution test
FAIL: 20_util/duration/cons/1.cc execution test
FAIL: 20_util/duration/cons/2.cc execution test
FAIL: 20_util/function/1.cc execution test
FAIL: 20_util/function/2.cc execution test
FAIL: 20_util/function/3.cc execution test
FAIL: 20_util/function/4.cc execution test
FAIL: 20_util/function/43397.cc execution test
FAIL: 20_util/function/5.cc execution test
FAIL: 20_util/function/6.cc execution test
FAIL: 20_util/function/7.cc execution test
FAIL: 20_util/function/8.cc execution test
FAIL: 20_util/function/9.cc execution test
FAIL: 20_util/function/assign/move.cc execution test
FAIL: 20_util/function/assign/move_target.cc execution test
FAIL: 20_util/function/cons/move.cc execution test
FAIL: 20_util/function/cons/move_target.cc execution test
FAIL: 20_util/function/invoke/move_only.cc execution test
FAIL: 20_util/function_objects/binders/3113.cc execution test
FAIL: 20_util/function_objects/comparisons.cc execution test
FAIL: 20_util/function_objects/dr660.cc execution test
FAIL: 20_util/has_nothrow_copy_constructor/value.cc execution test
FAIL: 20_util/has_nothrow_default_constructor/value.cc execution test
FAIL: 20_util/has_trivial_copy_constructor/value.cc execution test
FAIL: 20_util/has_trivial_default_constructor/value.cc execution test
FAIL: 20_util/hash/operators/size_t.cc execution test
FAIL: 20_util/identity/value.cc execution test
FAIL: 20_util/is_constructible/value.cc execution test
FAIL: 20_util/is_convertible/value.cc execution test
FAIL: 20_util/is_explicitly_convertible/value.cc execution test
FAIL: 20_util/is_integral/value.cc execution test
FAIL: 20_util/is_lvalue_reference/value.cc execution test
FAIL: 20_util/is_pod/value.cc execution test
FAIL: 20_util/is_reference/value.cc execution test
FAIL: 20_util/is_rvalue_reference/value.cc execution test
FAIL: 20_util/is_signed/value.cc execution test
FAIL: 20_util/is_standard_layout/value.cc execution test
FAIL: 20_util/is_trivial/value.cc execution test
FAIL: 20_util/is_unsigned/value.cc execution test
FAIL: 20_util/make_signed/requirements/typedefs-1.cc execution test
FAIL: 20_util/make_signed/requirements/typedefs-2.cc execution test
FAIL: 20_util/make_unsigned/requirements/typedefs-1.cc execution test
FAIL: 20_util/make_unsigned/requirements/typedefs-2.cc execution test
FAIL: 20_util/owner_less/cmp.cc execution test
FAIL: 20_util/pair/1.cc execution test
FAIL: 20_util/pair/2.cc execution test
FAIL: 20_util/pair/3.cc execution test
FAIL: 20_util/pair/4.cc execution test
FAIL: 20_util/pair/moveable.cc execution test
FAIL: 20_util/pair/swap.cc execution test
FAIL: 20_util/ratio/comparisons/comp1.cc execution test
FAIL: 20_util/ratio/comparisons/comp2.cc execution test
FAIL: 20_util/ratio/cons/cons1.cc execution test
FAIL: 20_util/ratio/operations/ops1.cc execution test
FAIL: 20_util/ratio/operations/ops2.cc execution test
FAIL: 20_util/ratio/operations/ops3.cc execution test
FAIL: 20_util/reference_wrapper/invoke.cc execution test
FAIL: 20_util/reference_wrapper/typedefs.cc execution test
FAIL: 20_util/rel_ops.cc execution test
FAIL: 20_util/remove_reference/value.cc execution test
FAIL: 20_util/shared_ptr/assign/assign.cc execution test
FAIL: 20_util/shared_ptr/assign/auto_ptr.cc execution test
FAIL: 20_util/shared_ptr/assign/move.cc execution test
FAIL: 20_util/shared_ptr/assign/shared_ptr.cc execution test
FAIL: 20_util/shared_ptr/comparison/cmp.cc execution test
FAIL: 20_util/shared_ptr/comparison/less.cc execution test
FAIL: 20_util/shared_ptr/cons/alias.cc execution test
FAIL: 20_util/shared_ptr/cons/alloc.cc execution test
FAIL: 20_util/shared_ptr/cons/auto_ptr.cc execution test
FAIL: 20_util/shared_ptr/cons/copy.cc execution test
FAIL: 20_util/shared_ptr/cons/default.cc execution test
FAIL: 20_util/shared_ptr/cons/move.cc execution test
FAIL: 20_util/shared_ptr/cons/pointer.cc execution test
FAIL: 20_util/shared_ptr/cons/unique_ptr.cc execution test
FAIL: 20_util/shared_ptr/cons/unique_ptr_deleter.cc execution test
FAIL: 20_util/shared_ptr/cons/unique_ptr_deleter_ref_1.cc execution test
FAIL: 20_util/shared_ptr/cons/unique_ptr_deleter_ref_2.cc execution test
FAIL: 20_util/shared_ptr/cons/weak_ptr.cc execution test
FAIL: 20_util/shared_ptr/creation/36949.cc execution test
FAIL: 20_util/shared_ptr/creation/alloc.cc execution test
FAIL: 20_util/shared_ptr/creation/dr925.cc execution test
FAIL: 20_util/shared_ptr/creation/make.cc execution test
FAIL: 20_util/shared_ptr/dest/dest.cc execution test
FAIL: 20_util/shared_ptr/misc/24595.cc execution test
FAIL: 20_util/shared_ptr/misc/42019.cc execution test
FAIL: 20_util/shared_ptr/misc/io.cc execution test
FAIL: 20_util/shared_ptr/misc/swap.cc execution test
FAIL: 20_util/shared_ptr/modifiers/reset.cc execution test
FAIL: 20_util/shared_ptr/modifiers/reset_alloc.cc execution test
FAIL: 20_util/shared_ptr/modifiers/swap.cc execution test
FAIL: 20_util/shared_ptr/observers/bool_conv.cc execution test
FAIL: 20_util/shared_ptr/observers/get.cc execution test
FAIL: 20_util/shared_ptr/observers/owner_before.cc execution test
FAIL: 20_util/shared_ptr/observers/unique.cc execution test
FAIL: 20_util/shared_ptr/observers/use_count.cc execution test
FAIL: 20_util/shared_ptr/thread/default_weaktoshared.cc execution test
FAIL: 20_util/specialized_algorithms/uninitialized_copy/move_iterators/1.cc execution test
FAIL: 20_util/specialized_algorithms/uninitialized_copy_n/move_iterators/1.cc execution test
FAIL: 20_util/temporary_buffer.cc execution test
FAIL: 20_util/time_point/1.cc execution test
FAIL: 20_util/time_point/2.cc execution test
FAIL: 20_util/time_point/3.cc execution test
FAIL: 20_util/tuple/comparison_operators/comparisons.cc execution test
FAIL: 20_util/tuple/cons/assignment.cc execution test
FAIL: 20_util/tuple/cons/big_tuples.cc execution test
FAIL: 20_util/tuple/cons/constructor.cc execution test
FAIL: 20_util/tuple/creation_functions/23978.cc execution test
FAIL: 20_util/tuple/creation_functions/make_tuple.cc execution test
FAIL: 20_util/tuple/creation_functions/tie.cc execution test
FAIL: 20_util/tuple/creation_functions/tie2.cc execution test
FAIL: 20_util/tuple/element_access/get.cc execution test
FAIL: 20_util/tuple/moveable.cc execution test
FAIL: 20_util/tuple/moveable2.cc execution test
FAIL: 20_util/tuple/swap.cc execution test
FAIL: 20_util/tuple/tuple_element.cc execution test
FAIL: 20_util/tuple/tuple_size.cc execution test
FAIL: 20_util/unique_ptr/assign/move.cc execution test
FAIL: 20_util/unique_ptr/assign/move_array.cc execution test
FAIL: 20_util/unique_ptr/cons/pointer.cc execution test
FAIL: 20_util/unique_ptr/cons/pointer_array.cc execution test
FAIL: 20_util/unique_ptr/modifiers/43183.cc execution test
FAIL: 20_util/unique_ptr/specialized_algorithms/comparisons.cc execution test
FAIL: 20_util/unique_ptr/specialized_algorithms/comparisons_array.cc execution test
FAIL: 20_util/unique_ptr/specialized_algorithms/swap.cc execution test
FAIL: 20_util/weak_ptr/observers/owner_before.cc execution test
FAIL: 21_strings/basic_string/append/char/1.cc execution test
FAIL: 21_strings/basic_string/append/char/2.cc execution test
FAIL: 21_strings/basic_string/append/char/3.cc execution test
FAIL: 21_strings/basic_string/append/wchar_t/1.cc execution test
FAIL: 21_strings/basic_string/append/wchar_t/2.cc execution test
FAIL: 21_strings/basic_string/append/wchar_t/3.cc execution test
FAIL: 21_strings/basic_string/assign/char/1.cc execution test
FAIL: 21_strings/basic_string/assign/char/2.cc execution test
FAIL: 21_strings/basic_string/assign/char/3.cc execution test
FAIL: 21_strings/basic_string/assign/wchar_t/1.cc execution test
FAIL: 21_strings/basic_string/assign/wchar_t/2.cc execution test
FAIL: 21_strings/basic_string/assign/wchar_t/3.cc execution test
FAIL: 21_strings/basic_string/capacity/1.cc execution test
FAIL: 21_strings/basic_string/capacity/char/1.cc execution test
FAIL: 21_strings/basic_string/capacity/char/18654.cc execution test
FAIL: 21_strings/basic_string/capacity/char/2.cc execution test
FAIL: 21_strings/basic_string/capacity/char/shrink_to_fit.cc execution test
FAIL: 21_strings/basic_string/capacity/wchar_t/1.cc execution test
FAIL: 21_strings/basic_string/capacity/wchar_t/18654.cc execution test
FAIL: 21_strings/basic_string/capacity/wchar_t/2.cc execution test
FAIL: 21_strings/basic_string/capacity/wchar_t/shrink_to_fit.cc execution test
FAIL: 21_strings/basic_string/compare/char/1.cc execution test
FAIL: 21_strings/basic_string/compare/char/13650.cc execution test
FAIL: 21_strings/basic_string/compare/wchar_t/1.cc execution test
FAIL: 21_strings/basic_string/compare/wchar_t/13650.cc execution test
FAIL: 21_strings/basic_string/cons/char/1.cc execution test
FAIL: 21_strings/basic_string/cons/char/2.cc execution test
FAIL: 21_strings/basic_string/cons/char/3.cc execution test
FAIL: 21_strings/basic_string/cons/char/4.cc execution test
FAIL: 21_strings/basic_string/cons/char/42261.cc execution test
FAIL: 21_strings/basic_string/cons/char/5.cc execution test
FAIL: 21_strings/basic_string/cons/char/6.cc execution test
FAIL: 21_strings/basic_string/cons/wchar_t/1.cc execution test
FAIL: 21_strings/basic_string/cons/wchar_t/2.cc execution test
FAIL: 21_strings/basic_string/cons/wchar_t/3.cc execution test
FAIL: 21_strings/basic_string/cons/wchar_t/4.cc execution test
FAIL: 21_strings/basic_string/cons/wchar_t/42261.cc execution test
FAIL: 21_strings/basic_string/cons/wchar_t/5.cc execution test
FAIL: 21_strings/basic_string/cons/wchar_t/6.cc execution test
FAIL: 21_strings/basic_string/element_access/char/1.cc execution test
FAIL: 21_strings/basic_string/element_access/char/2.cc execution test
FAIL: 21_strings/basic_string/element_access/char/3.cc execution test
FAIL: 21_strings/basic_string/element_access/char/4.cc execution test
FAIL: 21_strings/basic_string/element_access/char/empty.cc execution test
FAIL: 21_strings/basic_string/element_access/wchar_t/1.cc execution test
FAIL: 21_strings/basic_string/element_access/wchar_t/2.cc execution test
FAIL: 21_strings/basic_string/element_access/wchar_t/3.cc execution test
FAIL: 21_strings/basic_string/element_access/wchar_t/4.cc execution test
FAIL: 21_strings/basic_string/element_access/wchar_t/empty.cc execution test
FAIL: 21_strings/basic_string/find/char/1.cc execution test
FAIL: 21_strings/basic_string/find/char/2.cc execution test
FAIL: 21_strings/basic_string/find/char/3.cc execution test
FAIL: 21_strings/basic_string/find/char/4.cc execution test
FAIL: 21_strings/basic_string/find/wchar_t/1.cc execution test
FAIL: 21_strings/basic_string/find/wchar_t/2.cc execution test
FAIL: 21_strings/basic_string/find/wchar_t/3.cc execution test
FAIL: 21_strings/basic_string/find/wchar_t/4.cc execution test
FAIL: 21_strings/basic_string/init-list.cc execution test
FAIL: 21_strings/basic_string/insert/char/1.cc execution test
FAIL: 21_strings/basic_string/insert/char/2.cc execution test
FAIL: 21_strings/basic_string/insert/wchar_t/1.cc execution test
FAIL: 21_strings/basic_string/insert/wchar_t/2.cc execution test
FAIL: 21_strings/basic_string/inserters_extractors/char/1.cc execution test
FAIL: 21_strings/basic_string/inserters_extractors/char/28277.cc execution test
FAIL: 21_strings/basic_string/inserters_extractors/char/4.cc execution test
FAIL: 21_strings/basic_string/inserters_extractors/char/6.cc execution test
FAIL: 21_strings/basic_string/inserters_extractors/char/7.cc execution test
FAIL: 21_strings/basic_string/inserters_extractors/char/8.cc execution test
FAIL: 21_strings/basic_string/inserters_extractors/char/9.cc execution test
FAIL: 21_strings/basic_string/inserters_extractors/pod/10081-in.cc execution test
FAIL: 21_strings/basic_string/inserters_extractors/pod/10081-out.cc execution test
FAIL: 21_strings/basic_string/inserters_extractors/wchar_t/1.cc execution test
FAIL: 21_strings/basic_string/inserters_extractors/wchar_t/10.cc execution test
FAIL: 21_strings/basic_string/inserters_extractors/wchar_t/11.cc execution test
FAIL: 21_strings/basic_string/inserters_extractors/wchar_t/28277.cc execution test
FAIL: 21_strings/basic_string/inserters_extractors/wchar_t/4.cc execution test
FAIL: 21_strings/basic_string/inserters_extractors/wchar_t/5.cc execution test
FAIL: 21_strings/basic_string/inserters_extractors/wchar_t/6.cc execution test
FAIL: 21_strings/basic_string/inserters_extractors/wchar_t/7.cc execution test
FAIL: 21_strings/basic_string/inserters_extractors/wchar_t/8.cc execution test
FAIL: 21_strings/basic_string/inserters_extractors/wchar_t/9.cc execution test
FAIL: 21_strings/basic_string/operations/char/1.cc execution test
FAIL: 21_strings/basic_string/operations/wchar_t/1.cc execution test
FAIL: 21_strings/basic_string/operators/char/1.cc execution test
FAIL: 21_strings/basic_string/operators/char/2.cc execution test
FAIL: 21_strings/basic_string/operators/wchar_t/1.cc execution test
FAIL: 21_strings/basic_string/operators/wchar_t/2.cc execution test
FAIL: 21_strings/basic_string/pthread4.cc execution test
FAIL: 21_strings/basic_string/replace/char/1.cc execution test
FAIL: 21_strings/basic_string/replace/char/2.cc execution test
FAIL: 21_strings/basic_string/replace/char/3.cc execution test
FAIL: 21_strings/basic_string/replace/char/4.cc execution test
FAIL: 21_strings/basic_string/replace/char/5.cc execution test
FAIL: 21_strings/basic_string/replace/char/6.cc execution test
FAIL: 21_strings/basic_string/replace/wchar_t/1.cc execution test
FAIL: 21_strings/basic_string/replace/wchar_t/2.cc execution test
FAIL: 21_strings/basic_string/replace/wchar_t/3.cc execution test
FAIL: 21_strings/basic_string/replace/wchar_t/4.cc execution test
FAIL: 21_strings/basic_string/replace/wchar_t/5.cc execution test
FAIL: 21_strings/basic_string/replace/wchar_t/6.cc execution test
FAIL: 21_strings/basic_string/requirements/exception/basic.cc execution test
FAIL: 21_strings/basic_string/requirements/exception/generation_prohibited.cc execution test
FAIL: 21_strings/basic_string/rfind/char/1.cc execution test
FAIL: 21_strings/basic_string/rfind/char/2.cc execution test
FAIL: 21_strings/basic_string/rfind/char/3.cc execution test
FAIL: 21_strings/basic_string/rfind/wchar_t/1.cc execution test
FAIL: 21_strings/basic_string/rfind/wchar_t/2.cc execution test
FAIL: 21_strings/basic_string/rfind/wchar_t/3.cc execution test
FAIL: 21_strings/basic_string/substr/char/1.cc execution test
FAIL: 21_strings/basic_string/substr/wchar_t/1.cc execution test
FAIL: 21_strings/c_strings/char/1.cc execution test
FAIL: 21_strings/c_strings/char/2.cc execution test
FAIL: 21_strings/c_strings/wchar_t/1.cc execution test
FAIL: 21_strings/c_strings/wchar_t/2.cc execution test
FAIL: 21_strings/char_traits/requirements/char/1.cc execution test
FAIL: 21_strings/char_traits/requirements/short/1.cc execution test
FAIL: 21_strings/char_traits/requirements/wchar_t/1.cc execution test
FAIL: 22_locale/codecvt/always_noconv/char/1.cc execution test
FAIL: 22_locale/codecvt/always_noconv/wchar_t/1.cc execution test
FAIL: 22_locale/codecvt/encoding/char/1.cc execution test
FAIL: 22_locale/codecvt/encoding/wchar_t/1.cc execution test
FAIL: 22_locale/codecvt/in/char/1.cc execution test
FAIL: 22_locale/codecvt/in/wchar_t/1.cc execution test
FAIL: 22_locale/codecvt/in/wchar_t/5.cc execution test
FAIL: 22_locale/codecvt/in/wchar_t/6.cc execution test
FAIL: 22_locale/codecvt/length/char/1.cc execution test
FAIL: 22_locale/codecvt/length/char/2.cc execution test
FAIL: 22_locale/codecvt/length/wchar_t/1.cc execution test
FAIL: 22_locale/codecvt/length/wchar_t/5.cc execution test
FAIL: 22_locale/codecvt/length/wchar_t/6.cc execution test
FAIL: 22_locale/codecvt/max_length/char/1.cc execution test
FAIL: 22_locale/codecvt/max_length/wchar_t/1.cc execution test
FAIL: 22_locale/codecvt/out/char/1.cc execution test
FAIL: 22_locale/codecvt/out/wchar_t/1.cc execution test
FAIL: 22_locale/codecvt/out/wchar_t/5.cc execution test
FAIL: 22_locale/codecvt/out/wchar_t/6.cc execution test
FAIL: 22_locale/codecvt/unshift/char/1.cc execution test
FAIL: 22_locale/codecvt/unshift/wchar_t/1.cc execution test
FAIL: 22_locale/collate/hash/char/1.cc execution test
FAIL: 22_locale/collate/hash/wchar_t/1.cc execution test
FAIL: 22_locale/collate/transform/char/28277.cc execution test
FAIL: 22_locale/collate/transform/wchar_t/28277.cc execution test
FAIL: 22_locale/ctype/cons/char/1.cc execution test
FAIL: 22_locale/ctype/is/char/1.cc execution test
FAIL: 22_locale/ctype/is/char/3.cc execution test
FAIL: 22_locale/ctype/is/char/9858.cc execution test
FAIL: 22_locale/ctype/is/wchar_t/1.cc execution test
FAIL: 22_locale/ctype/is/wchar_t/11740.cc execution test
FAIL: 22_locale/ctype/narrow/char/1.cc execution test
FAIL: 22_locale/ctype/narrow/char/19955.cc execution test
FAIL: 22_locale/ctype/narrow/char/2.cc execution test
FAIL: 22_locale/ctype/narrow/wchar_t/1.cc execution test
FAIL: 22_locale/ctype/narrow/wchar_t/2.cc execution test
FAIL: 22_locale/ctype/scan/char/1.cc execution test
FAIL: 22_locale/ctype/scan/wchar_t/1.cc execution test
FAIL: 22_locale/ctype/to/char/1.cc execution test
FAIL: 22_locale/ctype/to/wchar_t/1.cc execution test
FAIL: 22_locale/ctype/widen/char/1.cc execution test
FAIL: 22_locale/ctype/widen/wchar_t/1.cc execution test
FAIL: 22_locale/ctype_base/11844.cc execution test
FAIL: 22_locale/facet/1.cc execution test
FAIL: 22_locale/facet/25421.cc execution test
FAIL: 22_locale/global_templates/1.cc execution test
FAIL: 22_locale/global_templates/standard_facet_hierarchies.cc execution test
FAIL: 22_locale/global_templates/user_facet_hierarchies.cc execution test
FAIL: 22_locale/locale/13630.cc execution test
FAIL: 22_locale/locale/cons/1.cc execution test
FAIL: 22_locale/locale/cons/6.cc execution test
FAIL: 22_locale/locale/cons/7222-c.cc execution test
FAIL: 22_locale/locale/cons/8.cc execution test
FAIL: 22_locale/locale/global_locale_objects/1.cc execution test
FAIL: 22_locale/locale/global_locale_objects/3.cc execution test
FAIL: 22_locale/locale/operations/1.cc execution test
FAIL: 22_locale/locale/operations/2.cc execution test
FAIL: 22_locale/money_get/get/char/14.cc execution test
FAIL: 22_locale/money_get/get/char/19.cc execution test
FAIL: 22_locale/money_get/get/char/22131.cc execution test
FAIL: 22_locale/money_get/get/char/38399.cc execution test
FAIL: 22_locale/money_get/get/char/39168.cc execution test
FAIL: 22_locale/money_get/get/char/5.cc execution test
FAIL: 22_locale/money_get/get/char/6.cc execution test
FAIL: 22_locale/money_get/get/char/7.cc execution test
FAIL: 22_locale/money_get/get/char/8.cc execution test
FAIL: 22_locale/money_get/get/char/9.cc execution test
FAIL: 22_locale/money_get/get/wchar_t/14.cc execution test
FAIL: 22_locale/money_get/get/wchar_t/19.cc execution test
FAIL: 22_locale/money_get/get/wchar_t/22131.cc execution test
FAIL: 22_locale/money_get/get/wchar_t/38399.cc execution test
FAIL: 22_locale/money_get/get/wchar_t/39168.cc execution test
FAIL: 22_locale/money_get/get/wchar_t/5.cc execution test
FAIL: 22_locale/money_get/get/wchar_t/6.cc execution test
FAIL: 22_locale/money_get/get/wchar_t/7.cc execution test
FAIL: 22_locale/money_get/get/wchar_t/8.cc execution test
FAIL: 22_locale/money_get/get/wchar_t/9.cc execution test
FAIL: 22_locale/money_put/put/char/12971.cc execution test
FAIL: 22_locale/money_put/put/char/39168.cc execution test
FAIL: 22_locale/money_put/put/char/4.cc execution test
FAIL: 22_locale/money_put/put/char/5.cc execution test
FAIL: 22_locale/money_put/put/char/6.cc execution test
FAIL: 22_locale/money_put/put/wchar_t/12971.cc execution test
FAIL: 22_locale/money_put/put/wchar_t/39168.cc execution test
FAIL: 22_locale/money_put/put/wchar_t/4.cc execution test
FAIL: 22_locale/money_put/put/wchar_t/5.cc execution test
FAIL: 22_locale/money_put/put/wchar_t/6.cc execution test
FAIL: 22_locale/moneypunct/members/char/1.cc execution test
FAIL: 22_locale/moneypunct/members/wchar_t/1.cc execution test
FAIL: 22_locale/moneypunct/requirements/false/intl.cc execution test
FAIL: 22_locale/moneypunct/requirements/true/intl.cc execution test
FAIL: 22_locale/num_get/get/char/10.cc execution test
FAIL: 22_locale/num_get/get/char/11.cc execution test
FAIL: 22_locale/num_get/get/char/12.cc execution test
FAIL: 22_locale/num_get/get/char/13.cc execution test
FAIL: 22_locale/num_get/get/char/14.cc execution test
FAIL: 22_locale/num_get/get/char/15.cc execution test
FAIL: 22_locale/num_get/get/char/16.cc execution test
FAIL: 22_locale/num_get/get/char/2.cc execution test
FAIL: 22_locale/num_get/get/char/22131.cc execution test
FAIL: 22_locale/num_get/get/char/23953.cc execution test
FAIL: 22_locale/num_get/get/char/37958.cc execution test
FAIL: 22_locale/num_get/get/char/39168.cc execution test
FAIL: 22_locale/num_get/get/char/39802.cc execution test
FAIL: 22_locale/num_get/get/char/4.cc execution test
FAIL: 22_locale/num_get/get/char/7.cc execution test
FAIL: 22_locale/num_get/get/char/8.cc execution test
FAIL: 22_locale/num_get/get/wchar_t/10.cc execution test
FAIL: 22_locale/num_get/get/wchar_t/11.cc execution test
FAIL: 22_locale/num_get/get/wchar_t/12.cc execution test
FAIL: 22_locale/num_get/get/wchar_t/13.cc execution test
FAIL: 22_locale/num_get/get/wchar_t/14.cc execution test
FAIL: 22_locale/num_get/get/wchar_t/15.cc execution test
FAIL: 22_locale/num_get/get/wchar_t/16.cc execution test
FAIL: 22_locale/num_get/get/wchar_t/2.cc execution test
FAIL: 22_locale/num_get/get/wchar_t/22131.cc execution test
FAIL: 22_locale/num_get/get/wchar_t/23953.cc execution test
FAIL: 22_locale/num_get/get/wchar_t/37958.cc execution test
FAIL: 22_locale/num_get/get/wchar_t/39168.cc execution test
FAIL: 22_locale/num_get/get/wchar_t/39802.cc execution test
FAIL: 22_locale/num_get/get/wchar_t/4.cc execution test
FAIL: 22_locale/num_get/get/wchar_t/7.cc execution test
FAIL: 22_locale/num_get/get/wchar_t/8.cc execution test
FAIL: 22_locale/num_put/put/char/10.cc execution test
FAIL: 22_locale/num_put/put/char/11.cc execution test
FAIL: 22_locale/num_put/put/char/12.cc execution test
FAIL: 22_locale/num_put/put/char/14220.cc execution test
FAIL: 22_locale/num_put/put/char/15565.cc execution test
FAIL: 22_locale/num_put/put/char/2.cc execution test
FAIL: 22_locale/num_put/put/char/23953.cc execution test
FAIL: 22_locale/num_put/put/char/38196.cc execution test
FAIL: 22_locale/num_put/put/char/38210.cc execution test
FAIL: 22_locale/num_put/put/char/4.cc execution test
FAIL: 22_locale/num_put/put/char/6.cc execution test
FAIL: 22_locale/num_put/put/char/7.cc execution test
FAIL: 22_locale/num_put/put/char/8.cc execution test
FAIL: 22_locale/num_put/put/char/9.cc execution test
FAIL: 22_locale/num_put/put/wchar_t/10.cc execution test
FAIL: 22_locale/num_put/put/wchar_t/11.cc execution test
FAIL: 22_locale/num_put/put/wchar_t/12.cc execution test
FAIL: 22_locale/num_put/put/wchar_t/14220.cc execution test
FAIL: 22_locale/num_put/put/wchar_t/15565.cc execution test
FAIL: 22_locale/num_put/put/wchar_t/2.cc execution test
FAIL: 22_locale/num_put/put/wchar_t/23953.cc execution test
FAIL: 22_locale/num_put/put/wchar_t/38196.cc execution test
FAIL: 22_locale/num_put/put/wchar_t/38210.cc execution test
FAIL: 22_locale/num_put/put/wchar_t/4.cc execution test
FAIL: 22_locale/num_put/put/wchar_t/6.cc execution test
FAIL: 22_locale/num_put/put/wchar_t/7.cc execution test
FAIL: 22_locale/num_put/put/wchar_t/8.cc execution test
FAIL: 22_locale/num_put/put/wchar_t/9.cc execution test
FAIL: 22_locale/numpunct/members/char/1.cc execution test
FAIL: 22_locale/numpunct/members/char/cache_1.cc execution test
FAIL: 22_locale/numpunct/members/char/cache_2.cc execution test
FAIL: 22_locale/numpunct/members/pod/1.cc execution test
FAIL: 22_locale/numpunct/members/pod/2.cc execution test
FAIL: 22_locale/numpunct/members/wchar_t/1.cc execution test
FAIL: 22_locale/numpunct/members/wchar_t/cache_1.cc execution test
FAIL: 22_locale/numpunct/members/wchar_t/cache_2.cc execution test
FAIL: 22_locale/time_get/date_order/char/1.cc execution test
FAIL: 22_locale/time_get/date_order/wchar_t/1.cc execution test
FAIL: 22_locale/time_get/get_date/char/1.cc execution test
FAIL: 22_locale/time_get/get_date/char/12791.cc execution test
FAIL: 22_locale/time_get/get_date/char/3.cc execution test
FAIL: 22_locale/time_get/get_date/char/5.cc execution test
FAIL: 22_locale/time_get/get_date/wchar_t/1.cc execution test
FAIL: 22_locale/time_get/get_date/wchar_t/12791.cc execution test
FAIL: 22_locale/time_get/get_date/wchar_t/3.cc execution test
FAIL: 22_locale/time_get/get_date/wchar_t/5.cc execution test
FAIL: 22_locale/time_get/get_monthname/char/1.cc execution test
FAIL: 22_locale/time_get/get_monthname/char/3.cc execution test
FAIL: 22_locale/time_get/get_monthname/char/4.cc execution test
FAIL: 22_locale/time_get/get_monthname/char/5.cc execution test
FAIL: 22_locale/time_get/get_monthname/char/6.cc execution test
FAIL: 22_locale/time_get/get_monthname/wchar_t/1.cc execution test
FAIL: 22_locale/time_get/get_monthname/wchar_t/3.cc execution test
FAIL: 22_locale/time_get/get_monthname/wchar_t/4.cc execution test
FAIL: 22_locale/time_get/get_monthname/wchar_t/5.cc execution test
FAIL: 22_locale/time_get/get_monthname/wchar_t/6.cc execution test
FAIL: 22_locale/time_get/get_time/char/3.cc execution test
FAIL: 22_locale/time_get/get_time/char/4.cc execution test
FAIL: 22_locale/time_get/get_time/char/5.cc execution test
FAIL: 22_locale/time_get/get_time/wchar_t/3.cc execution test
FAIL: 22_locale/time_get/get_time/wchar_t/4.cc execution test
FAIL: 22_locale/time_get/get_time/wchar_t/5.cc execution test
FAIL: 22_locale/time_get/get_weekday/char/1.cc execution test
FAIL: 22_locale/time_get/get_weekday/char/3.cc execution test
FAIL: 22_locale/time_get/get_weekday/char/5.cc execution test
FAIL: 22_locale/time_get/get_weekday/char/6.cc execution test
FAIL: 22_locale/time_get/get_weekday/wchar_t/1.cc execution test
FAIL: 22_locale/time_get/get_weekday/wchar_t/3.cc execution test
FAIL: 22_locale/time_get/get_weekday/wchar_t/5.cc execution test
FAIL: 22_locale/time_get/get_weekday/wchar_t/6.cc execution test
FAIL: 22_locale/time_get/get_year/char/1.cc execution test
FAIL: 22_locale/time_get/get_year/char/3.cc execution test
FAIL: 22_locale/time_get/get_year/char/5.cc execution test
FAIL: 22_locale/time_get/get_year/wchar_t/1.cc execution test
FAIL: 22_locale/time_get/get_year/wchar_t/3.cc execution test
FAIL: 22_locale/time_get/get_year/wchar_t/5.cc execution test
FAIL: 22_locale/time_put/put/char/1.cc execution test
FAIL: 22_locale/time_put/put/char/10.cc execution test
FAIL: 22_locale/time_put/put/char/12439_1.cc execution test
FAIL: 22_locale/time_put/put/char/12439_3.cc execution test
FAIL: 22_locale/time_put/put/char/5.cc execution test
FAIL: 22_locale/time_put/put/char/9.cc execution test
FAIL: 22_locale/time_put/put/wchar_t/1.cc execution test
FAIL: 22_locale/time_put/put/wchar_t/10.cc execution test
FAIL: 22_locale/time_put/put/wchar_t/12439_1.cc execution test
FAIL: 22_locale/time_put/put/wchar_t/12439_2.cc execution test
FAIL: 22_locale/time_put/put/wchar_t/12439_3.cc execution test
FAIL: 22_locale/time_put/put/wchar_t/5.cc execution test
FAIL: 22_locale/time_put/put/wchar_t/9.cc execution test
FAIL: 23_containers/array/requirements/citerators.cc execution test
FAIL: 23_containers/array/requirements/fill.cc execution test
FAIL: 23_containers/bitset/all/1.cc execution test
FAIL: 23_containers/bitset/cons/1.cc execution test
FAIL: 23_containers/bitset/cons/16020.cc execution test
FAIL: 23_containers/bitset/cons/2.cc execution test
FAIL: 23_containers/bitset/cons/3.cc execution test
FAIL: 23_containers/bitset/cons/6282.cc execution test
FAIL: 23_containers/bitset/cons/dr396.cc execution test
FAIL: 23_containers/bitset/count/6124.cc execution test
FAIL: 23_containers/bitset/ext/15361.cc execution test
FAIL: 23_containers/bitset/hash/1.cc execution test
FAIL: 23_containers/bitset/input/1.cc execution test
FAIL: 23_containers/bitset/invalidation/1.cc execution test
FAIL: 23_containers/bitset/operations/1.cc execution test
FAIL: 23_containers/bitset/operations/13838.cc execution test
FAIL: 23_containers/bitset/operations/2.cc execution test
FAIL: 23_containers/bitset/test/1.cc execution test
FAIL: 23_containers/bitset/to_string/1.cc execution test
FAIL: 23_containers/bitset/to_string/dr396.cc execution test
FAIL: 23_containers/bitset/to_ullong/1.cc execution test
FAIL: 23_containers/bitset/to_ulong/1.cc execution test
FAIL: 23_containers/deque/capacity/29134-2.cc execution test
FAIL: 23_containers/deque/capacity/29134.cc execution test
FAIL: 23_containers/deque/capacity/moveable.cc execution test
FAIL: 23_containers/deque/capacity/shrink_to_fit.cc execution test
FAIL: 23_containers/deque/check_construct_destroy.cc execution test
FAIL: 23_containers/deque/cons/1.cc execution test
FAIL: 23_containers/deque/cons/2.cc execution test
FAIL: 23_containers/deque/cons/assign/1.cc execution test
FAIL: 23_containers/deque/cons/clear_allocator.cc execution test
FAIL: 23_containers/deque/cons/moveable.cc execution test
FAIL: 23_containers/deque/init-list.cc execution test
FAIL: 23_containers/deque/invalidation/1.cc execution test
FAIL: 23_containers/deque/invalidation/2.cc execution test
FAIL: 23_containers/deque/invalidation/3.cc execution test
FAIL: 23_containers/deque/invalidation/4.cc execution test
FAIL: 23_containers/deque/modifiers/erase/1.cc execution test
FAIL: 23_containers/deque/modifiers/erase/2.cc execution test
FAIL: 23_containers/deque/modifiers/erase/3.cc execution test
FAIL: 23_containers/deque/modifiers/erase/moveable.cc execution test
FAIL: 23_containers/deque/modifiers/moveable.cc execution test
FAIL: 23_containers/deque/modifiers/swap/1.cc execution test
FAIL: 23_containers/deque/modifiers/swap/2.cc execution test
FAIL: 23_containers/deque/modifiers/swap/3.cc execution test
FAIL: 23_containers/deque/operators/1.cc execution test
FAIL: 23_containers/deque/operators/2.cc execution test
FAIL: 23_containers/deque/requirements/citerators.cc execution test
FAIL: 23_containers/deque/requirements/exception/basic.cc execution test
FAIL: 23_containers/deque/requirements/exception/generation_prohibited.cc execution test
FAIL: 23_containers/forward_list/capacity/1.cc execution test
FAIL: 23_containers/forward_list/comparable.cc execution test
FAIL: 23_containers/forward_list/cons/1.cc execution test
FAIL: 23_containers/forward_list/cons/10.cc execution test
FAIL: 23_containers/forward_list/cons/2.cc execution test
FAIL: 23_containers/forward_list/cons/3.cc execution test
FAIL: 23_containers/forward_list/cons/4.cc execution test
FAIL: 23_containers/forward_list/cons/5.cc execution test
FAIL: 23_containers/forward_list/cons/6.cc execution test
FAIL: 23_containers/forward_list/cons/7.cc execution test
FAIL: 23_containers/forward_list/cons/8.cc execution test
FAIL: 23_containers/forward_list/cons/9.cc execution test
FAIL: 23_containers/forward_list/cons/moveable.cc execution test
FAIL: 23_containers/forward_list/modifiers/1.cc execution test
FAIL: 23_containers/forward_list/modifiers/2.cc execution test
FAIL: 23_containers/forward_list/modifiers/3.cc execution test
FAIL: 23_containers/forward_list/modifiers/4.cc execution test
FAIL: 23_containers/forward_list/modifiers/5.cc execution test
FAIL: 23_containers/forward_list/modifiers/6.cc execution test
FAIL: 23_containers/forward_list/operations/1.cc execution test
FAIL: 23_containers/forward_list/operations/2.cc execution test
FAIL: 23_containers/forward_list/operations/3.cc execution test
FAIL: 23_containers/forward_list/operations/4.cc execution test
FAIL: 23_containers/forward_list/operations/5.cc execution test
FAIL: 23_containers/forward_list/operations/6.cc execution test
FAIL: 23_containers/forward_list/operations/7.cc execution test
FAIL: 23_containers/forward_list/requirements/citerators.cc execution test
FAIL: 23_containers/forward_list/requirements/exception/basic.cc execution test
FAIL: 23_containers/forward_list/requirements/exception/generation_prohibited.cc execution test
FAIL: 23_containers/forward_list/requirements/exception/propagation_consistent.cc execution test
FAIL: 23_containers/list/capacity/1.cc execution test
FAIL: 23_containers/list/capacity/29134.cc execution test
FAIL: 23_containers/list/check_construct_destroy.cc execution test
FAIL: 23_containers/list/cons/1.cc execution test
FAIL: 23_containers/list/cons/2.cc execution test
FAIL: 23_containers/list/cons/3.cc execution test
FAIL: 23_containers/list/cons/4.cc execution test
FAIL: 23_containers/list/cons/5.cc execution test
FAIL: 23_containers/list/cons/6.cc execution test
FAIL: 23_containers/list/cons/7.cc execution test
FAIL: 23_containers/list/cons/8.cc execution test
FAIL: 23_containers/list/cons/9.cc execution test
FAIL: 23_containers/list/cons/clear_allocator.cc execution test
FAIL: 23_containers/list/cons/moveable.cc execution test
FAIL: 23_containers/list/init-list.cc execution test
FAIL: 23_containers/list/invalidation/1.cc execution test
FAIL: 23_containers/list/invalidation/2.cc execution test
FAIL: 23_containers/list/invalidation/3.cc execution test
FAIL: 23_containers/list/invalidation/4.cc execution test
FAIL: 23_containers/list/modifiers/1.cc execution test
FAIL: 23_containers/list/modifiers/1_c++0x.cc execution test
FAIL: 23_containers/list/modifiers/2.cc execution test
FAIL: 23_containers/list/modifiers/3.cc execution test
FAIL: 23_containers/list/modifiers/insert/25288.cc execution test
FAIL: 23_containers/list/modifiers/swap/1.cc execution test
FAIL: 23_containers/list/modifiers/swap/2.cc execution test
FAIL: 23_containers/list/modifiers/swap/3.cc execution test
FAIL: 23_containers/list/operations/1.cc execution test
FAIL: 23_containers/list/operations/2.cc execution test
FAIL: 23_containers/list/operations/2_c++0x.cc execution test
FAIL: 23_containers/list/operations/3.cc execution test
FAIL: 23_containers/list/operations/35969.cc execution test
FAIL: 23_containers/list/operations/3_c++0x.cc execution test
FAIL: 23_containers/list/operations/4.cc execution test
FAIL: 23_containers/list/operations/42352.cc execution test
FAIL: 23_containers/list/operations/5.cc execution test
FAIL: 23_containers/list/pthread1.cc execution test
FAIL: 23_containers/list/pthread5.cc execution test
FAIL: 23_containers/list/requirements/citerators.cc execution test
FAIL: 23_containers/list/requirements/exception/basic.cc execution test
FAIL: 23_containers/list/requirements/exception/generation_prohibited.cc execution test
FAIL: 23_containers/list/requirements/exception/propagation_consistent.cc execution test
FAIL: 23_containers/map/capacity/29134.cc execution test
FAIL: 23_containers/map/cons/moveable.cc execution test
FAIL: 23_containers/map/dr130.cc execution test
FAIL: 23_containers/map/element_access/1.cc execution test
FAIL: 23_containers/map/init-list.cc execution test
FAIL: 23_containers/map/invalidation/1.cc execution test
FAIL: 23_containers/map/invalidation/2.cc execution test
FAIL: 23_containers/map/modifiers/insert/1.cc execution test
FAIL: 23_containers/map/modifiers/insert/16813.cc execution test
FAIL: 23_containers/map/modifiers/swap/1.cc execution test
FAIL: 23_containers/map/modifiers/swap/2.cc execution test
FAIL: 23_containers/map/modifiers/swap/3.cc execution test
FAIL: 23_containers/map/operations/1.cc execution test
FAIL: 23_containers/map/operators/1.cc execution test
FAIL: 23_containers/map/requirements/citerators.cc execution test
FAIL: 23_containers/map/requirements/exception/basic.cc execution test
FAIL: 23_containers/map/requirements/exception/generation_prohibited.cc execution test
FAIL: 23_containers/map/requirements/exception/propagation_consistent.cc execution test
FAIL: 23_containers/multimap/capacity/29134.cc execution test
FAIL: 23_containers/multimap/cons/moveable.cc execution test
FAIL: 23_containers/multimap/dr130.cc execution test
FAIL: 23_containers/multimap/init-list.cc execution test
FAIL: 23_containers/multimap/invalidation/1.cc execution test
FAIL: 23_containers/multimap/invalidation/2.cc execution test
FAIL: 23_containers/multimap/modifiers/insert/22102.cc execution test
FAIL: 23_containers/multimap/modifiers/swap/1.cc execution test
FAIL: 23_containers/multimap/modifiers/swap/2.cc execution test
FAIL: 23_containers/multimap/modifiers/swap/3.cc execution test
FAIL: 23_containers/multimap/operations/1.cc execution test
FAIL: 23_containers/multimap/requirements/citerators.cc execution test
FAIL: 23_containers/multimap/requirements/exception/basic.cc execution test
FAIL: 23_containers/multimap/requirements/exception/generation_prohibited.cc execution test
FAIL: 23_containers/multimap/requirements/exception/propagation_consistent.cc execution test
FAIL: 23_containers/multiset/capacity/29134.cc execution test
FAIL: 23_containers/multiset/cons/moveable.cc execution test
FAIL: 23_containers/multiset/dr130.cc execution test
FAIL: 23_containers/multiset/init-list.cc execution test
FAIL: 23_containers/multiset/invalidation/1.cc execution test
FAIL: 23_containers/multiset/invalidation/2.cc execution test
FAIL: 23_containers/multiset/modifiers/insert/1.cc execution test
FAIL: 23_containers/multiset/modifiers/insert/2.cc execution test
FAIL: 23_containers/multiset/modifiers/insert/22102.cc execution test
FAIL: 23_containers/multiset/modifiers/swap/1.cc execution test
FAIL: 23_containers/multiset/modifiers/swap/2.cc execution test
FAIL: 23_containers/multiset/modifiers/swap/3.cc execution test
FAIL: 23_containers/multiset/operations/1.cc execution test
FAIL: 23_containers/multiset/requirements/citerators.cc execution test
FAIL: 23_containers/multiset/requirements/exception/basic.cc execution test
FAIL: 23_containers/multiset/requirements/exception/generation_prohibited.cc execution test
FAIL: 23_containers/multiset/requirements/exception/propagation_consistent.cc execution test
FAIL: 23_containers/priority_queue/members/7161.cc execution test
FAIL: 23_containers/priority_queue/moveable.cc execution test
FAIL: 23_containers/queue/members/7157.cc execution test
FAIL: 23_containers/queue/moveable.cc execution test
FAIL: 23_containers/set/capacity/29134.cc execution test
FAIL: 23_containers/set/check_construct_destroy.cc execution test
FAIL: 23_containers/set/cons/moveable.cc execution test
FAIL: 23_containers/set/dr130.cc execution test
FAIL: 23_containers/set/init-list.cc execution test
FAIL: 23_containers/set/invalidation/1.cc execution test
FAIL: 23_containers/set/invalidation/2.cc execution test
FAIL: 23_containers/set/modifiers/16728.cc execution test
FAIL: 23_containers/set/modifiers/17948.cc execution test
FAIL: 23_containers/set/modifiers/insert/1.cc execution test
FAIL: 23_containers/set/modifiers/swap/1.cc execution test
FAIL: 23_containers/set/modifiers/swap/2.cc execution test
FAIL: 23_containers/set/modifiers/swap/3.cc execution test
FAIL: 23_containers/set/operations/1.cc execution test
FAIL: 23_containers/set/requirements/citerators.cc execution test
FAIL: 23_containers/set/requirements/exception/basic.cc execution test
FAIL: 23_containers/set/requirements/exception/generation_prohibited.cc execution test
FAIL: 23_containers/set/requirements/exception/propagation_consistent.cc execution test
FAIL: 23_containers/stack/members/7158.cc execution test
FAIL: 23_containers/unordered_map/cons/moveable.cc execution test
FAIL: 23_containers/unordered_map/dr1189.cc execution test
FAIL: 23_containers/unordered_map/dr761.cc execution test
FAIL: 23_containers/unordered_map/erase/1.cc execution test
FAIL: 23_containers/unordered_map/erase/24061-map.cc execution test
FAIL: 23_containers/unordered_map/init-list.cc execution test
FAIL: 23_containers/unordered_map/insert/24061-map.cc execution test
FAIL: 23_containers/unordered_map/insert/array_syntax.cc execution test
FAIL: 23_containers/unordered_map/insert/map_range.cc execution test
FAIL: 23_containers/unordered_map/insert/map_single.cc execution test
FAIL: 23_containers/unordered_map/operators/1.cc execution test
FAIL: 23_containers/unordered_map/profile/hash_map.cc execution test
FAIL: 23_containers/unordered_map/profile/unordered.cc execution test
FAIL: 23_containers/unordered_map/requirements/citerators.cc execution test
FAIL: 23_containers/unordered_map/requirements/cliterators.cc execution test
FAIL: 23_containers/unordered_map/requirements/exception/basic.cc execution test
FAIL: 23_containers/unordered_map/requirements/exception/generation_prohibited.cc execution test
FAIL: 23_containers/unordered_map/requirements/exception/propagation_consistent.cc execution test
FAIL: 23_containers/unordered_multimap/cons/moveable.cc execution test
FAIL: 23_containers/unordered_multimap/dr1189.cc execution test
FAIL: 23_containers/unordered_multimap/erase/1.cc execution test
FAIL: 23_containers/unordered_multimap/erase/24061-multimap.cc execution test
FAIL: 23_containers/unordered_multimap/init-list.cc execution test
FAIL: 23_containers/unordered_multimap/insert/24061-multimap.cc execution test
FAIL: 23_containers/unordered_multimap/insert/multimap_range.cc execution test
FAIL: 23_containers/unordered_multimap/insert/multimap_single.cc execution test
FAIL: 23_containers/unordered_multimap/operators/1.cc execution test
FAIL: 23_containers/unordered_multimap/operators/2.cc execution test
FAIL: 23_containers/unordered_multimap/requirements/citerators.cc execution test
FAIL: 23_containers/unordered_multimap/requirements/cliterators.cc execution test
FAIL: 23_containers/unordered_multimap/requirements/exception/basic.cc execution test
FAIL: 23_containers/unordered_multimap/requirements/exception/generation_prohibited.cc execution test
FAIL: 23_containers/unordered_multimap/requirements/exception/propagation_consistent.cc execution test
FAIL: 23_containers/unordered_multiset/cons/moveable.cc execution test
FAIL: 23_containers/unordered_multiset/dr1189.cc execution test
FAIL: 23_containers/unordered_multiset/erase/1.cc execution test
FAIL: 23_containers/unordered_multiset/erase/24061-multiset.cc execution test
FAIL: 23_containers/unordered_multiset/init-list.cc execution test
FAIL: 23_containers/unordered_multiset/insert/24061-multiset.cc execution test
FAIL: 23_containers/unordered_multiset/insert/multiset_range.cc execution test
FAIL: 23_containers/unordered_multiset/insert/multiset_single.cc execution test
FAIL: 23_containers/unordered_multiset/operators/1.cc execution test
FAIL: 23_containers/unordered_multiset/requirements/citerators.cc execution test
FAIL: 23_containers/unordered_multiset/requirements/cliterators.cc execution test
FAIL: 23_containers/unordered_multiset/requirements/exception/basic.cc execution test
FAIL: 23_containers/unordered_multiset/requirements/exception/generation_prohibited.cc execution test
FAIL: 23_containers/unordered_multiset/requirements/exception/propagation_consistent.cc execution test
FAIL: 23_containers/unordered_set/cons/moveable.cc execution test
FAIL: 23_containers/unordered_set/dr1189.cc execution test
FAIL: 23_containers/unordered_set/erase/1.cc execution test
FAIL: 23_containers/unordered_set/erase/24061-set.cc execution test
FAIL: 23_containers/unordered_set/init-list.cc execution test
FAIL: 23_containers/unordered_set/insert/24061-set.cc execution test
FAIL: 23_containers/unordered_set/insert/set_range.cc execution test
FAIL: 23_containers/unordered_set/insert/set_single.cc execution test
FAIL: 23_containers/unordered_set/operators/1.cc execution test
FAIL: 23_containers/unordered_set/requirements/citerators.cc execution test
FAIL: 23_containers/unordered_set/requirements/cliterators.cc execution test
FAIL: 23_containers/unordered_set/requirements/exception/basic.cc execution test
FAIL: 23_containers/unordered_set/requirements/exception/generation_prohibited.cc execution test
FAIL: 23_containers/unordered_set/requirements/exception/propagation_consistent.cc execution test
FAIL: 23_containers/vector/15523.cc execution test
FAIL: 23_containers/vector/bool/1.cc execution test
FAIL: 23_containers/vector/bool/6886.cc execution test
FAIL: 23_containers/vector/bool/capacity/1.cc execution test
FAIL: 23_containers/vector/bool/capacity/29134.cc execution test
FAIL: 23_containers/vector/bool/clear_allocator.cc execution test
FAIL: 23_containers/vector/bool/cons/1.cc execution test
FAIL: 23_containers/vector/bool/cons/2.cc execution test
FAIL: 23_containers/vector/bool/hash/1.cc execution test
FAIL: 23_containers/vector/bool/modifiers/erase/1.cc execution test
FAIL: 23_containers/vector/bool/modifiers/insert/1.cc execution test
FAIL: 23_containers/vector/bool/modifiers/insert/31370.cc execution test
FAIL: 23_containers/vector/bool/modifiers/swap/1.cc execution test
FAIL: 23_containers/vector/bool/modifiers/swap/2.cc execution test
FAIL: 23_containers/vector/bool/requirements/citerators.cc execution test
FAIL: 23_containers/vector/capacity/1.cc execution test
FAIL: 23_containers/vector/capacity/2.cc execution test
FAIL: 23_containers/vector/capacity/29134-2.cc execution test
FAIL: 23_containers/vector/capacity/29134.cc execution test
FAIL: 23_containers/vector/capacity/8230.cc execution test
FAIL: 23_containers/vector/capacity/reserve/moveable.cc execution test
FAIL: 23_containers/vector/capacity/shrink_to_fit.cc execution test
FAIL: 23_containers/vector/check_construct_destroy.cc execution test
FAIL: 23_containers/vector/cons/1.cc execution test
FAIL: 23_containers/vector/cons/2.cc execution test
FAIL: 23_containers/vector/cons/3.cc execution test
FAIL: 23_containers/vector/cons/4.cc execution test
FAIL: 23_containers/vector/cons/6513.cc execution test
FAIL: 23_containers/vector/cons/clear_allocator.cc execution test
FAIL: 23_containers/vector/cons/moveable.cc execution test
FAIL: 23_containers/vector/data_access/1.cc execution test
FAIL: 23_containers/vector/debug_mode_requires_reallocation-1.cc execution test
FAIL: 23_containers/vector/debug_mode_requires_reallocation-2.cc execution test
FAIL: 23_containers/vector/element_access/1.cc execution test
FAIL: 23_containers/vector/ext_pointer/citerators.cc execution test
FAIL: 23_containers/vector/ext_pointer/data_access.cc execution test
FAIL: 23_containers/vector/ext_pointer/modifiers/element.cc execution test
FAIL: 23_containers/vector/ext_pointer/modifiers/erase.cc execution test
FAIL: 23_containers/vector/ext_pointer/modifiers/insert.cc execution test
FAIL: 23_containers/vector/ext_pointer/resize.cc execution test
FAIL: 23_containers/vector/ext_pointer/types/1.cc execution test
FAIL: 23_containers/vector/init-list.cc execution test
FAIL: 23_containers/vector/invalidation/1.cc execution test
FAIL: 23_containers/vector/invalidation/2.cc execution test
FAIL: 23_containers/vector/invalidation/3.cc execution test
FAIL: 23_containers/vector/invalidation/4.cc execution test
FAIL: 23_containers/vector/modifiers/1.cc execution test
FAIL: 23_containers/vector/modifiers/2.cc execution test
FAIL: 23_containers/vector/modifiers/erase/1.cc execution test
FAIL: 23_containers/vector/modifiers/erase/moveable.cc execution test
FAIL: 23_containers/vector/modifiers/insert/1.cc execution test
FAIL: 23_containers/vector/modifiers/moveable.cc execution test
FAIL: 23_containers/vector/modifiers/swap/1.cc execution test
FAIL: 23_containers/vector/modifiers/swap/2.cc execution test
FAIL: 23_containers/vector/modifiers/swap/3.cc execution test
FAIL: 23_containers/vector/profile/vector.cc execution test
FAIL: 23_containers/vector/requirements/citerators.cc execution test
FAIL: 23_containers/vector/requirements/exception/basic.cc execution test
FAIL: 23_containers/vector/requirements/exception/generation_prohibited.cc execution test
FAIL: 23_containers/vector/requirements/exception/propagation_consistent.cc execution test
FAIL: 23_containers/vector/resize/1.cc execution test
FAIL: 23_containers/vector/resize/moveable.cc execution test
FAIL: 23_containers/vector/zero_sized_allocations.cc execution test
FAIL: 24_iterators/back_insert_iterator/2.cc execution test
FAIL: 24_iterators/front_insert_iterator/2.cc execution test
FAIL: 24_iterators/insert_iterator/2.cc execution test
FAIL: 24_iterators/istream_iterator/2.cc execution test
FAIL: 24_iterators/istreambuf_iterator/2.cc execution test
FAIL: 24_iterators/istreambuf_iterator/2627.cc execution test
FAIL: 24_iterators/operations/next.cc execution test
FAIL: 24_iterators/operations/prev.cc execution test
FAIL: 24_iterators/ostreambuf_iterator/2.cc execution test
FAIL: 24_iterators/random_access_iterator/26020.cc execution test
FAIL: 24_iterators/random_access_iterator/string_vector_iterators.cc execution test
FAIL: 24_iterators/reverse_iterator/11729.cc execution test
FAIL: 24_iterators/reverse_iterator/2.cc execution test
FAIL: 24_iterators/reverse_iterator/3.cc execution test
FAIL: 25_algorithms/adjacent_find/1.cc execution test
FAIL: 25_algorithms/all_of/1.cc execution test
FAIL: 25_algorithms/any_of/1.cc execution test
FAIL: 25_algorithms/binary_search/1.cc execution test
FAIL: 25_algorithms/binary_search/2.cc execution test
FAIL: 25_algorithms/copy/1.cc execution test
FAIL: 25_algorithms/copy/2.cc execution test
FAIL: 25_algorithms/copy/3.cc execution test
FAIL: 25_algorithms/copy/34595.cc execution test
FAIL: 25_algorithms/copy/4.cc execution test
FAIL: 25_algorithms/copy/deque_iterators/1.cc execution test
FAIL: 25_algorithms/copy/move_iterators/1.cc execution test
FAIL: 25_algorithms/copy/streambuf_iterators/char/1.cc execution test
FAIL: 25_algorithms/copy/streambuf_iterators/char/2.cc execution test
FAIL: 25_algorithms/copy/streambuf_iterators/char/3.cc execution test
FAIL: 25_algorithms/copy/streambuf_iterators/wchar_t/1.cc execution test
FAIL: 25_algorithms/copy/streambuf_iterators/wchar_t/2.cc execution test
FAIL: 25_algorithms/copy/streambuf_iterators/wchar_t/3.cc execution test
FAIL: 25_algorithms/copy/streambuf_iterators/wchar_t/4.cc execution test
FAIL: 25_algorithms/copy_backward/deque_iterators/1.cc execution test
FAIL: 25_algorithms/copy_backward/move_iterators/1.cc execution test
FAIL: 25_algorithms/copy_n/1.cc execution test
FAIL: 25_algorithms/copy_n/2.cc execution test
FAIL: 25_algorithms/copy_n/3.cc execution test
FAIL: 25_algorithms/copy_n/4.cc execution test
FAIL: 25_algorithms/copy_n/move_iterators/1.cc execution test
FAIL: 25_algorithms/count/1.cc execution test
FAIL: 25_algorithms/count_if/1.cc execution test
FAIL: 25_algorithms/equal/1.cc execution test
FAIL: 25_algorithms/equal_range/1.cc execution test
FAIL: 25_algorithms/equal_range/2.cc execution test
FAIL: 25_algorithms/fill/1.cc execution test
FAIL: 25_algorithms/fill/2.cc execution test
FAIL: 25_algorithms/fill/3.cc execution test
FAIL: 25_algorithms/fill/4.cc execution test
FAIL: 25_algorithms/fill_n/1.cc execution test
FAIL: 25_algorithms/find/1.cc execution test
FAIL: 25_algorithms/find/17441.cc execution test
FAIL: 25_algorithms/find/39546.cc execution test
FAIL: 25_algorithms/find/istreambuf_iterators/char/1.cc execution test
FAIL: 25_algorithms/find/istreambuf_iterators/wchar_t/1.cc execution test
FAIL: 25_algorithms/find/istreambuf_iterators/wchar_t/2.cc execution test
FAIL: 25_algorithms/find_end/1.cc execution test
FAIL: 25_algorithms/find_first_of/1.cc execution test
FAIL: 25_algorithms/find_if/1.cc execution test
FAIL: 25_algorithms/find_if_not/1.cc execution test
FAIL: 25_algorithms/for_each/1.cc execution test
FAIL: 25_algorithms/heap/1.cc execution test
FAIL: 25_algorithms/heap/moveable.cc execution test
FAIL: 25_algorithms/heap/moveable2.cc execution test
FAIL: 25_algorithms/includes/1.cc execution test
FAIL: 25_algorithms/inplace_merge/1.cc execution test
FAIL: 25_algorithms/inplace_merge/moveable.cc execution test
FAIL: 25_algorithms/inplace_merge/moveable2.cc execution test
FAIL: 25_algorithms/is_heap/1.cc execution test
FAIL: 25_algorithms/is_heap_until/1.cc execution test
FAIL: 25_algorithms/is_partitioned/1.cc execution test
FAIL: 25_algorithms/is_sorted/1.cc execution test
FAIL: 25_algorithms/is_sorted_until/1.cc execution test
FAIL: 25_algorithms/iter_swap/20577.cc execution test
FAIL: 25_algorithms/lexicographical_compare/1.cc execution test
FAIL: 25_algorithms/lower_bound/1.cc execution test
FAIL: 25_algorithms/lower_bound/2.cc execution test
FAIL: 25_algorithms/max/1.cc execution test
FAIL: 25_algorithms/max/2.cc execution test
FAIL: 25_algorithms/max/3.cc execution test
FAIL: 25_algorithms/max/37547.cc execution test
FAIL: 25_algorithms/max/4.cc execution test
FAIL: 25_algorithms/max_element/1.cc execution test
FAIL: 25_algorithms/merge/1.cc execution test
FAIL: 25_algorithms/min/1.cc execution test
FAIL: 25_algorithms/min/2.cc execution test
FAIL: 25_algorithms/min/3.cc execution test
FAIL: 25_algorithms/min/37547.cc execution test
FAIL: 25_algorithms/min/4.cc execution test
FAIL: 25_algorithms/min_element/1.cc execution test
FAIL: 25_algorithms/minmax/1.cc execution test
FAIL: 25_algorithms/minmax/2.cc execution test
FAIL: 25_algorithms/minmax/3.cc execution test
FAIL: 25_algorithms/minmax/37547.cc execution test
FAIL: 25_algorithms/minmax_element/1.cc execution test
FAIL: 25_algorithms/mismatch/1.cc execution test
FAIL: 25_algorithms/move/1.cc execution test
FAIL: 25_algorithms/move/deque_iterators/1.cc execution test
FAIL: 25_algorithms/move_backward/1.cc execution test
FAIL: 25_algorithms/move_backward/deque_iterators/1.cc execution test
FAIL: 25_algorithms/next_permutation/1.cc execution test
FAIL: 25_algorithms/next_permutation/moveable.cc execution test
FAIL: 25_algorithms/none_of/1.cc execution test
FAIL: 25_algorithms/nth_element/1.cc execution test
FAIL: 25_algorithms/nth_element/2.cc execution test
FAIL: 25_algorithms/nth_element/3.cc execution test
FAIL: 25_algorithms/nth_element/moveable.cc execution test
FAIL: 25_algorithms/partial_sort/1.cc execution test
FAIL: 25_algorithms/partial_sort/2.cc execution test
FAIL: 25_algorithms/partial_sort/moveable.cc execution test
FAIL: 25_algorithms/partial_sort_copy/1.cc execution test
FAIL: 25_algorithms/partial_sort_copy/2.cc execution test
FAIL: 25_algorithms/partition/1.cc execution test
FAIL: 25_algorithms/partition/moveable.cc execution test
FAIL: 25_algorithms/partition_copy/1.cc execution test
FAIL: 25_algorithms/partition_point/1.cc execution test
FAIL: 25_algorithms/prev_permutation/1.cc execution test
FAIL: 25_algorithms/prev_permutation/moveable.cc execution test
FAIL: 25_algorithms/random_shuffle/1.cc execution test
FAIL: 25_algorithms/random_shuffle/moveable.cc execution test
FAIL: 25_algorithms/remove/1.cc execution test
FAIL: 25_algorithms/remove/moveable.cc execution test
FAIL: 25_algorithms/remove_if/1.cc execution test
FAIL: 25_algorithms/remove_if/moveable.cc execution test
FAIL: 25_algorithms/replace/1.cc execution test
FAIL: 25_algorithms/replace_copy/1.cc execution test
FAIL: 25_algorithms/replace_copy_if/1.cc execution test
FAIL: 25_algorithms/replace_if/1.cc execution test
FAIL: 25_algorithms/rotate/1.cc execution test
FAIL: 25_algorithms/rotate/moveable.cc execution test
FAIL: 25_algorithms/rotate/moveable2.cc execution test
FAIL: 25_algorithms/rotate/rotate.cc execution test
FAIL: 25_algorithms/search/1.cc execution test
FAIL: 25_algorithms/search_n/iterator.cc execution test
FAIL: 25_algorithms/set_difference/1.cc execution test
FAIL: 25_algorithms/set_intersection/1.cc execution test
FAIL: 25_algorithms/set_symmetric_difference/1.cc execution test
FAIL: 25_algorithms/set_union/1.cc execution test
FAIL: 25_algorithms/shuffle/1.cc execution test
FAIL: 25_algorithms/sort/1.cc execution test
FAIL: 25_algorithms/sort/34095.cc execution test
FAIL: 25_algorithms/sort/34636.cc execution test
FAIL: 25_algorithms/sort/35588.cc execution test
FAIL: 25_algorithms/sort/moveable.cc execution test
FAIL: 25_algorithms/sort/vectorbool.cc execution test
FAIL: 25_algorithms/stable_partition/1.cc execution test
FAIL: 25_algorithms/stable_partition/mem_check.cc execution test
FAIL: 25_algorithms/stable_partition/moveable.cc execution test
FAIL: 25_algorithms/stable_sort/1.cc execution test
FAIL: 25_algorithms/stable_sort/2.cc execution test
FAIL: 25_algorithms/stable_sort/mem_check.cc execution test
FAIL: 25_algorithms/stable_sort/moveable.cc execution test
FAIL: 25_algorithms/stable_sort/moveable2.cc execution test
FAIL: 25_algorithms/swap_ranges/1.cc execution test
FAIL: 25_algorithms/unique/1.cc execution test
FAIL: 25_algorithms/unique/11480.cc execution test
FAIL: 25_algorithms/unique/2.cc execution test
FAIL: 25_algorithms/unique/moveable.cc execution test
FAIL: 25_algorithms/unique_copy/1.cc execution test
FAIL: 25_algorithms/unique_copy/2.cc execution test
FAIL: 25_algorithms/unique_copy/26133.cc execution test
FAIL: 25_algorithms/upper_bound/1.cc execution test
FAIL: 25_algorithms/upper_bound/2.cc execution test
FAIL: 26_numerics/accumulate/1.cc execution test
FAIL: 26_numerics/adjacent_difference/1.cc execution test
FAIL: 26_numerics/complex/13450.cc execution test
FAIL: 26_numerics/complex/buggy_complex.cc execution test
FAIL: 26_numerics/complex/complex_value.cc execution test
FAIL: 26_numerics/complex/dr387.cc execution test
FAIL: 26_numerics/complex/dr781_dr1137.cc execution test
FAIL: 26_numerics/complex/dr844.cc execution test
FAIL: 26_numerics/complex/inserters_extractors/char/1.cc execution test
FAIL: 26_numerics/complex/inserters_extractors/wchar_t/1.cc execution test
FAIL: 26_numerics/complex/pow.cc execution test
FAIL: 26_numerics/headers/cmath/19322.cc execution test
FAIL: 26_numerics/headers/cmath/c_math.cc execution test
FAIL: 26_numerics/headers/cmath/dr550.cc execution test
FAIL: 26_numerics/headers/cmath/fabs_inline.cc execution test
FAIL: 26_numerics/headers/cmath/overloads.cc execution test
FAIL: 26_numerics/headers/cmath/powi.cc execution test
FAIL: 26_numerics/headers/cstdlib/13943.cc execution test
FAIL: 26_numerics/headers/cstdlib/2190.cc execution test
FAIL: 26_numerics/inner_product/1.cc execution test
FAIL: 26_numerics/iota/1.cc execution test
FAIL: 26_numerics/partial_sum/1.cc execution test
FAIL: 26_numerics/random/bernoulli_distribution/cons/default.cc execution test
FAIL: 26_numerics/random/bernoulli_distribution/cons/parms.cc execution test
FAIL: 26_numerics/random/bernoulli_distribution/operators/equal.cc execution test
FAIL: 26_numerics/random/bernoulli_distribution/operators/inequal.cc execution test
FAIL: 26_numerics/random/bernoulli_distribution/operators/serialize.cc execution test
FAIL: 26_numerics/random/binomial_distribution/cons/default.cc execution test
FAIL: 26_numerics/random/binomial_distribution/cons/parms.cc execution test
FAIL: 26_numerics/random/binomial_distribution/operators/equal.cc execution test
FAIL: 26_numerics/random/binomial_distribution/operators/inequal.cc execution test
FAIL: 26_numerics/random/binomial_distribution/operators/serialize.cc execution test
FAIL: 26_numerics/random/cauchy_distribution/cons/default.cc execution test
FAIL: 26_numerics/random/cauchy_distribution/cons/parms.cc execution test
FAIL: 26_numerics/random/cauchy_distribution/operators/equal.cc execution test
FAIL: 26_numerics/random/cauchy_distribution/operators/inequal.cc execution test
FAIL: 26_numerics/random/cauchy_distribution/operators/serialize.cc execution test
FAIL: 26_numerics/random/chi_squared_distribution/cons/default.cc execution test
FAIL: 26_numerics/random/chi_squared_distribution/cons/parms.cc execution test
FAIL: 26_numerics/random/chi_squared_distribution/operators/equal.cc execution test
FAIL: 26_numerics/random/chi_squared_distribution/operators/inequal.cc execution test
FAIL: 26_numerics/random/chi_squared_distribution/operators/serialize.cc execution test
FAIL: 26_numerics/random/default_random_engine.cc execution test
FAIL: 26_numerics/random/discard_block_engine/cons/base_copy.cc execution test
FAIL: 26_numerics/random/discard_block_engine/cons/base_move.cc execution test
FAIL: 26_numerics/random/discard_block_engine/cons/copy.cc execution test
FAIL: 26_numerics/random/discard_block_engine/cons/default.cc execution test
FAIL: 26_numerics/random/discard_block_engine/cons/seed1.cc execution test
FAIL: 26_numerics/random/discard_block_engine/cons/seed2.cc execution test
FAIL: 26_numerics/random/discard_block_engine/cons/seed_seq.cc execution test
FAIL: 26_numerics/random/discard_block_engine/operators/equal.cc execution test
FAIL: 26_numerics/random/discard_block_engine/operators/inequal.cc execution test
FAIL: 26_numerics/random/discard_block_engine/operators/serialize.cc execution test
FAIL: 26_numerics/random/discrete_distribution/cons/default.cc execution test
FAIL: 26_numerics/random/discrete_distribution/cons/initlist.cc execution test
FAIL: 26_numerics/random/discrete_distribution/cons/num_xbound_fun.cc execution test
FAIL: 26_numerics/random/discrete_distribution/cons/range.cc execution test
FAIL: 26_numerics/random/discrete_distribution/operators/equal.cc execution test
FAIL: 26_numerics/random/discrete_distribution/operators/inequal.cc execution test
FAIL: 26_numerics/random/discrete_distribution/operators/serialize.cc execution test
FAIL: 26_numerics/random/exponential_distribution/cons/default.cc execution test
FAIL: 26_numerics/random/exponential_distribution/cons/parms.cc execution test
FAIL: 26_numerics/random/exponential_distribution/operators/equal.cc execution test
FAIL: 26_numerics/random/exponential_distribution/operators/inequal.cc execution test
FAIL: 26_numerics/random/exponential_distribution/operators/serialize.cc execution test
FAIL: 26_numerics/random/extreme_value_distribution/cons/default.cc execution test
FAIL: 26_numerics/random/extreme_value_distribution/cons/parms.cc execution test
FAIL: 26_numerics/random/extreme_value_distribution/operators/equal.cc execution test
FAIL: 26_numerics/random/extreme_value_distribution/operators/inequal.cc execution test
FAIL: 26_numerics/random/extreme_value_distribution/operators/serialize.cc execution test
FAIL: 26_numerics/random/fisher_f_distribution/cons/default.cc execution test
FAIL: 26_numerics/random/fisher_f_distribution/cons/parms.cc execution test
FAIL: 26_numerics/random/fisher_f_distribution/operators/equal.cc execution test
FAIL: 26_numerics/random/fisher_f_distribution/operators/inequal.cc execution test
FAIL: 26_numerics/random/fisher_f_distribution/operators/serialize.cc execution test
FAIL: 26_numerics/random/gamma_distribution/cons/default.cc execution test
FAIL: 26_numerics/random/gamma_distribution/cons/parms.cc execution test
FAIL: 26_numerics/random/gamma_distribution/operators/equal.cc execution test
FAIL: 26_numerics/random/gamma_distribution/operators/inequal.cc execution test
FAIL: 26_numerics/random/gamma_distribution/operators/serialize.cc execution test
FAIL: 26_numerics/random/geometric_distribution/cons/default.cc execution test
FAIL: 26_numerics/random/geometric_distribution/cons/parms.cc execution test
FAIL: 26_numerics/random/geometric_distribution/operators/equal.cc execution test
FAIL: 26_numerics/random/geometric_distribution/operators/inequal.cc execution test
FAIL: 26_numerics/random/geometric_distribution/operators/serialize.cc execution test
FAIL: 26_numerics/random/independent_bits_engine/cons/base_copy.cc execution test
FAIL: 26_numerics/random/independent_bits_engine/cons/base_move.cc execution test
FAIL: 26_numerics/random/independent_bits_engine/cons/copy.cc execution test
FAIL: 26_numerics/random/independent_bits_engine/cons/default.cc execution test
FAIL: 26_numerics/random/independent_bits_engine/cons/seed1.cc execution test
FAIL: 26_numerics/random/independent_bits_engine/cons/seed2.cc execution test
FAIL: 26_numerics/random/independent_bits_engine/cons/seed_seq.cc execution test
FAIL: 26_numerics/random/independent_bits_engine/operators/equal.cc execution test
FAIL: 26_numerics/random/independent_bits_engine/operators/inequal.cc execution test
FAIL: 26_numerics/random/independent_bits_engine/operators/serialize.cc execution test
FAIL: 26_numerics/random/knuth_b.cc execution test
FAIL: 26_numerics/random/linear_congruential_engine/cons/copy.cc execution test
FAIL: 26_numerics/random/linear_congruential_engine/cons/default.cc execution test
FAIL: 26_numerics/random/linear_congruential_engine/cons/seed1.cc execution test
FAIL: 26_numerics/random/linear_congruential_engine/cons/seed2.cc execution test
FAIL: 26_numerics/random/linear_congruential_engine/cons/seed_seq.cc execution test
FAIL: 26_numerics/random/linear_congruential_engine/operators/equal.cc execution test
FAIL: 26_numerics/random/linear_congruential_engine/operators/inequal.cc execution test
FAIL: 26_numerics/random/linear_congruential_engine/operators/serialize.cc execution test
FAIL: 26_numerics/random/lognormal_distribution/cons/default.cc execution test
FAIL: 26_numerics/random/lognormal_distribution/cons/parms.cc execution test
FAIL: 26_numerics/random/lognormal_distribution/operators/equal.cc execution test
FAIL: 26_numerics/random/lognormal_distribution/operators/inequal.cc execution test
FAIL: 26_numerics/random/lognormal_distribution/operators/serialize.cc execution test
FAIL: 26_numerics/random/mersenne_twister_engine/cons/copy.cc execution test
FAIL: 26_numerics/random/mersenne_twister_engine/cons/default.cc execution test
FAIL: 26_numerics/random/mersenne_twister_engine/cons/seed1.cc execution test
FAIL: 26_numerics/random/mersenne_twister_engine/cons/seed2.cc execution test
FAIL: 26_numerics/random/mersenne_twister_engine/cons/seed_seq.cc execution test
FAIL: 26_numerics/random/mersenne_twister_engine/operators/equal.cc execution test
FAIL: 26_numerics/random/mersenne_twister_engine/operators/inequal.cc execution test
FAIL: 26_numerics/random/mersenne_twister_engine/operators/serialize.cc execution test
FAIL: 26_numerics/random/minstd_rand.cc execution test
FAIL: 26_numerics/random/minstd_rand0.cc execution test
FAIL: 26_numerics/random/mt19937.cc execution test
FAIL: 26_numerics/random/mt19937_64.cc execution test
FAIL: 26_numerics/random/negative_binomial_distribution/cons/default.cc execution test
FAIL: 26_numerics/random/negative_binomial_distribution/cons/parms.cc execution test
FAIL: 26_numerics/random/negative_binomial_distribution/operators/equal.cc execution test
FAIL: 26_numerics/random/negative_binomial_distribution/operators/inequal.cc execution test
FAIL: 26_numerics/random/negative_binomial_distribution/operators/serialize.cc execution test
FAIL: 26_numerics/random/normal_distribution/cons/default.cc execution test
FAIL: 26_numerics/random/normal_distribution/cons/parms.cc execution test
FAIL: 26_numerics/random/normal_distribution/operators/equal.cc execution test
FAIL: 26_numerics/random/normal_distribution/operators/inequal.cc execution test
FAIL: 26_numerics/random/normal_distribution/operators/serialize.cc execution test
FAIL: 26_numerics/random/piecewise_constant_distribution/cons/default.cc execution test
FAIL: 26_numerics/random/piecewise_constant_distribution/cons/initlist_fun.cc execution test
FAIL: 26_numerics/random/piecewise_constant_distribution/cons/num_xbound_fun.cc execution test
FAIL: 26_numerics/random/piecewise_constant_distribution/cons/range.cc execution test
FAIL: 26_numerics/random/piecewise_constant_distribution/operators/equal.cc execution test
FAIL: 26_numerics/random/piecewise_constant_distribution/operators/inequal.cc execution test
FAIL: 26_numerics/random/piecewise_constant_distribution/operators/serialize.cc execution test
FAIL: 26_numerics/random/piecewise_linear_distribution/cons/default.cc execution test
FAIL: 26_numerics/random/piecewise_linear_distribution/cons/initlist_fun.cc execution test
FAIL: 26_numerics/random/piecewise_linear_distribution/cons/num_xbound_fun.cc execution test
FAIL: 26_numerics/random/piecewise_linear_distribution/cons/range.cc execution test
FAIL: 26_numerics/random/piecewise_linear_distribution/operators/equal.cc execution test
FAIL: 26_numerics/random/piecewise_linear_distribution/operators/inequal.cc execution test
FAIL: 26_numerics/random/piecewise_linear_distribution/operators/serialize.cc execution test
FAIL: 26_numerics/random/poisson_distribution/cons/default.cc execution test
FAIL: 26_numerics/random/poisson_distribution/cons/parms.cc execution test
FAIL: 26_numerics/random/poisson_distribution/operators/equal.cc execution test
FAIL: 26_numerics/random/poisson_distribution/operators/inequal.cc execution test
FAIL: 26_numerics/random/poisson_distribution/operators/serialize.cc execution test
FAIL: 26_numerics/random/random_device/cons/default.cc execution test
FAIL: 26_numerics/random/random_device/cons/token.cc execution test
FAIL: 26_numerics/random/ranlux24.cc execution test
FAIL: 26_numerics/random/ranlux24_base.cc execution test
FAIL: 26_numerics/random/ranlux48.cc execution test
FAIL: 26_numerics/random/ranlux48_base.cc execution test
FAIL: 26_numerics/random/seed_seq/cons/default.cc execution test
FAIL: 26_numerics/random/seed_seq/cons/initlist.cc execution test
FAIL: 26_numerics/random/seed_seq/cons/range.cc execution test
FAIL: 26_numerics/random/shuffle_order_engine/cons/base_copy.cc execution test
FAIL: 26_numerics/random/shuffle_order_engine/cons/base_move.cc execution test
FAIL: 26_numerics/random/shuffle_order_engine/cons/copy.cc execution test
FAIL: 26_numerics/random/shuffle_order_engine/cons/default.cc execution test
FAIL: 26_numerics/random/shuffle_order_engine/cons/seed1.cc execution test
FAIL: 26_numerics/random/shuffle_order_engine/cons/seed2.cc execution test
FAIL: 26_numerics/random/shuffle_order_engine/cons/seed_seq.cc execution test
FAIL: 26_numerics/random/shuffle_order_engine/operators/equal.cc execution test
FAIL: 26_numerics/random/shuffle_order_engine/operators/inequal.cc execution test
FAIL: 26_numerics/random/shuffle_order_engine/operators/serialize.cc execution test
FAIL: 26_numerics/random/student_t_distribution/cons/default.cc execution test
FAIL: 26_numerics/random/student_t_distribution/cons/parms.cc execution test
FAIL: 26_numerics/random/student_t_distribution/operators/equal.cc execution test
FAIL: 26_numerics/random/student_t_distribution/operators/inequal.cc execution test
FAIL: 26_numerics/random/student_t_distribution/operators/serialize.cc execution test
FAIL: 26_numerics/random/subtract_with_carry_engine/cons/copy.cc execution test
FAIL: 26_numerics/random/subtract_with_carry_engine/cons/default.cc execution test
FAIL: 26_numerics/random/subtract_with_carry_engine/cons/seed1.cc execution test
FAIL: 26_numerics/random/subtract_with_carry_engine/cons/seed2.cc execution test
FAIL: 26_numerics/random/subtract_with_carry_engine/cons/seed_seq.cc execution test
FAIL: 26_numerics/random/subtract_with_carry_engine/operators/equal.cc execution test
FAIL: 26_numerics/random/subtract_with_carry_engine/operators/inequal.cc execution test
FAIL: 26_numerics/random/subtract_with_carry_engine/operators/serialize.cc execution test
FAIL: 26_numerics/random/uniform_int_distribution/cons/default.cc execution test
FAIL: 26_numerics/random/uniform_int_distribution/cons/parms.cc execution test
FAIL: 26_numerics/random/uniform_int_distribution/operators/equal.cc execution test
FAIL: 26_numerics/random/uniform_int_distribution/operators/inequal.cc execution test
FAIL: 26_numerics/random/uniform_int_distribution/operators/serialize.cc execution test
FAIL: 26_numerics/random/uniform_real_distribution/cons/default.cc execution test
FAIL: 26_numerics/random/uniform_real_distribution/cons/parms.cc execution test
FAIL: 26_numerics/random/uniform_real_distribution/operators/equal.cc execution test
FAIL: 26_numerics/random/uniform_real_distribution/operators/inequal.cc execution test
FAIL: 26_numerics/random/uniform_real_distribution/operators/serialize.cc execution test
FAIL: 26_numerics/random/weibull_distribution/cons/default.cc execution test
FAIL: 26_numerics/random/weibull_distribution/cons/parms.cc execution test
FAIL: 26_numerics/random/weibull_distribution/operators/equal.cc execution test
FAIL: 26_numerics/random/weibull_distribution/operators/inequal.cc execution test
FAIL: 26_numerics/random/weibull_distribution/operators/serialize.cc execution test
FAIL: 26_numerics/slice/1.cc execution test
FAIL: 26_numerics/slice_array/array_assignment.cc execution test
FAIL: 26_numerics/valarray/27867.cc execution test
FAIL: 26_numerics/valarray/28277.cc execution test
FAIL: 26_numerics/valarray/30416.cc execution test
FAIL: 26_numerics/valarray/algo.cc execution test
FAIL: 26_numerics/valarray/binary_closure.cc execution test
FAIL: 26_numerics/valarray/const_bracket.cc execution test
FAIL: 26_numerics/valarray/dr543.cc execution test
FAIL: 26_numerics/valarray/dr630-1.cc execution test
FAIL: 26_numerics/valarray/dr630-2.cc execution test
FAIL: 26_numerics/valarray/init-list.cc execution test
FAIL: 26_numerics/valarray/operators.cc execution test
FAIL: 26_numerics/valarray/subset_assignment.cc execution test
FAIL: 27_io/basic_filebuf/close/char/3.cc execution test
FAIL: 27_io/basic_filebuf/close/char/4879.cc execution test
FAIL: 27_io/basic_filebuf/close/char/5.cc execution test
FAIL: 27_io/basic_filebuf/close/char/9964.cc execution test
FAIL: 27_io/basic_filebuf/close/wchar_t/12790-1.cc execution test
FAIL: 27_io/basic_filebuf/close/wchar_t/12790-2.cc execution test
FAIL: 27_io/basic_filebuf/close/wchar_t/12790-3.cc execution test
FAIL: 27_io/basic_filebuf/close/wchar_t/12790-4.cc execution test
FAIL: 27_io/basic_filebuf/cons/2020.cc execution test
FAIL: 27_io/basic_filebuf/cons/char/1.cc execution test
FAIL: 27_io/basic_filebuf/cons/wchar_t/1.cc execution test
FAIL: 27_io/basic_filebuf/cons/wchar_t/10132-1.cc execution test
FAIL: 27_io/basic_filebuf/imbue/12206.cc execution test
FAIL: 27_io/basic_filebuf/imbue/char/1.cc execution test
FAIL: 27_io/basic_filebuf/imbue/char/3.cc execution test
FAIL: 27_io/basic_filebuf/imbue/wchar_t/1.cc execution test
FAIL: 27_io/basic_filebuf/imbue/wchar_t/3.cc execution test
FAIL: 27_io/basic_filebuf/open/char/9507.cc execution test
FAIL: 27_io/basic_filebuf/overflow/char/1.cc execution test
FAIL: 27_io/basic_filebuf/overflow/char/13858.cc execution test
FAIL: 27_io/basic_filebuf/overflow/char/3599.cc execution test
FAIL: 27_io/basic_filebuf/overflow/wchar_t/13858.cc execution test
FAIL: 27_io/basic_filebuf/sbumpc/char/1-out.cc execution test
FAIL: 27_io/basic_filebuf/sbumpc/char/2-out.cc execution test
FAIL: 27_io/basic_filebuf/seekoff/10132-2.cc execution test
FAIL: 27_io/basic_filebuf/seekoff/char/12232.cc execution test
FAIL: 27_io/basic_filebuf/seekoff/char/26777.cc execution test
FAIL: 27_io/basic_filebuf/seekoff/wchar_t/11543.cc execution test
FAIL: 27_io/basic_filebuf/seekoff/wchar_t/12790-1.cc execution test
FAIL: 27_io/basic_filebuf/seekoff/wchar_t/12790-2.cc execution test
FAIL: 27_io/basic_filebuf/seekoff/wchar_t/12790-3.cc execution test
FAIL: 27_io/basic_filebuf/seekoff/wchar_t/12790-4.cc execution test
FAIL: 27_io/basic_filebuf/seekoff/wchar_t/3.cc execution test
FAIL: 27_io/basic_filebuf/seekoff/wchar_t/9875_seekoff.cc execution test
FAIL: 27_io/basic_filebuf/seekpos/10132-3.cc execution test
FAIL: 27_io/basic_filebuf/seekpos/char/12790-3.cc execution test
FAIL: 27_io/basic_filebuf/seekpos/wchar_t/1.cc execution test
FAIL: 27_io/basic_filebuf/seekpos/wchar_t/12790-1.cc execution test
FAIL: 27_io/basic_filebuf/seekpos/wchar_t/12790-2.cc execution test
FAIL: 27_io/basic_filebuf/seekpos/wchar_t/12790-3.cc execution test
FAIL: 27_io/basic_filebuf/seekpos/wchar_t/12790-4.cc execution test
FAIL: 27_io/basic_filebuf/seekpos/wchar_t/9875_seekpos.cc execution test
FAIL: 27_io/basic_filebuf/sgetc/char/2-out.cc execution test
FAIL: 27_io/basic_filebuf/sgetn/char/1-out.cc execution test
FAIL: 27_io/basic_filebuf/sgetn/char/2-out.cc execution test
FAIL: 27_io/basic_filebuf/showmanyc/char/9533-1.cc execution test
FAIL: 27_io/basic_filebuf/showmanyc/char/9533-2.cc execution test
FAIL: 27_io/basic_filebuf/snextc/char/1-out.cc execution test
FAIL: 27_io/basic_filebuf/snextc/char/2-out.cc execution test
FAIL: 27_io/basic_filebuf/sputc/char/1-in.cc execution test
FAIL: 27_io/basic_filebuf/sputc/char/1057.cc execution test
FAIL: 27_io/basic_filebuf/sputc/char/2-in.cc execution test
FAIL: 27_io/basic_filebuf/sputc/char/9701-2.cc execution test
FAIL: 27_io/basic_filebuf/sputn/char/1-in.cc execution test
FAIL: 27_io/basic_filebuf/sputn/char/1057.cc execution test
FAIL: 27_io/basic_filebuf/sputn/char/2-in.cc execution test
FAIL: 27_io/basic_filebuf/sputn/char/9701-1.cc execution test
FAIL: 27_io/basic_filebuf/sungetc/char/1-out.cc execution test
FAIL: 27_io/basic_filebuf/sungetc/char/2-out.cc execution test
FAIL: 27_io/basic_filebuf/sync/char/1.cc execution test
FAIL: 27_io/basic_filebuf/sync/char/1057.cc execution test
FAIL: 27_io/basic_filebuf/sync/wchar_t/1.cc execution test
FAIL: 27_io/basic_filebuf/underflow/char/1.cc execution test
FAIL: 27_io/basic_filebuf/underflow/char/10097.cc execution test
FAIL: 27_io/basic_filebuf/underflow/char/9027.cc execution test
FAIL: 27_io/basic_filebuf/underflow/wchar_t/11544-1.cc execution test
FAIL: 27_io/basic_filebuf/underflow/wchar_t/11544-2.cc execution test
FAIL: 27_io/basic_filebuf/underflow/wchar_t/11603.cc execution test
FAIL: 27_io/basic_filebuf/underflow/wchar_t/9178.cc execution test
FAIL: 27_io/basic_fstream/cons/1.cc execution test
FAIL: 27_io/basic_fstream/rdbuf/char/2832.cc execution test
FAIL: 27_io/basic_ifstream/cons/2020.cc execution test
FAIL: 27_io/basic_ifstream/rdbuf/char/2832.cc execution test
FAIL: 27_io/basic_ios/clear/char/1.cc execution test
FAIL: 27_io/basic_ios/cons/2020.cc execution test
FAIL: 27_io/basic_ios/cons/char/1.cc execution test
FAIL: 27_io/basic_ios/cons/char/2.cc execution test
FAIL: 27_io/basic_ios/cons/char/3.cc execution test
FAIL: 27_io/basic_ios/copyfmt/char/1.cc execution test
FAIL: 27_io/basic_ios/exceptions/char/1.cc execution test
FAIL: 27_io/basic_ios/exceptions/char/2.cc execution test
FAIL: 27_io/basic_ios/imbue/14072.cc execution test
FAIL: 27_io/basic_ios/locales/char/1.cc execution test
FAIL: 27_io/basic_iostream/cons/2020.cc execution test
FAIL: 27_io/basic_istream/cons/3.cc execution test
FAIL: 27_io/basic_istream/exceptions/char/9561.cc execution test
FAIL: 27_io/basic_istream/exceptions/wchar_t/9561.cc execution test
FAIL: 27_io/basic_istream/extractors_arithmetic/char/01.cc execution test
FAIL: 27_io/basic_istream/extractors_arithmetic/char/02.cc execution test
FAIL: 27_io/basic_istream/extractors_arithmetic/char/03.cc execution test
FAIL: 27_io/basic_istream/extractors_arithmetic/char/06.cc execution test
FAIL: 27_io/basic_istream/extractors_arithmetic/char/07.cc execution test
FAIL: 27_io/basic_istream/extractors_arithmetic/char/08.cc execution test
FAIL: 27_io/basic_istream/extractors_arithmetic/char/09.cc execution test
FAIL: 27_io/basic_istream/extractors_arithmetic/char/10.cc execution test
FAIL: 27_io/basic_istream/extractors_arithmetic/char/11.cc execution test
FAIL: 27_io/basic_istream/extractors_arithmetic/char/12.cc execution test
FAIL: 27_io/basic_istream/extractors_arithmetic/char/13.cc execution test
FAIL: 27_io/basic_istream/extractors_arithmetic/char/9555-ia.cc execution test
FAIL: 27_io/basic_istream/extractors_arithmetic/char/dr696.cc execution test
FAIL: 27_io/basic_istream/extractors_arithmetic/char/exceptions_badbit_throw.cc execution test
FAIL: 27_io/basic_istream/extractors_arithmetic/char/exceptions_failbit.cc execution test
FAIL: 27_io/basic_istream/extractors_arithmetic/char/exceptions_failbit_throw.cc execution test
FAIL: 27_io/basic_istream/extractors_arithmetic/pod/3983-1.cc execution test
FAIL: 27_io/basic_istream/extractors_arithmetic/wchar_t/01.cc execution test
FAIL: 27_io/basic_istream/extractors_arithmetic/wchar_t/02.cc execution test
FAIL: 27_io/basic_istream/extractors_arithmetic/wchar_t/03.cc execution test
FAIL: 27_io/basic_istream/extractors_arithmetic/wchar_t/06.cc execution test
FAIL: 27_io/basic_istream/extractors_arithmetic/wchar_t/07.cc execution test
FAIL: 27_io/basic_istream/extractors_arithmetic/wchar_t/08.cc execution test
FAIL: 27_io/basic_istream/extractors_arithmetic/wchar_t/09.cc execution test
FAIL: 27_io/basic_istream/extractors_arithmetic/wchar_t/10.cc execution test
FAIL: 27_io/basic_istream/extractors_arithmetic/wchar_t/11.cc execution test
FAIL: 27_io/basic_istream/extractors_arithmetic/wchar_t/12.cc execution test
FAIL: 27_io/basic_istream/extractors_arithmetic/wchar_t/13.cc execution test
FAIL: 27_io/basic_istream/extractors_arithmetic/wchar_t/9555-ia.cc execution test
FAIL: 27_io/basic_istream/extractors_arithmetic/wchar_t/dr696.cc execution test
FAIL: 27_io/basic_istream/extractors_arithmetic/wchar_t/exceptions_badbit_throw.cc execution test
FAIL: 27_io/basic_istream/extractors_arithmetic/wchar_t/exceptions_failbit.cc execution test
FAIL: 27_io/basic_istream/extractors_arithmetic/wchar_t/exceptions_failbit_throw.cc execution test
FAIL: 27_io/basic_istream/extractors_character/char/1.cc execution test
FAIL: 27_io/basic_istream/extractors_character/char/11095-i.cc execution test
FAIL: 27_io/basic_istream/extractors_character/char/2.cc execution test
FAIL: 27_io/basic_istream/extractors_character/char/3.cc execution test
FAIL: 27_io/basic_istream/extractors_character/char/9555-ic.cc execution test
FAIL: 27_io/basic_istream/extractors_character/pod/3983-2.cc execution test
FAIL: 27_io/basic_istream/extractors_character/wchar_t/1.cc execution test
FAIL: 27_io/basic_istream/extractors_character/wchar_t/11095-i.cc execution test
FAIL: 27_io/basic_istream/extractors_character/wchar_t/2.cc execution test
FAIL: 27_io/basic_istream/extractors_character/wchar_t/3.cc execution test
FAIL: 27_io/basic_istream/extractors_character/wchar_t/4.cc execution test
FAIL: 27_io/basic_istream/extractors_character/wchar_t/9555-ic.cc execution test
FAIL: 27_io/basic_istream/extractors_other/char/1.cc execution test
FAIL: 27_io/basic_istream/extractors_other/char/26181.cc execution test
FAIL: 27_io/basic_istream/extractors_other/char/3.cc execution test
FAIL: 27_io/basic_istream/extractors_other/char/9318-in.cc execution test
FAIL: 27_io/basic_istream/extractors_other/char/9424-in.cc execution test
FAIL: 27_io/basic_istream/extractors_other/char/9555-io.cc execution test
FAIL: 27_io/basic_istream/extractors_other/char/error_failbit.cc execution test
FAIL: 27_io/basic_istream/extractors_other/char/exceptions_badbit_throw.cc execution test
FAIL: 27_io/basic_istream/extractors_other/char/exceptions_failbit_throw.cc execution test
FAIL: 27_io/basic_istream/extractors_other/char/exceptions_null.cc execution test
FAIL: 27_io/basic_istream/extractors_other/pod/3983-3.cc execution test
FAIL: 27_io/basic_istream/extractors_other/wchar_t/1.cc execution test
FAIL: 27_io/basic_istream/extractors_other/wchar_t/2.cc execution test
FAIL: 27_io/basic_istream/extractors_other/wchar_t/26181.cc execution test
FAIL: 27_io/basic_istream/extractors_other/wchar_t/3.cc execution test
FAIL: 27_io/basic_istream/extractors_other/wchar_t/9318-in.cc execution test
FAIL: 27_io/basic_istream/extractors_other/wchar_t/9424-in.cc execution test
FAIL: 27_io/basic_istream/extractors_other/wchar_t/9555-io.cc execution test
FAIL: 27_io/basic_istream/extractors_other/wchar_t/error_failbit.cc execution test
FAIL: 27_io/basic_istream/extractors_other/wchar_t/exceptions_badbit_throw.cc execution test
FAIL: 27_io/basic_istream/extractors_other/wchar_t/exceptions_failbit_throw.cc execution test
FAIL: 27_io/basic_istream/extractors_other/wchar_t/exceptions_null.cc execution test
FAIL: 27_io/basic_istream/get/char/1.cc execution test
FAIL: 27_io/basic_istream/get/char/3.cc execution test
FAIL: 27_io/basic_istream/get/wchar_t/1.cc execution test
FAIL: 27_io/basic_istream/get/wchar_t/2.cc execution test
FAIL: 27_io/basic_istream/get/wchar_t/3.cc execution test
FAIL: 27_io/basic_istream/getline/char/1.cc execution test
FAIL: 27_io/basic_istream/getline/char/2.cc execution test
FAIL: 27_io/basic_istream/getline/char/3.cc execution test
FAIL: 27_io/basic_istream/getline/char/4.cc execution test
FAIL: 27_io/basic_istream/getline/char/6.cc execution test
FAIL: 27_io/basic_istream/getline/wchar_t/1.cc execution test
FAIL: 27_io/basic_istream/getline/wchar_t/2.cc execution test
FAIL: 27_io/basic_istream/getline/wchar_t/3.cc execution test
FAIL: 27_io/basic_istream/getline/wchar_t/4.cc execution test
FAIL: 27_io/basic_istream/getline/wchar_t/5.cc execution test
FAIL: 27_io/basic_istream/getline/wchar_t/6.cc execution test
FAIL: 27_io/basic_istream/ignore/char/1.cc execution test
FAIL: 27_io/basic_istream/ignore/char/6360.cc execution test
FAIL: 27_io/basic_istream/ignore/char/7220.cc execution test
FAIL: 27_io/basic_istream/ignore/wchar_t/1.cc execution test
FAIL: 27_io/basic_istream/ignore/wchar_t/2.cc execution test
FAIL: 27_io/basic_istream/ignore/wchar_t/3.cc execution test
FAIL: 27_io/basic_istream/ignore/wchar_t/6360.cc execution test
FAIL: 27_io/basic_istream/ignore/wchar_t/7220.cc execution test
FAIL: 27_io/basic_istream/peek/char/1.cc execution test
FAIL: 27_io/basic_istream/peek/char/12296.cc execution test
FAIL: 27_io/basic_istream/peek/char/6414.cc execution test
FAIL: 27_io/basic_istream/peek/wchar_t/1.cc execution test
FAIL: 27_io/basic_istream/peek/wchar_t/12296.cc execution test
FAIL: 27_io/basic_istream/peek/wchar_t/6414.cc execution test
FAIL: 27_io/basic_istream/putback/char/1.cc execution test
FAIL: 27_io/basic_istream/putback/wchar_t/1.cc execution test
FAIL: 27_io/basic_istream/read/char/1.cc execution test
FAIL: 27_io/basic_istream/read/char/2.cc execution test
FAIL: 27_io/basic_istream/read/char/3.cc execution test
FAIL: 27_io/basic_istream/read/wchar_t/1.cc execution test
FAIL: 27_io/basic_istream/read/wchar_t/2.cc execution test
FAIL: 27_io/basic_istream/read/wchar_t/3.cc execution test
FAIL: 27_io/basic_istream/readsome/char/6746-1.cc execution test
FAIL: 27_io/basic_istream/readsome/char/8258.cc execution test
FAIL: 27_io/basic_istream/readsome/wchar_t/6746-1.cc execution test
FAIL: 27_io/basic_istream/readsome/wchar_t/6746-2.cc execution test
FAIL: 27_io/basic_istream/readsome/wchar_t/8258.cc execution test
FAIL: 27_io/basic_istream/seekg/char/2.cc execution test
FAIL: 27_io/basic_istream/seekg/char/8348-1.cc execution test
FAIL: 27_io/basic_istream/seekg/char/8348-2.cc execution test
FAIL: 27_io/basic_istream/seekg/char/exceptions_badbit_throw.cc execution test
FAIL: 27_io/basic_istream/seekg/wchar_t/2.cc execution test
FAIL: 27_io/basic_istream/seekg/wchar_t/8348-1.cc execution test
FAIL: 27_io/basic_istream/seekg/wchar_t/8348-2.cc execution test
FAIL: 27_io/basic_istream/seekg/wchar_t/exceptions_badbit_throw.cc execution test
FAIL: 27_io/basic_istream/seekg/wchar_t/fstream.cc execution test
FAIL: 27_io/basic_istream/seekg/wchar_t/sstream.cc execution test
FAIL: 27_io/basic_istream/sentry/char/1.cc execution test
FAIL: 27_io/basic_istream/sentry/char/12297.cc execution test
FAIL: 27_io/basic_istream/sentry/char/2.cc execution test
FAIL: 27_io/basic_istream/sentry/char/3.cc execution test
FAIL: 27_io/basic_istream/sentry/pod/1.cc execution test
FAIL: 27_io/basic_istream/sentry/wchar_t/1.cc execution test
FAIL: 27_io/basic_istream/sentry/wchar_t/12297.cc execution test
FAIL: 27_io/basic_istream/sentry/wchar_t/2.cc execution test
FAIL: 27_io/basic_istream/sentry/wchar_t/3.cc execution test
FAIL: 27_io/basic_istream/tellg/char/2.cc execution test
FAIL: 27_io/basic_istream/tellg/char/8348.cc execution test
FAIL: 27_io/basic_istream/tellg/char/exceptions_badbit_throw.cc execution test
FAIL: 27_io/basic_istream/tellg/wchar_t/1.cc execution test
FAIL: 27_io/basic_istream/tellg/wchar_t/2.cc execution test
FAIL: 27_io/basic_istream/tellg/wchar_t/8348.cc execution test
FAIL: 27_io/basic_istream/tellg/wchar_t/exceptions_badbit_throw.cc execution test
FAIL: 27_io/basic_istream/tellg/wchar_t/fstream.cc execution test
FAIL: 27_io/basic_istream/tellg/wchar_t/sstream.cc execution test
FAIL: 27_io/basic_istream/ws/char/1.cc execution test
FAIL: 27_io/basic_istream/ws/wchar_t/1.cc execution test
FAIL: 27_io/basic_istringstream/cons/2020.cc execution test
FAIL: 27_io/basic_istringstream/rdbuf/char/2832.cc execution test
FAIL: 27_io/basic_istringstream/rdbuf/wchar_t/2832.cc execution test
FAIL: 27_io/basic_istringstream/str/char/1.cc execution test
FAIL: 27_io/basic_istringstream/str/wchar_t/1.cc execution test
FAIL: 27_io/basic_ofstream/cons/2020.cc execution test
FAIL: 27_io/basic_ofstream/rdbuf/char/2832.cc execution test
FAIL: 27_io/basic_ostream/cons/2020.cc execution test
FAIL: 27_io/basic_ostream/cons/char/9827.cc execution test
FAIL: 27_io/basic_ostream/cons/wchar_t/9827.cc execution test
FAIL: 27_io/basic_ostream/endl/char/1.cc execution test
FAIL: 27_io/basic_ostream/endl/wchar_t/1.cc execution test
FAIL: 27_io/basic_ostream/ends/char/1.cc execution test
FAIL: 27_io/basic_ostream/ends/char/2.cc execution test
FAIL: 27_io/basic_ostream/ends/wchar_t/1.cc execution test
FAIL: 27_io/basic_ostream/ends/wchar_t/2.cc execution test
FAIL: 27_io/basic_ostream/exceptions/char/9561.cc execution test
FAIL: 27_io/basic_ostream/exceptions/wchar_t/9561.cc execution test
FAIL: 27_io/basic_ostream/flush/char/1.cc execution test
FAIL: 27_io/basic_ostream/flush/char/2.cc execution test
FAIL: 27_io/basic_ostream/flush/char/exceptions_badbit_throw.cc execution test
FAIL: 27_io/basic_ostream/flush/wchar_t/1.cc execution test
FAIL: 27_io/basic_ostream/flush/wchar_t/2.cc execution test
FAIL: 27_io/basic_ostream/flush/wchar_t/exceptions_badbit_throw.cc execution test
FAIL: 27_io/basic_ostream/inserters_arithmetic/char/1.cc execution test
FAIL: 27_io/basic_ostream/inserters_arithmetic/char/3.cc execution test
FAIL: 27_io/basic_ostream/inserters_arithmetic/char/4.cc execution test
FAIL: 27_io/basic_ostream/inserters_arithmetic/char/4402.cc execution test
FAIL: 27_io/basic_ostream/inserters_arithmetic/char/5.cc execution test
FAIL: 27_io/basic_ostream/inserters_arithmetic/char/6.cc execution test
FAIL: 27_io/basic_ostream/inserters_arithmetic/char/7.cc execution test
FAIL: 27_io/basic_ostream/inserters_arithmetic/char/9555-oa.cc execution test
FAIL: 27_io/basic_ostream/inserters_arithmetic/char/exceptions_badbit_throw.cc execution test
FAIL: 27_io/basic_ostream/inserters_arithmetic/char/exceptions_failbit_throw.cc execution test
FAIL: 27_io/basic_ostream/inserters_arithmetic/pod/23875.cc execution test
FAIL: 27_io/basic_ostream/inserters_arithmetic/wchar_t/1.cc execution test
FAIL: 27_io/basic_ostream/inserters_arithmetic/wchar_t/3.cc execution test
FAIL: 27_io/basic_ostream/inserters_arithmetic/wchar_t/4.cc execution test
FAIL: 27_io/basic_ostream/inserters_arithmetic/wchar_t/4402.cc execution test
FAIL: 27_io/basic_ostream/inserters_arithmetic/wchar_t/5.cc execution test
FAIL: 27_io/basic_ostream/inserters_arithmetic/wchar_t/6.cc execution test
FAIL: 27_io/basic_ostream/inserters_arithmetic/wchar_t/7.cc execution test
FAIL: 27_io/basic_ostream/inserters_arithmetic/wchar_t/9555-oa.cc execution test
FAIL: 27_io/basic_ostream/inserters_arithmetic/wchar_t/exceptions_badbit_throw.cc execution test
FAIL: 27_io/basic_ostream/inserters_arithmetic/wchar_t/exceptions_failbit_throw.cc execution test
FAIL: 27_io/basic_ostream/inserters_character/char/1.cc execution test
FAIL: 27_io/basic_ostream/inserters_character/char/11095-oa.cc execution test
FAIL: 27_io/basic_ostream/inserters_character/char/11095-ob.cc execution test
FAIL: 27_io/basic_ostream/inserters_character/char/11095-oc.cc execution test
FAIL: 27_io/basic_ostream/inserters_character/char/2.cc execution test
FAIL: 27_io/basic_ostream/inserters_character/char/28277-3.cc execution test
FAIL: 27_io/basic_ostream/inserters_character/char/28277-4.cc execution test
FAIL: 27_io/basic_ostream/inserters_character/char/3.cc execution test
FAIL: 27_io/basic_ostream/inserters_character/char/4.cc execution test
FAIL: 27_io/basic_ostream/inserters_character/char/5.cc execution test
FAIL: 27_io/basic_ostream/inserters_character/char/6.cc execution test
FAIL: 27_io/basic_ostream/inserters_character/char/8.cc execution test
FAIL: 27_io/basic_ostream/inserters_character/char/9555-oc.cc execution test
FAIL: 27_io/basic_ostream/inserters_character/wchar_t/1.cc execution test
FAIL: 27_io/basic_ostream/inserters_character/wchar_t/11095-od.cc execution test
FAIL: 27_io/basic_ostream/inserters_character/wchar_t/11095-oe.cc execution test
FAIL: 27_io/basic_ostream/inserters_character/wchar_t/11095-of.cc execution test
FAIL: 27_io/basic_ostream/inserters_character/wchar_t/2.cc execution test
FAIL: 27_io/basic_ostream/inserters_character/wchar_t/28277-1.cc execution test
FAIL: 27_io/basic_ostream/inserters_character/wchar_t/28277-2.cc execution test
FAIL: 27_io/basic_ostream/inserters_character/wchar_t/28277-3.cc execution test
FAIL: 27_io/basic_ostream/inserters_character/wchar_t/28277-4.cc execution test
FAIL: 27_io/basic_ostream/inserters_character/wchar_t/3.cc execution test
FAIL: 27_io/basic_ostream/inserters_character/wchar_t/4.cc execution test
FAIL: 27_io/basic_ostream/inserters_character/wchar_t/5.cc execution test
FAIL: 27_io/basic_ostream/inserters_character/wchar_t/6.cc execution test
FAIL: 27_io/basic_ostream/inserters_character/wchar_t/7.cc execution test
FAIL: 27_io/basic_ostream/inserters_character/wchar_t/8.cc execution test
FAIL: 27_io/basic_ostream/inserters_character/wchar_t/9555-oc.cc execution test
FAIL: 27_io/basic_ostream/inserters_other/char/2.cc execution test
FAIL: 27_io/basic_ostream/inserters_other/char/3.cc execution test
FAIL: 27_io/basic_ostream/inserters_other/char/4.cc execution test
FAIL: 27_io/basic_ostream/inserters_other/char/5.cc execution test
FAIL: 27_io/basic_ostream/inserters_other/char/9318-out.cc execution test
FAIL: 27_io/basic_ostream/inserters_other/char/9424-out.cc execution test
FAIL: 27_io/basic_ostream/inserters_other/char/9555-oo.cc execution test
FAIL: 27_io/basic_ostream/inserters_other/char/error_code.cc execution test
FAIL: 27_io/basic_ostream/inserters_other/char/error_failbit.cc execution test
FAIL: 27_io/basic_ostream/inserters_other/char/exceptions_badbit_throw.cc execution test
FAIL: 27_io/basic_ostream/inserters_other/char/exceptions_failbit_throw.cc execution test
FAIL: 27_io/basic_ostream/inserters_other/char/exceptions_null.cc execution test
FAIL: 27_io/basic_ostream/inserters_other/wchar_t/1.cc execution test
FAIL: 27_io/basic_ostream/inserters_other/wchar_t/2.cc execution test
FAIL: 27_io/basic_ostream/inserters_other/wchar_t/3.cc execution test
FAIL: 27_io/basic_ostream/inserters_other/wchar_t/4.cc execution test
FAIL: 27_io/basic_ostream/inserters_other/wchar_t/5.cc execution test
FAIL: 27_io/basic_ostream/inserters_other/wchar_t/9318-out.cc execution test
FAIL: 27_io/basic_ostream/inserters_other/wchar_t/9424-out.cc execution test
FAIL: 27_io/basic_ostream/inserters_other/wchar_t/9555-oo.cc execution test
FAIL: 27_io/basic_ostream/inserters_other/wchar_t/error_code.cc execution test
FAIL: 27_io/basic_ostream/inserters_other/wchar_t/error_failbit.cc execution test
FAIL: 27_io/basic_ostream/inserters_other/wchar_t/exceptions_badbit_throw.cc execution test
FAIL: 27_io/basic_ostream/inserters_other/wchar_t/exceptions_failbit_throw.cc execution test
FAIL: 27_io/basic_ostream/inserters_other/wchar_t/exceptions_null.cc execution test
FAIL: 27_io/basic_ostream/put/char/1.cc execution test
FAIL: 27_io/basic_ostream/put/wchar_t/1.cc execution test
FAIL: 27_io/basic_ostream/seekp/char/2346-sstream.cc execution test
FAIL: 27_io/basic_ostream/seekp/char/exceptions_badbit_throw.cc execution test
FAIL: 27_io/basic_ostream/seekp/wchar_t/2346-fstream.cc execution test
FAIL: 27_io/basic_ostream/seekp/wchar_t/2346-sstream.cc execution test
FAIL: 27_io/basic_ostream/seekp/wchar_t/exceptions_badbit_throw.cc execution test
FAIL: 27_io/basic_ostream/sentry/char/1.cc execution test
FAIL: 27_io/basic_ostream/sentry/char/2.cc execution test
FAIL: 27_io/basic_ostream/sentry/pod/1.cc execution test
FAIL: 27_io/basic_ostream/sentry/wchar_t/1.cc execution test
FAIL: 27_io/basic_ostream/sentry/wchar_t/2.cc execution test
FAIL: 27_io/basic_ostream/tellp/char/2.cc execution test
FAIL: 27_io/basic_ostream/tellp/char/exceptions_badbit_throw.cc execution test
FAIL: 27_io/basic_ostream/tellp/wchar_t/1.cc execution test
FAIL: 27_io/basic_ostream/tellp/wchar_t/2.cc execution test
FAIL: 27_io/basic_ostream/tellp/wchar_t/exceptions_badbit_throw.cc execution test
FAIL: 27_io/basic_ostream/write/char/1.cc execution test
FAIL: 27_io/basic_ostream/write/wchar_t/1.cc execution test
FAIL: 27_io/basic_ostringstream/cons/2020.cc execution test
FAIL: 27_io/basic_ostringstream/cons/char/3.cc execution test
FAIL: 27_io/basic_ostringstream/cons/wchar_t/3.cc execution test
FAIL: 27_io/basic_ostringstream/rdbuf/char/2832.cc execution test
FAIL: 27_io/basic_ostringstream/rdbuf/wchar_t/2832.cc execution test
FAIL: 27_io/basic_ostringstream/str/char/1.cc execution test
FAIL: 27_io/basic_ostringstream/str/char/2.cc execution test
FAIL: 27_io/basic_ostringstream/str/wchar_t/1.cc execution test
FAIL: 27_io/basic_ostringstream/str/wchar_t/2.cc execution test
FAIL: 27_io/basic_streambuf/cons/2020.cc execution test
FAIL: 27_io/basic_streambuf/cons/char/1.cc execution test
FAIL: 27_io/basic_streambuf/cons/wchar_t/1.cc execution test
FAIL: 27_io/basic_streambuf/imbue/char/1.cc execution test
FAIL: 27_io/basic_streambuf/imbue/wchar_t/1.cc execution test
FAIL: 27_io/basic_streambuf/in_avail/char/1.cc execution test
FAIL: 27_io/basic_streambuf/in_avail/wchar_t/1.cc execution test
FAIL: 27_io/basic_streambuf/overflow/char/1.cc execution test
FAIL: 27_io/basic_streambuf/overflow/char/2.cc execution test
FAIL: 27_io/basic_streambuf/overflow/char/3599.cc execution test
FAIL: 27_io/basic_streambuf/overflow/wchar_t/1.cc execution test
FAIL: 27_io/basic_streambuf/overflow/wchar_t/2.cc execution test
FAIL: 27_io/basic_streambuf/overflow/wchar_t/3599.cc execution test
FAIL: 27_io/basic_streambuf/sgetc/char/1.cc execution test
FAIL: 27_io/basic_streambuf/sgetc/wchar_t/1.cc execution test
FAIL: 27_io/basic_streambuf/sgetn/char/1.cc execution test
FAIL: 27_io/basic_streambuf/sgetn/wchar_t/1.cc execution test
FAIL: 27_io/basic_streambuf/sputbackc/char/9538.cc execution test
FAIL: 27_io/basic_streambuf/sputbackc/wchar_t/9538.cc execution test
FAIL: 27_io/basic_streambuf/sputc/char/1057.cc execution test
FAIL: 27_io/basic_streambuf/sputc/wchar_t/1057.cc execution test
FAIL: 27_io/basic_streambuf/sputn/char/1.cc execution test
FAIL: 27_io/basic_streambuf/sputn/char/1057.cc execution test
FAIL: 27_io/basic_streambuf/sputn/wchar_t/1.cc execution test
FAIL: 27_io/basic_streambuf/sputn/wchar_t/1057.cc execution test
FAIL: 27_io/basic_streambuf/sync/char/1057.cc execution test
FAIL: 27_io/basic_streambuf/sync/wchar_t/1057.cc execution test
FAIL: 27_io/basic_stringbuf/cons/2020.cc execution test
FAIL: 27_io/basic_stringbuf/cons/char/1.cc execution test
FAIL: 27_io/basic_stringbuf/cons/wchar_t/1.cc execution test
FAIL: 27_io/basic_stringbuf/imbue/char/1.cc execution test
FAIL: 27_io/basic_stringbuf/imbue/wchar_t/1.cc execution test
FAIL: 27_io/basic_stringbuf/in_avail/char/1.cc execution test
FAIL: 27_io/basic_stringbuf/in_avail/char/21955.cc execution test
FAIL: 27_io/basic_stringbuf/in_avail/wchar_t/1.cc execution test
FAIL: 27_io/basic_stringbuf/overflow/char/1.cc execution test
FAIL: 27_io/basic_stringbuf/overflow/char/2.cc execution test
FAIL: 27_io/basic_stringbuf/overflow/char/26250.cc execution test
FAIL: 27_io/basic_stringbuf/overflow/char/3599.cc execution test
FAIL: 27_io/basic_stringbuf/overflow/char/9988.cc execution test
FAIL: 27_io/basic_stringbuf/overflow/wchar_t/1.cc execution test
FAIL: 27_io/basic_stringbuf/overflow/wchar_t/2.cc execution test
FAIL: 27_io/basic_stringbuf/overflow/wchar_t/26250.cc execution test
FAIL: 27_io/basic_stringbuf/overflow/wchar_t/3599.cc execution test
FAIL: 27_io/basic_stringbuf/overflow/wchar_t/9988.cc execution test
FAIL: 27_io/basic_stringbuf/pbackfail/char/1.cc execution test
FAIL: 27_io/basic_stringbuf/pbackfail/char/2.cc execution test
FAIL: 27_io/basic_stringbuf/pbackfail/wchar_t/1.cc execution test
FAIL: 27_io/basic_stringbuf/pbackfail/wchar_t/2.cc execution test
FAIL: 27_io/basic_stringbuf/sbumpc/char/1.cc execution test
FAIL: 27_io/basic_stringbuf/sbumpc/char/9825.cc execution test
FAIL: 27_io/basic_stringbuf/sbumpc/wchar_t/1.cc execution test
FAIL: 27_io/basic_stringbuf/sbumpc/wchar_t/9825.cc execution test
FAIL: 27_io/basic_stringbuf/seekoff/char/1.cc execution test
FAIL: 27_io/basic_stringbuf/seekoff/char/10975.cc execution test
FAIL: 27_io/basic_stringbuf/seekoff/char/16956.cc execution test
FAIL: 27_io/basic_stringbuf/seekoff/char/2.cc execution test
FAIL: 27_io/basic_stringbuf/seekoff/wchar_t/1.cc execution test
FAIL: 27_io/basic_stringbuf/seekoff/wchar_t/10975.cc execution test
FAIL: 27_io/basic_stringbuf/seekoff/wchar_t/16956.cc execution test
FAIL: 27_io/basic_stringbuf/seekoff/wchar_t/2.cc execution test
FAIL: 27_io/basic_stringbuf/seekpos/char/1.cc execution test
FAIL: 27_io/basic_stringbuf/seekpos/char/2.cc execution test
FAIL: 27_io/basic_stringbuf/seekpos/char/29354.cc execution test
FAIL: 27_io/basic_stringbuf/seekpos/char/3.cc execution test
FAIL: 27_io/basic_stringbuf/seekpos/wchar_t/1.cc execution test
FAIL: 27_io/basic_stringbuf/seekpos/wchar_t/2.cc execution test
FAIL: 27_io/basic_stringbuf/seekpos/wchar_t/29354.cc execution test
FAIL: 27_io/basic_stringbuf/seekpos/wchar_t/3.cc execution test
FAIL: 27_io/basic_stringbuf/setbuf/char/1.cc execution test
FAIL: 27_io/basic_stringbuf/setbuf/char/2.cc execution test
FAIL: 27_io/basic_stringbuf/setbuf/char/3.cc execution test
FAIL: 27_io/basic_stringbuf/setbuf/char/4.cc execution test
FAIL: 27_io/basic_stringbuf/setbuf/wchar_t/1.cc execution test
FAIL: 27_io/basic_stringbuf/setbuf/wchar_t/2.cc execution test
FAIL: 27_io/basic_stringbuf/setbuf/wchar_t/3.cc execution test
FAIL: 27_io/basic_stringbuf/setbuf/wchar_t/4.cc execution test
FAIL: 27_io/basic_stringbuf/sgetc/char/1.cc execution test
FAIL: 27_io/basic_stringbuf/sgetc/wchar_t/1.cc execution test
FAIL: 27_io/basic_stringbuf/sgetn/char/1.cc execution test
FAIL: 27_io/basic_stringbuf/sgetn/wchar_t/1.cc execution test
FAIL: 27_io/basic_stringbuf/snextc/char/1.cc execution test
FAIL: 27_io/basic_stringbuf/snextc/wchar_t/1.cc execution test
FAIL: 27_io/basic_stringbuf/sputbackc/char/1.cc execution test
FAIL: 27_io/basic_stringbuf/sputbackc/char/9425.cc execution test
FAIL: 27_io/basic_stringbuf/sputbackc/wchar_t/1.cc execution test
FAIL: 27_io/basic_stringbuf/sputbackc/wchar_t/9425.cc execution test
FAIL: 27_io/basic_stringbuf/sputc/char/1.cc execution test
FAIL: 27_io/basic_stringbuf/sputc/char/1057.cc execution test
FAIL: 27_io/basic_stringbuf/sputc/char/9404-1.cc execution test
FAIL: 27_io/basic_stringbuf/sputc/wchar_t/1.cc execution test
FAIL: 27_io/basic_stringbuf/sputc/wchar_t/1057.cc execution test
FAIL: 27_io/basic_stringbuf/sputc/wchar_t/9404-1.cc execution test
FAIL: 27_io/basic_stringbuf/sputn/char/1.cc execution test
FAIL: 27_io/basic_stringbuf/sputn/char/1057.cc execution test
FAIL: 27_io/basic_stringbuf/sputn/char/9404-2.cc execution test
FAIL: 27_io/basic_stringbuf/sputn/wchar_t/1.cc execution test
FAIL: 27_io/basic_stringbuf/sputn/wchar_t/1057.cc execution test
FAIL: 27_io/basic_stringbuf/sputn/wchar_t/9404-2.cc execution test
FAIL: 27_io/basic_stringbuf/str/char/1.cc execution test
FAIL: 27_io/basic_stringbuf/str/char/2.cc execution test
FAIL: 27_io/basic_stringbuf/str/char/3.cc execution test
FAIL: 27_io/basic_stringbuf/str/char/3955.cc execution test
FAIL: 27_io/basic_stringbuf/str/wchar_t/1.cc execution test
FAIL: 27_io/basic_stringbuf/str/wchar_t/2.cc execution test
FAIL: 27_io/basic_stringbuf/str/wchar_t/3.cc execution test
FAIL: 27_io/basic_stringbuf/str/wchar_t/3955.cc execution test
FAIL: 27_io/basic_stringbuf/sungetc/char/1.cc execution test
FAIL: 27_io/basic_stringbuf/sungetc/wchar_t/1.cc execution test
FAIL: 27_io/basic_stringbuf/sync/char/1057.cc execution test
FAIL: 27_io/basic_stringbuf/sync/wchar_t/1057.cc execution test
FAIL: 27_io/basic_stringstream/cons/2020.cc execution test
FAIL: 27_io/basic_stringstream/rdbuf/char/2832.cc execution test
FAIL: 27_io/basic_stringstream/rdbuf/wchar_t/2832.cc execution test
FAIL: 27_io/basic_stringstream/str/char/1.cc execution test
FAIL: 27_io/basic_stringstream/str/char/2.cc execution test
FAIL: 27_io/basic_stringstream/str/char/3.cc execution test
FAIL: 27_io/basic_stringstream/str/char/4.cc execution test
FAIL: 27_io/basic_stringstream/str/wchar_t/1.cc execution test
FAIL: 27_io/basic_stringstream/str/wchar_t/2.cc execution test
FAIL: 27_io/basic_stringstream/str/wchar_t/3.cc execution test
FAIL: 27_io/basic_stringstream/str/wchar_t/4.cc execution test
FAIL: 27_io/fpos/11450.cc execution test
FAIL: 27_io/fpos/14252.cc execution test
FAIL: 27_io/fpos/14320-1.cc execution test
FAIL: 27_io/fpos/14320-2.cc execution test
FAIL: 27_io/fpos/14320-3.cc execution test
FAIL: 27_io/fpos/14320-4.cc execution test
FAIL: 27_io/fpos/14320-5.cc execution test
FAIL: 27_io/fpos/14775.cc execution test
FAIL: 27_io/fpos/mbstate_t/1.cc execution test
FAIL: 27_io/fpos/mbstate_t/12065.cc execution test
FAIL: 27_io/fpos/mbstate_t/2.cc execution test
FAIL: 27_io/fpos/mbstate_t/3.cc execution test
FAIL: 27_io/ios_base/callbacks/1.cc execution test
FAIL: 27_io/ios_base/failure/cons_virtual_derivation.cc execution test
FAIL: 27_io/ios_base/failure/what-1.cc execution test
FAIL: 27_io/ios_base/failure/what-2.cc execution test
FAIL: 27_io/ios_base/failure/what-3.cc execution test
FAIL: 27_io/ios_base/failure/what-big.cc execution test
FAIL: 27_io/ios_base/state/1.cc execution test
FAIL: 27_io/ios_base/storage/1.cc execution test
FAIL: 27_io/ios_base/storage/11584.cc execution test
FAIL: 27_io/ios_base/storage/2.cc execution test
FAIL: 27_io/ios_base/storage/3.cc execution test
FAIL: 27_io/ios_base/sync_with_stdio/1.cc execution test
FAIL: 27_io/ios_base/sync_with_stdio/16959.cc execution test
FAIL: 27_io/ios_base/sync_with_stdio/2.cc execution test
FAIL: 27_io/ios_base/sync_with_stdio/9523.cc execution test
FAIL: 27_io/manipulators/adjustfield/char/1.cc execution test
FAIL: 27_io/manipulators/adjustfield/char/2.cc execution test
FAIL: 27_io/manipulators/adjustfield/wchar_t/1.cc execution test
FAIL: 27_io/manipulators/adjustfield/wchar_t/2.cc execution test
FAIL: 27_io/manipulators/basefield/char/1.cc execution test
FAIL: 27_io/manipulators/basefield/wchar_t/1.cc execution test
FAIL: 27_io/manipulators/standard/char/1.cc execution test
FAIL: 27_io/manipulators/standard/char/2.cc execution test
FAIL: 27_io/manipulators/standard/wchar_t/1.cc execution test
FAIL: 27_io/manipulators/standard/wchar_t/2.cc execution test
FAIL: 27_io/objects/char/1.cc execution test
FAIL: 27_io/objects/char/2.cc execution test
FAIL: 27_io/objects/char/3045.cc execution test
FAIL: 27_io/objects/char/3647.cc execution test
FAIL: 27_io/objects/char/41037.cc execution test
FAIL: 27_io/objects/char/5.cc execution test
FAIL: 27_io/objects/char/5268.cc execution test
FAIL: 27_io/objects/char/6.cc execution test
FAIL: 27_io/objects/char/7.cc execution test
FAIL: 27_io/objects/char/8.cc execution test
FAIL: 27_io/objects/char/9661-1.cc execution test
FAIL: 27_io/objects/char/dr455.cc execution test
FAIL: 27_io/objects/wchar_t/1.cc execution test
FAIL: 27_io/objects/wchar_t/12048-1.cc execution test
FAIL: 27_io/objects/wchar_t/12048-2.cc execution test
FAIL: 27_io/objects/wchar_t/12048-3.cc execution test
FAIL: 27_io/objects/wchar_t/12048-4.cc execution test
FAIL: 27_io/objects/wchar_t/2.cc execution test
FAIL: 27_io/objects/wchar_t/3045.cc execution test
FAIL: 27_io/objects/wchar_t/3647.cc execution test
FAIL: 27_io/objects/wchar_t/41037.cc execution test
FAIL: 27_io/objects/wchar_t/5.cc execution test
FAIL: 27_io/objects/wchar_t/5268.cc execution test
FAIL: 27_io/objects/wchar_t/6.cc execution test
FAIL: 27_io/objects/wchar_t/7.cc execution test
FAIL: 27_io/objects/wchar_t/8.cc execution test
FAIL: 27_io/objects/wchar_t/9661-1.cc execution test
FAIL: 27_io/objects/wchar_t/9662.cc execution test
FAIL: 27_io/objects/wchar_t/dr455.cc execution test
FAIL: 27_io/rvalue_streams.cc execution test
FAIL: 27_io/types/1.cc execution test
FAIL: 27_io/types/2.cc execution test
FAIL: 27_io/types/3.cc execution test
FAIL: 29_atomics/atomic/cons/copy_list.cc execution test
FAIL: 29_atomics/atomic/cons/default.cc execution test
FAIL: 29_atomics/atomic/cons/direct_list.cc execution test
FAIL: 29_atomics/atomic/cons/single_value.cc execution test
FAIL: 29_atomics/atomic/operators/integral_assignment.cc execution test
FAIL: 29_atomics/atomic/operators/integral_conversion.cc execution test
FAIL: 29_atomics/atomic_address/cons/default.cc execution test
FAIL: 29_atomics/atomic_address/cons/single_value.cc execution test
FAIL: 29_atomics/atomic_flag/clear/1.cc execution test
FAIL: 29_atomics/atomic_flag/cons/default.cc execution test
FAIL: 29_atomics/atomic_flag/test_and_set/explicit.cc execution test
FAIL: 29_atomics/atomic_flag/test_and_set/implicit.cc execution test
FAIL: 29_atomics/atomic_integral/cons/copy_list.cc execution test
FAIL: 29_atomics/atomic_integral/cons/default.cc execution test
FAIL: 29_atomics/atomic_integral/cons/direct_list.cc execution test
FAIL: 29_atomics/atomic_integral/cons/single_value.cc execution test
FAIL: 29_atomics/atomic_integral/operators/integral_assignment.cc execution test
FAIL: 29_atomics/atomic_integral/operators/integral_conversion.cc execution test
FAIL: abi/demangle/abi_examples/01.cc execution test
FAIL: abi/demangle/abi_examples/02.cc execution test
FAIL: abi/demangle/abi_examples/03.cc execution test
FAIL: abi/demangle/abi_examples/04.cc execution test
FAIL: abi/demangle/abi_examples/05.cc execution test
FAIL: abi/demangle/abi_examples/06.cc execution test
FAIL: abi/demangle/abi_examples/07.cc execution test
FAIL: abi/demangle/abi_examples/08.cc execution test
FAIL: abi/demangle/abi_examples/09.cc execution test
FAIL: abi/demangle/abi_examples/10.cc execution test
FAIL: abi/demangle/abi_examples/11.cc execution test
FAIL: abi/demangle/abi_examples/12.cc execution test
FAIL: abi/demangle/abi_examples/13.cc execution test
FAIL: abi/demangle/abi_examples/14.cc execution test
FAIL: abi/demangle/abi_examples/15.cc execution test
FAIL: abi/demangle/abi_examples/16.cc execution test
FAIL: abi/demangle/abi_examples/17.cc execution test
FAIL: abi/demangle/abi_examples/18.cc execution test
FAIL: abi/demangle/abi_examples/19.cc execution test
FAIL: abi/demangle/abi_examples/20.cc execution test
FAIL: abi/demangle/abi_examples/21.cc execution test
FAIL: abi/demangle/abi_examples/22.cc execution test
FAIL: abi/demangle/abi_examples/23.cc execution test
FAIL: abi/demangle/abi_examples/24.cc execution test
FAIL: abi/demangle/abi_examples/25.cc execution test
FAIL: abi/demangle/abi_examples/26.cc execution test
FAIL: abi/demangle/abi_text/01.cc execution test
FAIL: abi/demangle/abi_text/02.cc execution test
FAIL: abi/demangle/abi_text/03.cc execution test
FAIL: abi/demangle/abi_text/04.cc execution test
FAIL: abi/demangle/abi_text/05.cc execution test
FAIL: abi/demangle/abi_text/06.cc execution test
FAIL: abi/demangle/abi_text/07.cc execution test
FAIL: abi/demangle/abi_text/08.cc execution test
FAIL: abi/demangle/abi_text/09.cc execution test
FAIL: abi/demangle/abi_text/10.cc execution test
FAIL: abi/demangle/abi_text/11.cc execution test
FAIL: abi/demangle/abi_text/12.cc execution test
FAIL: abi/demangle/abi_text/13.cc execution test
FAIL: abi/demangle/abi_text/14.cc execution test
FAIL: abi/demangle/cxx0x/rref.cc execution test
FAIL: abi/demangle/regression/3111-1.cc execution test
FAIL: abi/demangle/regression/3111-2.cc execution test
FAIL: abi/demangle/regression/7986-01.cc execution test
FAIL: abi/demangle/regression/7986-02.cc execution test
FAIL: abi/demangle/regression/7986-03.cc execution test
FAIL: abi/demangle/regression/7986-04.cc execution test
FAIL: abi/demangle/regression/7986-05.cc execution test
FAIL: abi/demangle/regression/7986-06.cc execution test
FAIL: abi/demangle/regression/7986-07.cc execution test
FAIL: abi/demangle/regression/7986-08.cc execution test
FAIL: abi/demangle/regression/7986-09.cc execution test
FAIL: abi/demangle/regression/7986-10.cc execution test
FAIL: abi/demangle/regression/7986-11.cc execution test
FAIL: abi/demangle/regression/7986-12.cc execution test
FAIL: abi/demangle/regression/7986.cc execution test
FAIL: abi/demangle/regression/8897.cc execution test
FAIL: abi/demangle/regression/cw-01.cc execution test
FAIL: abi/demangle/regression/cw-02.cc execution test
FAIL: abi/demangle/regression/cw-03.cc execution test
FAIL: abi/demangle/regression/cw-04.cc execution test
FAIL: abi/demangle/regression/cw-05.cc execution test
FAIL: abi/demangle/regression/cw-06.cc execution test
FAIL: abi/demangle/regression/cw-07.cc execution test
FAIL: abi/demangle/regression/cw-08.cc execution test
FAIL: abi/demangle/regression/cw-09.cc execution test
FAIL: abi/demangle/regression/cw-10.cc execution test
FAIL: abi/demangle/regression/cw-11.cc execution test
FAIL: abi/demangle/regression/cw-12.cc execution test
FAIL: abi/demangle/regression/cw-13.cc execution test
FAIL: abi/demangle/regression/cw-14.cc execution test
FAIL: abi/demangle/regression/cw-15.cc execution test
FAIL: abi/demangle/regression/cw-16.cc execution test
FAIL: abi/demangle/regression/old.cc execution test
FAIL: abi/pr42230.cc execution test
FAIL: backward/11460.cc execution test
FAIL: backward/hash_map/1.cc execution test
FAIL: backward/hash_map/14648.cc execution test
FAIL: backward/hash_map/25896.cc execution test
FAIL: backward/hash_set/1.cc execution test
FAIL: backward/hash_set/25896.cc execution test
FAIL: backward/hash_set/check_construct_destroy.cc execution test
FAIL: backward/strstream_members.cc execution test
FAIL: ext/array_allocator/1.cc execution test
FAIL: ext/array_allocator/2.cc execution test
FAIL: ext/array_allocator/26875.cc execution test
FAIL: ext/array_allocator/3.cc execution test
FAIL: ext/array_allocator/check_allocate_max_size.cc execution test
FAIL: ext/array_allocator/check_deallocate_null.cc execution test
FAIL: ext/array_allocator/check_delete.cc execution test
FAIL: ext/array_allocator/check_new.cc execution test
FAIL: ext/array_allocator/variadic_construct.cc execution test
FAIL: ext/bitmap_allocator/check_allocate_max_size.cc execution test
FAIL: ext/bitmap_allocator/check_deallocate_null.cc execution test
FAIL: ext/bitmap_allocator/check_delete.cc execution test
FAIL: ext/bitmap_allocator/check_new.cc execution test
FAIL: ext/bitmap_allocator/variadic_construct.cc execution test
FAIL: ext/concept_checks.cc execution test
FAIL: ext/concurrence_lock_error/cons_virtual_derivation.cc execution test
FAIL: ext/concurrence_unlock_error/cons_virtual_derivation.cc execution test
FAIL: ext/debug_allocator/check_deallocate_null.cc execution test
FAIL: ext/debug_allocator/check_delete.cc execution test
FAIL: ext/debug_allocator/check_new.cc execution test
FAIL: ext/ext_pointer/1.cc execution test
FAIL: ext/forced_error/cons_virtual_derivation.cc execution test
FAIL: ext/is_heap/1.cc execution test
FAIL: ext/malloc_allocator/check_allocate_max_size.cc execution test
FAIL: ext/malloc_allocator/check_deallocate_null.cc execution test
FAIL: ext/malloc_allocator/check_delete.cc execution test
FAIL: ext/malloc_allocator/check_new.cc execution test
FAIL: ext/malloc_allocator/deallocate_global.cc execution test
FAIL: ext/malloc_allocator/deallocate_local.cc execution test
FAIL: ext/malloc_allocator/variadic_construct.cc execution test
FAIL: ext/median.cc execution test
FAIL: ext/mt_allocator/check_allocate_big_per_type.cc execution test
FAIL: ext/mt_allocator/check_allocate_max_size.cc execution test
FAIL: ext/mt_allocator/check_deallocate_null.cc execution test
FAIL: ext/mt_allocator/check_deallocate_null_thread.cc execution test
FAIL: ext/mt_allocator/check_delete.cc execution test
FAIL: ext/mt_allocator/check_new.cc execution test
FAIL: ext/mt_allocator/deallocate_global-2.cc execution test
FAIL: ext/mt_allocator/deallocate_global-4.cc execution test
FAIL: ext/mt_allocator/deallocate_global_thread-1.cc execution test
FAIL: ext/mt_allocator/deallocate_global_thread-3.cc execution test
FAIL: ext/mt_allocator/deallocate_local-2.cc execution test
FAIL: ext/mt_allocator/deallocate_local-4.cc execution test
FAIL: ext/mt_allocator/deallocate_local_thread-1.cc execution test
FAIL: ext/mt_allocator/deallocate_local_thread-3.cc execution test
FAIL: ext/mt_allocator/tune-1.cc execution test
FAIL: ext/mt_allocator/tune-2.cc execution test
FAIL: ext/mt_allocator/tune-3.cc execution test
FAIL: ext/mt_allocator/tune-4.cc execution test
FAIL: ext/mt_allocator/variadic_construct.cc execution test
FAIL: ext/new_allocator/check_allocate_max_size.cc execution test
FAIL: ext/new_allocator/check_deallocate_null.cc execution test
FAIL: ext/new_allocator/check_delete.cc execution test
FAIL: ext/new_allocator/check_new.cc execution test
FAIL: ext/new_allocator/deallocate_local.cc execution test
FAIL: ext/new_allocator/variadic_construct.cc execution test
FAIL: ext/pb_ds/example/assoc_container_traits.cc execution test
FAIL: ext/pb_ds/example/basic_map.cc execution test
FAIL: ext/pb_ds/example/basic_multimap.cc execution test
FAIL: ext/pb_ds/example/basic_multiset.cc execution test
FAIL: ext/pb_ds/example/basic_priority_queue.cc execution test
FAIL: ext/pb_ds/example/basic_set.cc execution test
FAIL: ext/pb_ds/example/erase_if.cc execution test
FAIL: ext/pb_ds/example/hash_illegal_resize.cc execution test
FAIL: ext/pb_ds/example/hash_initial_size.cc execution test
FAIL: ext/pb_ds/example/hash_load_set_change.cc execution test
FAIL: ext/pb_ds/example/hash_mod.cc execution test
FAIL: ext/pb_ds/example/hash_resize.cc execution test
FAIL: ext/pb_ds/example/hash_shift_mask.cc execution test
FAIL: ext/pb_ds/example/priority_queue_container_traits.cc execution test
FAIL: ext/pb_ds/example/priority_queue_dijkstra.cc execution test
FAIL: ext/pb_ds/example/priority_queue_erase_if.cc execution test
FAIL: ext/pb_ds/example/priority_queue_split_join.cc execution test
FAIL: ext/pb_ds/example/priority_queue_xref.cc execution test
FAIL: ext/pb_ds/example/ranged_hash.cc execution test
FAIL: ext/pb_ds/example/store_hash.cc execution test
FAIL: ext/pb_ds/example/tree_intervals.cc execution test
FAIL: ext/pb_ds/example/tree_join.cc execution test
FAIL: ext/pb_ds/example/tree_order_statistics.cc execution test
FAIL: ext/pb_ds/example/tree_order_statistics_join.cc execution test
FAIL: ext/pb_ds/example/trie_dna.cc execution test
FAIL: ext/pb_ds/example/trie_prefix_search.cc execution test
FAIL: ext/pb_ds/example/trie_split.cc execution test
FAIL: ext/pb_ds/regression/associative_containers.cc execution test
FAIL: ext/pb_ds/regression/hash_data_map_rand.cc execution test
FAIL: ext/pb_ds/regression/hash_no_data_map_rand.cc execution test
FAIL: ext/pb_ds/regression/list_update_data_map_rand.cc execution test
FAIL: ext/pb_ds/regression/list_update_no_data_map_rand.cc execution test
FAIL: ext/pb_ds/regression/priority_queue_rand.cc execution test
FAIL: ext/pb_ds/regression/priority_queues.cc execution test
FAIL: ext/pb_ds/regression/tree_data_map_rand.cc execution test
FAIL: ext/pb_ds/regression/tree_no_data_map_rand.cc execution test
FAIL: ext/pb_ds/regression/trie_data_map_rand.cc execution test
FAIL: ext/pb_ds/regression/trie_no_data_map_rand.cc execution test
FAIL: ext/pod_char_traits.cc execution test
FAIL: ext/pool_allocator/allocate_chunk.cc execution test
FAIL: ext/pool_allocator/check_allocate_max_size.cc execution test
FAIL: ext/pool_allocator/check_deallocate_null.cc execution test
FAIL: ext/pool_allocator/check_delete.cc execution test
FAIL: ext/pool_allocator/check_new.cc execution test
FAIL: ext/pool_allocator/variadic_construct.cc execution test
FAIL: ext/profile/all.cc (test for excess errors)
FAIL: ext/rope/1.cc execution test
FAIL: ext/rope/2.cc execution test
FAIL: ext/rope/3.cc execution test
FAIL: ext/rope/36832.cc execution test
FAIL: ext/rope/4.cc execution test
FAIL: ext/slist/check_construct_destroy.cc execution test
FAIL: ext/stdio_sync_filebuf/wchar_t/1.cc execution test
FAIL: ext/stdio_sync_filebuf/wchar_t/12948-1.cc execution test
FAIL: ext/stdio_sync_filebuf/wchar_t/12948-2.cc execution test
FAIL: ext/stdio_sync_filebuf/wchar_t/12948-3.cc execution test
FAIL: ext/stdio_sync_filebuf/wchar_t/12948-4.cc execution test
FAIL: ext/throw_allocator/check_allocate_max_size.cc execution test
FAIL: ext/throw_allocator/check_deallocate_null.cc execution test
FAIL: ext/throw_allocator/check_delete.cc execution test
FAIL: ext/throw_allocator/check_new.cc execution test
FAIL: ext/throw_allocator/deallocate_local.cc execution test
FAIL: ext/throw_allocator/variadic_construct.cc execution test
FAIL: ext/throw_value/cons.cc execution test
FAIL: ext/type_traits/add_unsigned.cc execution test
FAIL: ext/type_traits/remove_unsigned.cc execution test
FAIL: ext/vstring/capacity/29134.cc execution test
FAIL: ext/vstring/capacity/shrink_to_fit.cc execution test
FAIL: ext/vstring/inserters_extractors/char/28277.cc execution test
FAIL: ext/vstring/inserters_extractors/wchar_t/28277.cc execution test
FAIL: ext/vstring/requirements/exception/basic.cc execution test
FAIL: ext/vstring/requirements/exception/generation_prohibited.cc execution test
FAIL: ext/vstring/requirements/exception/propagation_consistent.cc execution test
FAIL: tr1/2_general_utilities/enable_shared_from_this/not_shared.cc execution test
FAIL: tr1/2_general_utilities/enable_shared_from_this/not_shared2.cc execution test
FAIL: tr1/2_general_utilities/enable_shared_from_this/not_shared3.cc execution test
FAIL: tr1/2_general_utilities/enable_shared_from_this/shared.cc execution test
FAIL: tr1/2_general_utilities/enable_shared_from_this/still_shared.cc execution test
FAIL: tr1/2_general_utilities/shared_ptr/assign/assign.cc execution test
FAIL: tr1/2_general_utilities/shared_ptr/assign/auto_ptr.cc execution test
FAIL: tr1/2_general_utilities/shared_ptr/assign/shared_ptr.cc execution test
FAIL: tr1/2_general_utilities/shared_ptr/comparison/cmp.cc execution test
FAIL: tr1/2_general_utilities/shared_ptr/cons/auto_ptr.cc execution test
FAIL: tr1/2_general_utilities/shared_ptr/cons/copy.cc execution test
FAIL: tr1/2_general_utilities/shared_ptr/cons/default.cc execution test
FAIL: tr1/2_general_utilities/shared_ptr/cons/pointer.cc execution test
FAIL: tr1/2_general_utilities/shared_ptr/cons/weak_ptr.cc execution test
FAIL: tr1/2_general_utilities/shared_ptr/dest/dest.cc execution test
FAIL: tr1/2_general_utilities/shared_ptr/misc/24595.cc execution test
FAIL: tr1/2_general_utilities/shared_ptr/misc/42019.cc execution test
FAIL: tr1/2_general_utilities/shared_ptr/misc/io.cc execution test
FAIL: tr1/2_general_utilities/shared_ptr/misc/swap.cc execution test
FAIL: tr1/2_general_utilities/shared_ptr/modifiers/reset.cc execution test
FAIL: tr1/2_general_utilities/shared_ptr/modifiers/swap.cc execution test
FAIL: tr1/2_general_utilities/shared_ptr/observers/bool_conv.cc execution test
FAIL: tr1/2_general_utilities/shared_ptr/observers/get.cc execution test
FAIL: tr1/2_general_utilities/shared_ptr/observers/unique.cc execution test
FAIL: tr1/2_general_utilities/shared_ptr/observers/use_count.cc execution test
FAIL: tr1/2_general_utilities/shared_ptr/thread/default_weaktoshared.cc execution test
FAIL: tr1/3_function_objects/bind/all_bound.cc execution test
FAIL: tr1/3_function_objects/bind/nested.cc execution test
FAIL: tr1/3_function_objects/bind/placeholders.cc execution test
FAIL: tr1/3_function_objects/bind/ref.cc execution test
FAIL: tr1/3_function_objects/function/1.cc execution test
FAIL: tr1/3_function_objects/function/2.cc execution test
FAIL: tr1/3_function_objects/function/3.cc execution test
FAIL: tr1/3_function_objects/function/4.cc execution test
FAIL: tr1/3_function_objects/function/5.cc execution test
FAIL: tr1/3_function_objects/function/6.cc execution test
FAIL: tr1/3_function_objects/function/7.cc execution test
FAIL: tr1/3_function_objects/function/8.cc execution test
FAIL: tr1/3_function_objects/function/9.cc execution test
FAIL: tr1/3_function_objects/mem_fn.cc execution test
FAIL: tr1/3_function_objects/reference_wrapper/invoke.cc execution test
FAIL: tr1/3_function_objects/reference_wrapper/typedefs.cc execution test
FAIL: tr1/3_function_objects/result_of.cc execution test
FAIL: tr1/4_metaprogramming/add_const/value.cc execution test
FAIL: tr1/4_metaprogramming/add_cv/value.cc execution test
FAIL: tr1/4_metaprogramming/add_pointer/value.cc execution test
FAIL: tr1/4_metaprogramming/add_reference/value.cc execution test
FAIL: tr1/4_metaprogramming/add_volatile/value.cc execution test
FAIL: tr1/4_metaprogramming/aligned_storage/value.cc execution test
FAIL: tr1/4_metaprogramming/alignment_of/value.cc execution test
FAIL: tr1/4_metaprogramming/extent/value.cc execution test
FAIL: tr1/4_metaprogramming/has_nothrow_assign/value.cc execution test
FAIL: tr1/4_metaprogramming/has_nothrow_constructor/value.cc execution test
FAIL: tr1/4_metaprogramming/has_nothrow_copy/value.cc execution test
FAIL: tr1/4_metaprogramming/has_trivial_assign/value.cc execution test
FAIL: tr1/4_metaprogramming/has_trivial_constructor/value.cc execution test
FAIL: tr1/4_metaprogramming/has_trivial_copy/value.cc execution test
FAIL: tr1/4_metaprogramming/has_trivial_destructor/value.cc execution test
FAIL: tr1/4_metaprogramming/has_virtual_destructor/value.cc execution test
FAIL: tr1/4_metaprogramming/integral_constant/static_definition.cc execution test
FAIL: tr1/4_metaprogramming/integral_constant/true_false_value.cc execution test
FAIL: tr1/4_metaprogramming/is_abstract/value.cc execution test
FAIL: tr1/4_metaprogramming/is_arithmetic/value.cc execution test
FAIL: tr1/4_metaprogramming/is_array/value.cc execution test
FAIL: tr1/4_metaprogramming/is_base_of/value.cc execution test
FAIL: tr1/4_metaprogramming/is_class/value.cc execution test
FAIL: tr1/4_metaprogramming/is_compound/value.cc execution test
FAIL: tr1/4_metaprogramming/is_const/value.cc execution test
FAIL: tr1/4_metaprogramming/is_convertible/value.cc execution test
FAIL: tr1/4_metaprogramming/is_empty/value.cc execution test
FAIL: tr1/4_metaprogramming/is_enum/24808.cc execution test
FAIL: tr1/4_metaprogramming/is_enum/value.cc execution test
FAIL: tr1/4_metaprogramming/is_floating_point/value.cc execution test
FAIL: tr1/4_metaprogramming/is_function/24808.cc execution test
FAIL: tr1/4_metaprogramming/is_function/value.cc execution test
FAIL: tr1/4_metaprogramming/is_fundamental/value.cc execution test
FAIL: tr1/4_metaprogramming/is_integral/value.cc execution test
FAIL: tr1/4_metaprogramming/is_member_function_pointer/value.cc execution test
FAIL: tr1/4_metaprogramming/is_member_object_pointer/value.cc execution test
FAIL: tr1/4_metaprogramming/is_member_pointer/value.cc execution test
FAIL: tr1/4_metaprogramming/is_object/24808.cc execution test
FAIL: tr1/4_metaprogramming/is_object/value.cc execution test
FAIL: tr1/4_metaprogramming/is_pod/value.cc execution test
FAIL: tr1/4_metaprogramming/is_pointer/value.cc execution test
FAIL: tr1/4_metaprogramming/is_polymorphic/value.cc execution test
FAIL: tr1/4_metaprogramming/is_reference/value.cc execution test
FAIL: tr1/4_metaprogramming/is_same/value.cc execution test
FAIL: tr1/4_metaprogramming/is_scalar/value.cc execution test
FAIL: tr1/4_metaprogramming/is_signed/value.cc execution test
FAIL: tr1/4_metaprogramming/is_union/value.cc execution test
FAIL: tr1/4_metaprogramming/is_unsigned/value.cc execution test
FAIL: tr1/4_metaprogramming/is_void/value.cc execution test
FAIL: tr1/4_metaprogramming/is_volatile/value.cc execution test
FAIL: tr1/4_metaprogramming/rank/value.cc execution test
FAIL: tr1/4_metaprogramming/remove_all_extents/value.cc execution test
FAIL: tr1/4_metaprogramming/remove_const/value.cc execution test
FAIL: tr1/4_metaprogramming/remove_cv/value.cc execution test
FAIL: tr1/4_metaprogramming/remove_extent/value.cc execution test
FAIL: tr1/4_metaprogramming/remove_pointer/value.cc execution test
FAIL: tr1/4_metaprogramming/remove_reference/value.cc execution test
FAIL: tr1/4_metaprogramming/remove_volatile/value.cc execution test
FAIL: tr1/5_numerical_facilities/random/discard_block/operators/equal.cc execution test
FAIL: tr1/5_numerical_facilities/random/discard_block/operators/not_equal.cc execution test
FAIL: tr1/5_numerical_facilities/random/discard_block/operators/serialize.cc execution test
FAIL: tr1/5_numerical_facilities/random/linear_congruential/cons/default.cc execution test
FAIL: tr1/5_numerical_facilities/random/linear_congruential/cons/gen1.cc execution test
FAIL: tr1/5_numerical_facilities/random/linear_congruential/cons/seed1.cc execution test
FAIL: tr1/5_numerical_facilities/random/linear_congruential/cons/seed2.cc execution test
FAIL: tr1/5_numerical_facilities/random/linear_congruential/operators/equal.cc execution test
FAIL: tr1/5_numerical_facilities/random/linear_congruential/operators/not_equal.cc execution test
FAIL: tr1/5_numerical_facilities/random/linear_congruential/operators/serialize.cc execution test
FAIL: tr1/5_numerical_facilities/random/mersenne_twister/cons/default.cc execution test
FAIL: tr1/5_numerical_facilities/random/mersenne_twister/cons/gen1.cc execution test
FAIL: tr1/5_numerical_facilities/random/mersenne_twister/cons/seed1.cc execution test
FAIL: tr1/5_numerical_facilities/random/mersenne_twister/cons/seed2.cc execution test
FAIL: tr1/5_numerical_facilities/random/mersenne_twister/operators/equal.cc execution test
FAIL: tr1/5_numerical_facilities/random/mersenne_twister/operators/not_equal.cc execution test
FAIL: tr1/5_numerical_facilities/random/mersenne_twister/operators/serialize.cc execution test
FAIL: tr1/5_numerical_facilities/random/minstd_rand.cc execution test
FAIL: tr1/5_numerical_facilities/random/minstd_rand0.cc execution test
FAIL: tr1/5_numerical_facilities/random/mt19937.cc execution test
FAIL: tr1/5_numerical_facilities/random/random_device/cons/default.cc execution test
FAIL: tr1/5_numerical_facilities/random/random_device/cons/token.cc execution test
FAIL: tr1/5_numerical_facilities/random/ranlux3.cc execution test
FAIL: tr1/5_numerical_facilities/random/ranlux3_01.cc execution test
FAIL: tr1/5_numerical_facilities/random/ranlux4.cc execution test
FAIL: tr1/5_numerical_facilities/random/ranlux4_01.cc execution test
FAIL: tr1/5_numerical_facilities/random/subtract_with_carry/cons/default.cc execution test
FAIL: tr1/5_numerical_facilities/random/subtract_with_carry/cons/gen1.cc execution test
FAIL: tr1/5_numerical_facilities/random/subtract_with_carry/cons/seed1.cc execution test
FAIL: tr1/5_numerical_facilities/random/subtract_with_carry/cons/seed2.cc execution test
FAIL: tr1/5_numerical_facilities/random/subtract_with_carry/operators/equal.cc execution test
FAIL: tr1/5_numerical_facilities/random/subtract_with_carry/operators/not_equal.cc execution test
FAIL: tr1/5_numerical_facilities/random/subtract_with_carry/operators/serialize.cc execution test
FAIL: tr1/5_numerical_facilities/random/subtract_with_carry_01/cons/default.cc execution test
FAIL: tr1/5_numerical_facilities/random/subtract_with_carry_01/cons/gen1.cc execution test
FAIL: tr1/5_numerical_facilities/random/subtract_with_carry_01/cons/seed1.cc execution test
FAIL: tr1/5_numerical_facilities/random/subtract_with_carry_01/cons/seed2.cc execution test
FAIL: tr1/5_numerical_facilities/random/subtract_with_carry_01/operators/equal.cc execution test
FAIL: tr1/5_numerical_facilities/random/subtract_with_carry_01/operators/not_equal.cc execution test
FAIL: tr1/5_numerical_facilities/random/subtract_with_carry_01/operators/serialize.cc execution test
FAIL: tr1/5_numerical_facilities/random/uniform_int/33128.cc execution test
FAIL: tr1/5_numerical_facilities/random/uniform_int/cons/default.cc execution test
FAIL: tr1/5_numerical_facilities/random/uniform_int/cons/range.cc execution test
FAIL: tr1/5_numerical_facilities/random/xor_combine/cons/default.cc execution test
FAIL: tr1/5_numerical_facilities/random/xor_combine/operators/equal.cc execution test
FAIL: tr1/5_numerical_facilities/random/xor_combine/operators/not_equal.cc execution test
FAIL: tr1/5_numerical_facilities/random/xor_combine/operators/serialize.cc execution test
FAIL: tr1/5_numerical_facilities/special_functions/01_assoc_laguerre/check_value.cc execution test
FAIL: tr1/5_numerical_facilities/special_functions/02_assoc_legendre/check_value.cc execution test
FAIL: tr1/5_numerical_facilities/special_functions/03_beta/check_value.cc execution test
FAIL: tr1/5_numerical_facilities/special_functions/04_comp_ellint_1/check_value.cc execution test
FAIL: tr1/5_numerical_facilities/special_functions/05_comp_ellint_2/check_value.cc execution test
FAIL: tr1/5_numerical_facilities/special_functions/06_comp_ellint_3/check_value.cc execution test
FAIL: tr1/5_numerical_facilities/special_functions/07_conf_hyperg/check_value.cc execution test
FAIL: tr1/5_numerical_facilities/special_functions/08_cyl_bessel_i/check_value.cc execution test
FAIL: tr1/5_numerical_facilities/special_functions/09_cyl_bessel_j/check_value.cc execution test
FAIL: tr1/5_numerical_facilities/special_functions/10_cyl_bessel_k/check_value.cc execution test
FAIL: tr1/5_numerical_facilities/special_functions/11_cyl_neumann/check_value.cc execution test
FAIL: tr1/5_numerical_facilities/special_functions/12_ellint_1/check_value.cc execution test
FAIL: tr1/5_numerical_facilities/special_functions/13_ellint_2/check_value.cc execution test
FAIL: tr1/5_numerical_facilities/special_functions/14_ellint_3/check_value.cc execution test
FAIL: tr1/5_numerical_facilities/special_functions/15_expint/check_value_neg.cc execution test
FAIL: tr1/5_numerical_facilities/special_functions/15_expint/check_value_pos.cc execution test
FAIL: tr1/5_numerical_facilities/special_functions/17_hyperg/check_value.cc execution test
FAIL: tr1/5_numerical_facilities/special_functions/18_laguerre/check_value.cc execution test
FAIL: tr1/5_numerical_facilities/special_functions/19_legendre/check_value.cc execution test
FAIL: tr1/5_numerical_facilities/special_functions/20_riemann_zeta/check_value_neg.cc execution test
FAIL: tr1/5_numerical_facilities/special_functions/20_riemann_zeta/check_value_pos.cc execution test
FAIL: tr1/5_numerical_facilities/special_functions/21_sph_bessel/check_value.cc execution test
FAIL: tr1/5_numerical_facilities/special_functions/22_sph_legendre/check_value.cc execution test
FAIL: tr1/5_numerical_facilities/special_functions/23_sph_neumann/check_value.cc execution test
FAIL: tr1/6_containers/array/capacity/empty.cc execution test
FAIL: tr1/6_containers/array/capacity/max_size.cc execution test
FAIL: tr1/6_containers/array/capacity/size.cc execution test
FAIL: tr1/6_containers/array/comparison_operators/equal.cc execution test
FAIL: tr1/6_containers/array/comparison_operators/greater.cc execution test
FAIL: tr1/6_containers/array/comparison_operators/greater_or_equal.cc execution test
FAIL: tr1/6_containers/array/comparison_operators/less.cc execution test
FAIL: tr1/6_containers/array/comparison_operators/less_or_equal.cc execution test
FAIL: tr1/6_containers/array/comparison_operators/not_equal.cc execution test
FAIL: tr1/6_containers/array/element_access/at_out_of_range.cc execution test
FAIL: tr1/6_containers/array/element_access/back.cc execution test
FAIL: tr1/6_containers/array/element_access/data.cc execution test
FAIL: tr1/6_containers/array/element_access/front.cc execution test
FAIL: tr1/6_containers/array/iterators/end_is_one_past.cc execution test
FAIL: tr1/6_containers/array/requirements/assign.cc execution test
FAIL: tr1/6_containers/array/requirements/contiguous.cc execution test
FAIL: tr1/6_containers/array/requirements/member_swap.cc execution test
FAIL: tr1/6_containers/array/requirements/zero_sized_arrays.cc execution test
FAIL: tr1/6_containers/array/specialized_algorithms/swap.cc execution test
FAIL: tr1/6_containers/array/tuple_interface/get.cc execution test
FAIL: tr1/6_containers/array/tuple_interface/tuple_element.cc execution test
FAIL: tr1/6_containers/array/tuple_interface/tuple_size.cc execution test
FAIL: tr1/6_containers/hash/24799.cc execution test
FAIL: tr1/6_containers/hash/operators/size_t.cc execution test
FAIL: tr1/6_containers/tuple/comparison_operators/comparisons.cc execution test
FAIL: tr1/6_containers/tuple/cons/assignment.cc execution test
FAIL: tr1/6_containers/tuple/cons/big_tuples.cc execution test
FAIL: tr1/6_containers/tuple/cons/constructor.cc execution test
FAIL: tr1/6_containers/tuple/creation_functions/23978.cc execution test
FAIL: tr1/6_containers/tuple/creation_functions/make_tuple.cc execution test
FAIL: tr1/6_containers/tuple/creation_functions/tie.cc execution test
FAIL: tr1/6_containers/tuple/creation_functions/tie2.cc execution test
FAIL: tr1/6_containers/tuple/element_access/get.cc execution test
FAIL: tr1/6_containers/tuple/tuple_element.cc execution test
FAIL: tr1/6_containers/tuple/tuple_size.cc execution test
FAIL: tr1/6_containers/unordered_map/24064.cc execution test
FAIL: tr1/6_containers/unordered_map/capacity/29134-map.cc execution test
FAIL: tr1/6_containers/unordered_map/erase/1.cc execution test
FAIL: tr1/6_containers/unordered_map/erase/24061-map.cc execution test
FAIL: tr1/6_containers/unordered_map/find/map1.cc execution test
FAIL: tr1/6_containers/unordered_map/insert/24061-map.cc execution test
FAIL: tr1/6_containers/unordered_map/insert/array_syntax.cc execution test
FAIL: tr1/6_containers/unordered_map/insert/map_range.cc execution test
FAIL: tr1/6_containers/unordered_map/insert/map_single.cc execution test
FAIL: tr1/6_containers/unordered_map/swap/1.cc execution test
FAIL: tr1/6_containers/unordered_map/swap/2.cc execution test
FAIL: tr1/6_containers/unordered_multimap/capacity/29134-multimap.cc execution test
FAIL: tr1/6_containers/unordered_multimap/erase/1.cc execution test
FAIL: tr1/6_containers/unordered_multimap/erase/24061-multimap.cc execution test
FAIL: tr1/6_containers/unordered_multimap/find/multimap1.cc execution test
FAIL: tr1/6_containers/unordered_multimap/insert/24061-multimap.cc execution test
FAIL: tr1/6_containers/unordered_multimap/insert/multimap_range.cc execution test
FAIL: tr1/6_containers/unordered_multimap/insert/multimap_single.cc execution test
FAIL: tr1/6_containers/unordered_multimap/swap/1.cc execution test
FAIL: tr1/6_containers/unordered_multimap/swap/2.cc execution test
FAIL: tr1/6_containers/unordered_multiset/24054.cc execution test
FAIL: tr1/6_containers/unordered_multiset/capacity/29134-multiset.cc execution test
FAIL: tr1/6_containers/unordered_multiset/erase/1.cc execution test
FAIL: tr1/6_containers/unordered_multiset/erase/24061-multiset.cc execution test
FAIL: tr1/6_containers/unordered_multiset/find/multiset1.cc execution test
FAIL: tr1/6_containers/unordered_multiset/insert/24061-multiset.cc execution test
FAIL: tr1/6_containers/unordered_multiset/insert/multiset_range.cc execution test
FAIL: tr1/6_containers/unordered_multiset/insert/multiset_single.cc execution test
FAIL: tr1/6_containers/unordered_multiset/swap/1.cc execution test
FAIL: tr1/6_containers/unordered_multiset/swap/2.cc execution test
FAIL: tr1/6_containers/unordered_set/23465.cc execution test
FAIL: tr1/6_containers/unordered_set/26132.cc execution test
FAIL: tr1/6_containers/unordered_set/capacity/29134-set.cc execution test
FAIL: tr1/6_containers/unordered_set/erase/1.cc execution test
FAIL: tr1/6_containers/unordered_set/erase/24061-set.cc execution test
FAIL: tr1/6_containers/unordered_set/find/set1.cc execution test
FAIL: tr1/6_containers/unordered_set/insert/24061-set.cc execution test
FAIL: tr1/6_containers/unordered_set/insert/set_range.cc execution test
FAIL: tr1/6_containers/unordered_set/insert/set_single.cc execution test
FAIL: tr1/6_containers/unordered_set/swap/1.cc execution test
FAIL: tr1/6_containers/unordered_set/swap/2.cc execution test
FAIL: tr1/6_containers/utility/19535.cc execution test
FAIL: tr1/6_containers/utility/pair.cc execution test
FAIL: tr1/7_regular_expressions/regex_traits/char/translate_nocase.cc execution test
FAIL: tr1/7_regular_expressions/regex_traits/char/value.cc execution test
FAIL: tr1/7_regular_expressions/regex_traits/wchar_t/translate_nocase.cc execution test
FAIL: tr1/7_regular_expressions/regex_traits/wchar_t/value.cc execution test
FAIL: tr1/8_c_compatibility/complex/overloads_int.cc execution test

		=== libstdc++ Summary ===

# of expected passes		3750
# of unexpected failures	2276
# of expected failures		85
# of unsupported tests		775
		=== g++ tests ===


Running target unix
FAIL: tmpdir-g++.dg-struct-layout-1/t024 cp_compat_x_tst.o-cp_compat_y_tst.o execute 
FAIL: tmpdir-g++.dg-struct-layout-1/t026 cp_compat_x_tst.o-cp_compat_y_tst.o execute 
FAIL: tmpdir-g++.dg-struct-layout-1/t027 cp_compat_x_tst.o-cp_compat_y_tst.o execute 
FAIL: tmpdir-g++.dg-struct-layout-1/t028 cp_compat_x_tst.o-cp_compat_y_tst.o execute 
FAIL: tmpdir-g++.dg-struct-layout-1/t029 cp_compat_x_tst.o-cp_compat_y_tst.o execute 
FAIL: tmpdir-g++.dg-struct-layout-1/t030 cp_compat_x_tst.o-cp_compat_y_tst.o execute 
FAIL: g++.dg/abi/local1.C execution test
FAIL: g++.dg/abi/rtti3.C scan-assembler .weak[ \\t]_?_ZTSPP1A
FAIL: g++.dg/abi/thunk4.C scan-assembler .weak[ \\t]_?_ZThn._N7Derived3FooEv
FAIL: g++.dg/cdce3.C (test for excess errors)
WARNING: g++.dg/cdce3.C compilation failed to produce executable
FAIL: g++.dg/cdce3.C scan-tree-dump cdce "cdce3.C:95: note: function call is shrink-wrapped into error conditions.": dump file does not exist
FAIL: g++.dg/cdce3.C scan-tree-dump cdce "cdce3.C:96: note: function call is shrink-wrapped into error conditions.": dump file does not exist
FAIL: g++.dg/cdce3.C scan-tree-dump cdce "cdce3.C:97: note: function call is shrink-wrapped into error conditions.": dump file does not exist
FAIL: g++.dg/cdce3.C scan-tree-dump cdce "cdce3.C:98: note: function call is shrink-wrapped into error conditions.": dump file does not exist
FAIL: g++.dg/cdce3.C scan-tree-dump cdce "cdce3.C:99: note: function call is shrink-wrapped into error conditions.": dump file does not exist
FAIL: g++.dg/cdce3.C scan-tree-dump cdce "cdce3.C:100: note: function call is shrink-wrapped into error conditions.": dump file does not exist
FAIL: g++.dg/cdce3.C scan-tree-dump cdce "cdce3.C:101: note: function call is shrink-wrapped into error conditions.": dump file does not exist
FAIL: g++.dg/cdce3.C scan-tree-dump cdce "cdce3.C:102: note: function call is shrink-wrapped into error conditions.": dump file does not exist
FAIL: g++.dg/cdce3.C scan-tree-dump cdce "cdce3.C:103: note: function call is shrink-wrapped into error conditions.": dump file does not exist
FAIL: g++.dg/cdce3.C scan-tree-dump cdce "cdce3.C:104: note: function call is shrink-wrapped into error conditions.": dump file does not exist
FAIL: g++.dg/cdce3.C scan-tree-dump cdce "cdce3.C:105: note: function call is shrink-wrapped into error conditions.": dump file does not exist
FAIL: g++.dg/cdce3.C scan-tree-dump cdce "cdce3.C:106: note: function call is shrink-wrapped into error conditions.": dump file does not exist
FAIL: g++.dg/cdce3.C scan-tree-dump cdce "cdce3.C:107: note: function call is shrink-wrapped into error conditions.": dump file does not exist
FAIL: g++.dg/cdce3.C scan-tree-dump cdce "cdce3.C:108: note: function call is shrink-wrapped into error conditions.": dump file does not exist
FAIL: g++.dg/ext/label13.C  (test for bogus messages, line 11)
WARNING: g++.dg/ext/label13.C compilation failed to produce executable
FAIL: g++.dg/other/anon5.C undefined (test for warnings, line )
FAIL: g++.dg/other/anon5.C (test for excess errors)
FAIL: g++.dg/other/unused1.C scan-assembler (string|ascii?)z?[\\t ]"printer("|\\\\\\\\0)
FAIL: g++.dg/warn/miss-format-1.C scanf attribute warning (test for warnings, line 26)
FAIL: g++.dg/warn/miss-format-1.C (test for excess errors)
FAIL: g++.dg/warn/pr31246.C (test for excess errors)
FAIL: g++.dg/warn/weak1.C (test for excess errors)
WARNING: g++.dg/warn/weak1.C compilation failed to produce executable
FAIL: g++.dg/tls/static-1.C execution test

		=== g++ Summary ===

# of expected passes		20297
# of unexpected failures	33
# of expected failures		151
# of unsupported tests		294
/home/htl10/tmp-build/gcc-4.5.0-build/gcc/testsuite/g++/../../g++  version 4.5.0 (GCC) 

		=== gcc tests ===


Running target unix
FAIL: gcc.c-torture/compile/limits-declparen.c  -O3 -g  (test for excess errors)
FAIL: gcc.c-torture/compile/limits-pointer.c  -O3 -g  (test for excess errors)
FAIL: gcc.c-torture/execute/pr23324.c compilation,  -O0 
UNRESOLVED: gcc.c-torture/execute/pr23324.c execution,  -O0 
FAIL: gcc.c-torture/execute/stdarg-1.c execution,  -O3 -fomit-frame-pointer 
FAIL: gcc.c-torture/execute/stdarg-1.c execution,  -O3 -g 
FAIL: tmpdir-gcc.dg-struct-layout-1/t001 c_compat_x_tst.o-c_compat_y_tst.o execute 
FAIL: tmpdir-gcc.dg-struct-layout-1/t002 c_compat_x_tst.o-c_compat_y_tst.o execute 
FAIL: tmpdir-gcc.dg-struct-layout-1/t003 c_compat_x_tst.o-c_compat_y_tst.o execute 
FAIL: tmpdir-gcc.dg-struct-layout-1/t004 c_compat_x_tst.o-c_compat_y_tst.o execute 
FAIL: tmpdir-gcc.dg-struct-layout-1/t005 c_compat_x_tst.o-c_compat_y_tst.o execute 
FAIL: tmpdir-gcc.dg-struct-layout-1/t006 c_compat_x_tst.o-c_compat_y_tst.o execute 
FAIL: tmpdir-gcc.dg-struct-layout-1/t007 c_compat_x_tst.o-c_compat_y_tst.o execute 
FAIL: tmpdir-gcc.dg-struct-layout-1/t008 c_compat_x_tst.o-c_compat_y_tst.o execute 
FAIL: tmpdir-gcc.dg-struct-layout-1/t009 c_compat_x_tst.o-c_compat_y_tst.o execute 
FAIL: tmpdir-gcc.dg-struct-layout-1/t010 c_compat_x_tst.o-c_compat_y_tst.o execute 
FAIL: tmpdir-gcc.dg-struct-layout-1/t011 c_compat_x_tst.o-c_compat_y_tst.o execute 
FAIL: tmpdir-gcc.dg-struct-layout-1/t012 c_compat_x_tst.o-c_compat_y_tst.o execute 
FAIL: tmpdir-gcc.dg-struct-layout-1/t013 c_compat_x_tst.o-c_compat_y_tst.o execute 
FAIL: tmpdir-gcc.dg-struct-layout-1/t014 c_compat_x_tst.o-c_compat_y_tst.o execute 
FAIL: tmpdir-gcc.dg-struct-layout-1/t015 c_compat_x_tst.o-c_compat_y_tst.o execute 
FAIL: tmpdir-gcc.dg-struct-layout-1/t017 c_compat_x_tst.o-c_compat_y_tst.o execute 
FAIL: tmpdir-gcc.dg-struct-layout-1/t018 c_compat_x_tst.o-c_compat_y_tst.o execute 
FAIL: tmpdir-gcc.dg-struct-layout-1/t024 c_compat_x_tst.o-c_compat_y_tst.o execute 
FAIL: tmpdir-gcc.dg-struct-layout-1/t025 c_compat_x_tst.o-c_compat_y_tst.o execute 
FAIL: tmpdir-gcc.dg-struct-layout-1/t026 c_compat_x_tst.o-c_compat_y_tst.o execute 
FAIL: tmpdir-gcc.dg-struct-layout-1/t027 c_compat_x_tst.o-c_compat_y_tst.o execute 
FAIL: tmpdir-gcc.dg-struct-layout-1/t028 c_compat_x_tst.o-c_compat_y_tst.o execute 
FAIL: gcc.dg/array-quals-1.c scan-assembler-not \\\\.data(?!\\\\.rel\\\\.ro)
FAIL: gcc.dg/attr-weakref-1.c (test for excess errors)
WARNING: gcc.dg/attr-weakref-1.c compilation failed to produce executable
FAIL: gcc.dg/c99-tgmath-1.c (test for excess errors)
FAIL: gcc.dg/c99-tgmath-2.c (test for excess errors)
ERROR: gcc.dg/c99-tgmath-2.c: error executing dg-final: couldn't open "c99-tgmath-2.s": no such file or directory
UNRESOLVED: gcc.dg/c99-tgmath-2.c: error executing dg-final: couldn't open "c99-tgmath-2.s": no such file or directory
FAIL: gcc.dg/c99-tgmath-3.c (test for excess errors)
ERROR: gcc.dg/c99-tgmath-3.c: error executing dg-final: couldn't open "c99-tgmath-3.s": no such file or directory
UNRESOLVED: gcc.dg/c99-tgmath-3.c: error executing dg-final: couldn't open "c99-tgmath-3.s": no such file or directory
FAIL: gcc.dg/c99-tgmath-4.c (test for excess errors)
ERROR: gcc.dg/c99-tgmath-4.c: error executing dg-final: couldn't open "c99-tgmath-4.s": no such file or directory
UNRESOLVED: gcc.dg/c99-tgmath-4.c: error executing dg-final: couldn't open "c99-tgmath-4.s": no such file or directory
FAIL: gcc.dg/intmax_t-1.c (test for excess errors)
FAIL: gcc.dg/pr17957.c (test for excess errors)
FAIL: gcc.dg/pr36224.c (test for excess errors)
FAIL: gcc.dg/ucnid-13.c  (test for warnings, line 6)
FAIL: gcc.dg/ucnid-13.c  (test for warnings, line 9)
FAIL: gcc.dg/ucnid-13.c  (test for warnings, line 11)
FAIL: gcc.dg/ucnid-13.c  (test for errors, line 13)
FAIL: gcc.dg/ucnid-13.c (test for excess errors)
FAIL: gcc.dg/ucnid-7.c  (test for errors, line 6)
FAIL: gcc.dg/ucnid-7.c (test for excess errors)
FAIL: gcc.dg/ucnid-8.c  (test for errors, line 6)
FAIL: gcc.dg/ucnid-8.c  (test for errors, line 7)
FAIL: gcc.dg/ucnid-8.c  (test for warnings, line 9)
FAIL: gcc.dg/ucnid-8.c  (test for errors, line 11)
FAIL: gcc.dg/ucnid-8.c UCN diag (test for warnings, line 13)
FAIL: gcc.dg/ucnid-8.c (test for excess errors)
WARNING: program timed out.
FAIL: largefile.c -O0 -g -I. (test for excess errors)
FAIL: gcc.dg/pch/largefile.c -O0 -g assembly comparison
WARNING: program timed out.
FAIL: largefile.c  -O0  -I. (test for excess errors)
FAIL: gcc.dg/pch/largefile.c  -O0  assembly comparison
WARNING: program timed out.
FAIL: largefile.c  -O1  -I. (test for excess errors)
FAIL: gcc.dg/pch/largefile.c  -O1  assembly comparison
WARNING: program timed out.
FAIL: largefile.c  -O2  -I. (test for excess errors)
FAIL: gcc.dg/pch/largefile.c  -O2  assembly comparison
WARNING: program timed out.
FAIL: largefile.c  -O3 -fomit-frame-pointer  -I. (test for excess errors)
FAIL: gcc.dg/pch/largefile.c  -O3 -fomit-frame-pointer  assembly comparison
WARNING: program timed out.
FAIL: largefile.c  -O3 -g  -I. (test for excess errors)
FAIL: gcc.dg/pch/largefile.c  -O3 -g  assembly comparison
WARNING: program timed out.
FAIL: largefile.c  -Os  -I. (test for excess errors)
FAIL: gcc.dg/pch/largefile.c  -Os  assembly comparison
FAIL: gcc.dg/tls/opt-11.c execution test
FAIL: gcc.dg/tls/opt-12.c execution test
FAIL: gcc.dg/tls/pr24428-2.c execution test

		=== gcc Summary ===

# of expected passes		52696
# of unexpected failures	66
# of expected failures		86
# of unresolved testcases	4
# of unsupported tests		762
/home/htl10/tmp-build/gcc-4.5.0-build/gcc/xgcc  version 4.5.0 (GCC) 

		=== gfortran tests ===


Running target unix
FAIL: gfortran.dg/large_real_kind_2.F90  -O0  execution test
FAIL: gfortran.dg/large_real_kind_2.F90  -O1  execution test
FAIL: gfortran.dg/large_real_kind_2.F90  -O2  execution test
FAIL: gfortran.dg/large_real_kind_2.F90  -O3 -fomit-frame-pointer  execution test
FAIL: gfortran.dg/large_real_kind_2.F90  -O3 -fomit-frame-pointer -funroll-loops  execution test
FAIL: gfortran.dg/large_real_kind_2.F90  -O3 -fomit-frame-pointer -funroll-all-loops -finline-functions  execution test
FAIL: gfortran.dg/large_real_kind_2.F90  -O3 -g  execution test
FAIL: gfortran.dg/large_real_kind_2.F90  -Os  execution test
FAIL: gfortran.dg/nint_2.f90  -O0  execution test

		=== gfortran Summary ===

# of expected passes		33782
# of unexpected failures	9
# of expected failures		21
# of unsupported tests		89
/home/htl10/tmp-build/gcc-4.5.0-build/gcc/testsuite/gfortran/../../gfortran  version 4.5.0 (GCC) 

		=== objc tests ===


Running target unix

		=== objc Summary ===

# of expected passes		1860
# of expected failures		15
# of unsupported tests		25
/home/htl10/tmp-build/gcc-4.5.0-build/gcc/xgcc  version 4.5.0 (GCC) 


Compiler version: 4.5.0 (GCC) 
Platform: alphaev68-dec-osf5.1a
configure flags: --enable-obsolete


Index Nav: [Date Index] [Subject Index] [Author Index] [Thread Index]
Message Nav: [Date Prev] [Date Next] [Thread Prev] [Thread Next]