This is the mail archive of the gcc-testresults@gcc.gnu.org mailing list for the GCC project.


Index Nav: [Date Index] [Subject Index] [Author Index] [Thread Index]
Message Nav: [Date Prev] [Date Next] [Thread Prev] [Thread Next]
Other format: [Raw text]

Gcc [trunk revision 171793] failed to bootstrap on x86_64!


cd bld; \
	 RUNTESTFLAGS="--target_board='unix{-m32,}'" ../src-trunk/configure \
		 --prefix=/usr/local --enable-clocale=gnu --with-system-zlib --enable-shared --with-demangler-in-ld --enable-cloog-backend=isl --with-ppl-include=/opt/gnu/include --with-ppl-lib=/opt/gnu/lib64 --with-cloog-include=/opt/gnu/include --with-cloog-lib=/opt/gnu/lib64 --with-fpmath=sse --enable-languages=c,c++,fortran,lto
checking build system type... x86_64-unknown-linux-gnu
checking host system type... x86_64-unknown-linux-gnu
checking target system type... x86_64-unknown-linux-gnu
checking for a BSD-compatible install... /usr/bin/install -c
	    grep "Error " makelog.171793.trunk.x86_64 >> makelog.171793.trunk.x86_64.mail; \
make[5]: *** [configure-stage1-target-libgomp] Error 1
make[4]: *** [stage1-bubble] Error 2
make[3]: *** [bootstrap] Error 2
make[2]: *** [bootstrap] Error 2
checking how to hardcode library paths into programs... immediate
checking whether stripping libraries is possible... yes
checking if libtool supports shared libraries... yes
checking whether to build shared libraries... yes
checking whether to build static libraries... yes
checking whether to enable maintainer-specific portions of Makefiles... no
checking for x86_64-unknown-linux-gnu-gfortran... no
checking whether we are using the GNU Fortran compiler... no
checking whether no accepts -g... no
checking for ANSI C header files... (cached) yes
checking whether time.h and sys/time.h may both be included... yes
checking whether string.h and strings.h may both be included... yes
checking for unistd.h... (cached) yes
checking semaphore.h usability... yes
checking semaphore.h presence... yes
checking for semaphore.h... yes
checking sys/loadavg.h usability... no
checking sys/loadavg.h presence... no
checking for sys/loadavg.h... no
checking sys/time.h usability... yes
checking sys/time.h presence... yes
checking for sys/time.h... yes
checking for sys/time.h... (cached) yes
looking for a compliant stdint.h in stdint.h, checking for uintmax_t... yes
checking for uintptr_t... yes
checking for int_least32_t... yes
checking for int_fast32_t... yes
checking for uint64_t... yes
checking what to include in gstdint.h... stdint.h (already complete)
checking for getloadavg... yes
checking for clock_gettime... no
checking for strtoull... yes
checking for clock_gettime in -lrt... yes
checking whether the target supports thread-local storage... rm: cannot remove `conftest': Permission denied
rm: cannot remove `conftest.c': Permission denied
no
checking whether the target supports hidden visibility... ../../../../src-trunk/libgomp/configure: line 15458: conftest.c: Permission denied
../../../../src-trunk/libgomp/configure: line 1532: conftest.err: Permission denied
rm: cannot remove `conftest.c': Permission denied
no
checking whether the target supports dllexport... ../../../../src-trunk/libgomp/configure: line 15493: conftest.c: Permission denied
../../../../src-trunk/libgomp/configure: line 1532: conftest.err: Permission denied
rm: cannot remove `conftest.c': Permission denied
no
checking whether the target supports symbol aliases... ../../../../src-trunk/libgomp/configure: line 15526: conftest.c: Permission denied
rm: cannot remove `conftest': Permission denied
../../../../src-trunk/libgomp/configure: line 1570: conftest.err: Permission denied
rm: cannot remove `conftest': Permission denied
rm: cannot remove `conftest.c': Permission denied
no
checking for ld used by /export/server/build-server/gcc-test-trunk/bld/./gcc/xgcc -B/export/server/build-server/gcc-test-trunk/bld/./gcc/ -B/usr/local/x86_64-unknown-linux-gnu/bin/ -B/usr/local/x86_64-unknown-linux-gnu/lib/ -isystem /usr/local/x86_64-unknown-linux-gnu/include -isystem /usr/local/x86_64-unknown-linux-gnu/sys-include  -m32... (cached) /export/server/build-server/gcc-test-trunk/bld/./gcc/collect-ld
checking if the linker (/export/server/build-server/gcc-test-trunk/bld/./gcc/collect-ld) is GNU ld... (cached) yes
checking for shared libgcc... ../../../../src-trunk/libgomp/configure: line 15829: conftest.c: Permission denied
rm: cannot remove `conftest': Permission denied
../../../../src-trunk/libgomp/configure: line 1570: conftest.err: Permission denied
rm: cannot remove `conftest': Permission denied
rm: cannot remove `conftest.c': Permission denied
../../../../src-trunk/libgomp/configure: line 15849: conftest.c: Permission denied
rm: cannot remove `conftest.c': Permission denied
../../../../src-trunk/libgomp/configure: line 15859: conftest.c: Permission denied
rm: cannot remove `conftest': Permission denied
../../../../src-trunk/libgomp/configure: line 1570: conftest.err: Permission denied
rm: cannot remove `conftest': Permission denied
rm: cannot remove `conftest.c': Permission denied
no
checking whether the target supports .symver directive... ../../../../src-trunk/libgomp/configure: line 15939: conftest.c: Permission denied
../../../../src-trunk/libgomp/configure: line 1532: conftest.err: Permission denied
rm: cannot remove `conftest.c': Permission denied
no
configure: versioning on shared library symbols is gnu
../../../../src-trunk/libgomp/configure: line 16001: confdefs.h: Permission denied
../../../../src-trunk/libgomp/configure: line 16020: confdefs.h: Permission denied
checking whether the target supports __sync_*_compare_and_swap... ../../../../src-trunk/libgomp/configure: line 16037: conftest.c: Permission denied
rm: cannot remove `conftest': Permission denied
../../../../src-trunk/libgomp/configure: line 1570: conftest.err: Permission denied
rm: cannot remove `conftest': Permission denied
rm: cannot remove `conftest.c': Permission denied
no
../../../../src-trunk/libgomp/configure: line 16072: confcache: Permission denied
../../../../src-trunk/libgomp/configure: line 16133: confcache: Permission denied
configure: not updating unwritable cache ./config.cache
../../../../src-trunk/libgomp/configure: line 2141: conftest.c: Permission denied
rm: cannot remove `conftest': Permission denied
rm: cannot remove `conftest.c': Permission denied
configure: error: unsupported system, cannot find sizeof (omp_lock_t)
rm: cannot remove `conftest': Permission denied
rm: cannot remove `conftest.c': Permission denied
rm: cannot remove `confdefs.h': Permission denied
/export/server/build-server/gcc-test-trunk/src-trunk/libgomp/configure: line 19311: config.log: Permission denied
rm: cannot remove `confdefs.h': Permission denied
make[5]: *** [configure-stage1-target-libgomp] Error 1
make[5]: Leaving directory `/export/server/build-server/gcc-test-trunk/bld'
make[4]: *** [stage1-bubble] Error 2
make[4]: Leaving directory `/export/server/build-server/gcc-test-trunk/bld'
make[3]: *** [bootstrap] Error 2
make[3]: Leaving directory `/export/server/build-server/gcc-test-trunk/bld'
1055.80user 75.00system 3:24.93elapsed 551%CPU (0avgtext+0avgdata 1475216maxresident)k
58272inputs+19819824outputs (1327major+27642634minor)pagefaults 0swaps
make[2]: *** [bootstrap] Error 2
make[2]: Leaving directory `/export/server/build-server/gcc-test-trunk'


Index Nav: [Date Index] [Subject Index] [Author Index] [Thread Index]
Message Nav: [Date Prev] [Date Next] [Thread Prev] [Thread Next]