This is the mail archive of the gcc-testresults@gcc.gnu.org mailing list for the GCC project.


Index Nav: [Date Index] [Subject Index] [Author Index] [Thread Index]
Message Nav: [Date Prev] [Date Next] [Thread Prev] [Thread Next]
Other format: [Raw text]

Results for 4.5.2 (GCC) testsuite on alpha-dec-osf4.0f


LAST_UPDATED: Obtained from SVN: tags/gcc_4_5_2_release revision 167946

Native configuration is alpha-dec-osf4.0f

		=== libffi tests ===


Running target unix
FAIL: libffi.call/huge_struct.c -O0 -W -Wall output pattern test, is hu hd 1 2 3 4 5 6 0 0 9 0x4024000000000000 hu hd 0 22136 1 2 3 4 0 0 0 0x8 hu hd 0 0 0 305419896 1 2 0 0 0 0x6 hu hd 7 8 0 0 4622382067542392832 305419896 0 0 0 0x4 hu hd: hu hd 5 6 7 8 4621256167635550208 4621819117588971520 11 0 0 0x2 hu hd 2 3 4 5 6 7 0 0 10 0x4026000000000000 hu hd 0 22137 3 4 5 6 0 0 0 0xa hu hd 0 0 0 305419898 4 5 0 0 0 0x9 hu hd
FAIL: libffi.call/huge_struct.c -O2 output pattern test, is hu hd 1 2 3 4 5 6 0 0 9 0x4024000000000000 hu hd 0 22136 1 2 3 4 0 0 0 0x8 hu hd 0 0 0 305419896 1 2 0 0 0 0x6 hu hd 7 8 0 0 4622382067542392832 305419896 0 0 0 0x4 hu hd: hu hd 5 6 7 8 4621256167635550208 4621819117588971520 11 0 0 0x2 hu hd 2 3 4 5 6 7 0 0 10 0x4026000000000000 hu hd 0 22137 3 4 5 6 0 0 0 0xa hu hd 0 0 0 305419898 4 5 0 0 0 0x9 hu hd
FAIL: libffi.call/huge_struct.c -O3 output pattern test, is hu hd 1 2 3 4 5 6 0 0 9 0x4024000000000000 hu hd 0 22136 1 2 3 4 0 0 0 0x8 hu hd 0 0 0 305419896 1 2 0 0 0 0x6 hu hd 7 8 0 0 4622382067542392832 305419896 0 0 0 0x4 hu hd: hu hd 5 6 7 8 4621256167635550208 4621819117588971520 11 0 0 0x2 hu hd 2 3 4 5 6 7 0 0 10 0x4026000000000000 hu hd 0 22137 3 4 5 6 0 0 0 0xa hu hd 0 0 0 305419898 4 5 0 0 0 0x9 hu hd
FAIL: libffi.call/huge_struct.c -Os output pattern test, is hu hd 1 2 3 4 5 6 0 0 9 0x4024000000000000 hu hd 0 22136 1 2 3 4 0 0 0 0x8 hu hd 0 0 0 305419896 1 2 0 0 0 0x6 hu hd 7 8 0 0 4622382067542392832 305419896 0 0 0 0x4 hu hd: hu hd 5 6 7 8 4621256167635550208 4621819117588971520 11 0 0 0x2 hu hd 2 3 4 5 6 7 0 0 10 0x4026000000000000 hu hd 0 22137 3 4 5 6 0 0 0 0xa hu hd 0 0 0 305419898 4 5 0 0 0 0x9 hu hd
FAIL: libffi.call/huge_struct.c -O2 -fomit-frame-pointer output pattern test, is hu hd 1 2 3 4 5 6 0 0 9 0x4024000000000000 hu hd 0 22136 1 2 3 4 0 0 0 0x8 hu hd 0 0 0 305419896 1 2 0 0 0 0x6 hu hd 7 8 0 0 4622382067542392832 305419896 0 0 0 0x4 hu hd: hu hd 5 6 7 8 4621256167635550208 4621819117588971520 11 0 0 0x2 hu hd 2 3 4 5 6 7 0 0 10 0x4026000000000000 hu hd 0 22137 3 4 5 6 0 0 0 0xa hu hd 0 0 0 305419898 4 5 0 0 0 0x9 hu hd
FAIL: libffi.special/unwindtest.cc  -shared-libgcc -lstdc++ execution test
FAIL: libffi.special/unwindtest_ffi_call.cc  -shared-libgcc -lstdc++ execution test
FAIL: libffi.special/unwindtest.cc  -shared-libgcc -lstdc++ execution test
FAIL: libffi.special/unwindtest_ffi_call.cc  -shared-libgcc -lstdc++ execution test
FAIL: libffi.special/unwindtest.cc  -shared-libgcc -lstdc++ execution test
FAIL: libffi.special/unwindtest_ffi_call.cc  -shared-libgcc -lstdc++ execution test
FAIL: libffi.special/unwindtest.cc  -shared-libgcc -lstdc++ execution test
FAIL: libffi.special/unwindtest_ffi_call.cc  -shared-libgcc -lstdc++ execution test

		=== libffi Summary ===

# of expected passes		1613
# of unexpected failures	13
# of expected failures		10
# of unsupported tests		15
		=== libgomp tests ===


Running target unix
FAIL: libgomp.fortran/pr29629.f90  -O0  execution test
FAIL: libgomp.fortran/pr29629.f90  -O1  execution test
FAIL: libgomp.fortran/pr29629.f90  -O2  execution test
FAIL: libgomp.fortran/pr29629.f90  -O3 -fomit-frame-pointer  execution test
FAIL: libgomp.fortran/pr29629.f90  -O3 -fomit-frame-pointer -funroll-loops  execution test
FAIL: libgomp.fortran/pr29629.f90  -O3 -fomit-frame-pointer -funroll-all-loops -finline-functions  execution test
FAIL: libgomp.fortran/pr29629.f90  -O3 -g  execution test
FAIL: libgomp.fortran/pr29629.f90  -Os  execution test
FAIL: libgomp.fortran/stack.f90  -O0  execution test

		=== libgomp Summary ===

# of expected passes		2497
# of unexpected failures	9
# of unsupported tests		2
		=== libjava tests ===


Running target unix
FAIL: noclass execution - gij test
FAIL: pr11951 run
FAIL: throwit execution - gij test
FAIL: PR16923 run
FAIL: pr29812 execution - gij test
FAIL: natgetstacktrace.cc compilation
FAIL: events output
FAIL: ExtraClassLoader execution - source compiled test
FAIL: ExtraClassLoader -findirect-dispatch execution - source compiled test
FAIL: ExtraClassLoader -O3 execution - source compiled test
FAIL: ExtraClassLoader -O3 -findirect-dispatch execution - source compiled test
FAIL: G19990302_02 -O3 execution - source compiled test
FAIL: G19990303_01 -O3 execution - source compiled test
FAIL: G19990303_02 -O3 execution - source compiled test
FAIL: G19990304_01 -O3 execution - source compiled test
WARNING: program timed out.
FAIL: Process_6 -O3 execution - source compiled test
FAIL: Throw_2 execution - source compiled test
FAIL: Throw_2 -findirect-dispatch execution - source compiled test
FAIL: Throw_2 -O3 execution - source compiled test
FAIL: Throw_2 -O3 -findirect-dispatch execution - source compiled test
FAIL: initexc -O3 execution - source compiled test
FAIL: invokethrow execution - source compiled test
FAIL: invokethrow -findirect-dispatch execution - source compiled test
FAIL: invokethrow -O3 execution - source compiled test
FAIL: invokethrow -O3 -findirect-dispatch execution - source compiled test

		=== libjava Summary ===

# of expected passes		2525
# of unexpected failures	25
# of untested testcases		23
		=== libstdc++ tests ===


Running target unix
FAIL: 21_strings/basic_string/requirements/exception/basic.cc execution test
FAIL: 23_containers/deque/requirements/exception/basic.cc execution test
FAIL: 23_containers/forward_list/requirements/exception/basic.cc execution test
FAIL: 23_containers/forward_list/requirements/exception/propagation_consistent.cc execution test
FAIL: 23_containers/list/requirements/exception/basic.cc execution test
FAIL: 23_containers/list/requirements/exception/propagation_consistent.cc execution test
FAIL: 23_containers/map/requirements/exception/basic.cc execution test
FAIL: 23_containers/map/requirements/exception/propagation_consistent.cc execution test
FAIL: 23_containers/multimap/requirements/exception/basic.cc execution test
FAIL: 23_containers/multimap/requirements/exception/propagation_consistent.cc execution test
FAIL: 23_containers/multiset/requirements/exception/basic.cc execution test
FAIL: 23_containers/multiset/requirements/exception/propagation_consistent.cc execution test
FAIL: 23_containers/set/requirements/exception/basic.cc execution test
FAIL: 23_containers/set/requirements/exception/propagation_consistent.cc execution test
FAIL: 23_containers/unordered_map/requirements/exception/basic.cc execution test
FAIL: 23_containers/unordered_map/requirements/exception/propagation_consistent.cc execution test
FAIL: 23_containers/unordered_multimap/requirements/exception/basic.cc execution test
FAIL: 23_containers/unordered_multimap/requirements/exception/propagation_consistent.cc execution test
FAIL: 23_containers/unordered_multiset/requirements/exception/basic.cc execution test
FAIL: 23_containers/unordered_multiset/requirements/exception/propagation_consistent.cc execution test
FAIL: 23_containers/unordered_set/requirements/exception/basic.cc execution test
FAIL: 23_containers/unordered_set/requirements/exception/propagation_consistent.cc execution test
FAIL: 23_containers/vector/requirements/exception/basic.cc execution test
FAIL: 23_containers/vector/requirements/exception/propagation_consistent.cc execution test
FAIL: ext/pb_ds/example/hash_illegal_resize.cc execution test
FAIL: ext/pb_ds/regression/hash_data_map_rand.cc execution test
FAIL: ext/pb_ds/regression/hash_no_data_map_rand.cc execution test
FAIL: ext/pb_ds/regression/priority_queue_rand.cc execution test
FAIL: ext/pb_ds/regression/tree_data_map_rand.cc execution test
FAIL: ext/pb_ds/regression/tree_no_data_map_rand.cc execution test
FAIL: ext/profile/all.cc (test for excess errors)
FAIL: ext/throw_allocator/check_deallocate_null.cc execution test
WARNING: program timed out.
WARNING: program timed out.
WARNING: program timed out.
WARNING: program timed out.
WARNING: program timed out.
WARNING: program timed out.
WARNING: program timed out.
WARNING: program timed out.
WARNING: program timed out.
WARNING: program timed out.
WARNING: program timed out.
WARNING: program timed out.
WARNING: program timed out.
WARNING: program timed out.
WARNING: program timed out.
WARNING: program timed out.
WARNING: program timed out.
WARNING: program timed out.
WARNING: program timed out.
WARNING: program timed out.
WARNING: program timed out.
WARNING: program timed out.
WARNING: program timed out.

		=== libstdc++ Summary ===

# of expected passes		6289
# of unexpected failures	32
# of expected failures		86
# of unsupported tests		632

		=== libstdc++ Summary ===

		=== acats tests ===
FAIL:	c250002
FAIL:	c43215a
FAIL:	c43215b
FAIL:	c760010
FAIL:	c94002g
FAIL:	c94011a
FAIL:	ca11d01
FAIL:	ca11d02
FAIL:	cb1010a
FAIL:	cb1010c
FAIL:	cb1010d
FAIL:	cb3003a
FAIL:	cb4006a
FAIL:	cb4009a
FAIL:	cb41001
FAIL:	cb41002
FAIL:	ce3115a
FAIL:	cxa5a03
FAIL:	cxg2017
FAIL:	cxg2020

		=== acats Summary ===
# of expected passes		2301
# of unexpected failures	20

		=== g++ tests ===


Running target unix
WARNING: Could not compile g++.dg/compat/struct-layout-1 generator
FAIL: g++.dg/abi/local1.C execution test
FAIL: g++.dg/cdce3.C (test for excess errors)
WARNING: g++.dg/cdce3.C compilation failed to produce executable
FAIL: g++.dg/cdce3.C scan-tree-dump cdce "cdce3.C:96: note: function call is shrink-wrapped into error conditions.": dump file does not exist
FAIL: g++.dg/cdce3.C scan-tree-dump cdce "cdce3.C:97: note: function call is shrink-wrapped into error conditions.": dump file does not exist
FAIL: g++.dg/cdce3.C scan-tree-dump cdce "cdce3.C:98: note: function call is shrink-wrapped into error conditions.": dump file does not exist
FAIL: g++.dg/cdce3.C scan-tree-dump cdce "cdce3.C:99: note: function call is shrink-wrapped into error conditions.": dump file does not exist
FAIL: g++.dg/cdce3.C scan-tree-dump cdce "cdce3.C:100: note: function call is shrink-wrapped into error conditions.": dump file does not exist
FAIL: g++.dg/cdce3.C scan-tree-dump cdce "cdce3.C:101: note: function call is shrink-wrapped into error conditions.": dump file does not exist
FAIL: g++.dg/cdce3.C scan-tree-dump cdce "cdce3.C:102: note: function call is shrink-wrapped into error conditions.": dump file does not exist
FAIL: g++.dg/cdce3.C scan-tree-dump cdce "cdce3.C:103: note: function call is shrink-wrapped into error conditions.": dump file does not exist
FAIL: g++.dg/cdce3.C scan-tree-dump cdce "cdce3.C:104: note: function call is shrink-wrapped into error conditions.": dump file does not exist
FAIL: g++.dg/cdce3.C scan-tree-dump cdce "cdce3.C:105: note: function call is shrink-wrapped into error conditions.": dump file does not exist
FAIL: g++.dg/cdce3.C scan-tree-dump cdce "cdce3.C:106: note: function call is shrink-wrapped into error conditions.": dump file does not exist
FAIL: g++.dg/cdce3.C scan-tree-dump cdce "cdce3.C:107: note: function call is shrink-wrapped into error conditions.": dump file does not exist
FAIL: g++.dg/cdce3.C scan-tree-dump cdce "cdce3.C:108: note: function call is shrink-wrapped into error conditions.": dump file does not exist
FAIL: g++.dg/cdce3.C scan-tree-dump cdce "cdce3.C:109: note: function call is shrink-wrapped into error conditions.": dump file does not exist
WARNING: g++.dg/ext/label13.C compilation failed to produce executable
FAIL: g++.dg/other/unused1.C scan-assembler (string|ascii?)z?[\\t ]"printer("|\\\\\\\\0)

		=== g++ Summary ===

# of expected passes		20425
# of unexpected failures	17
# of expected failures		154
# of unsupported tests		307
/var/gcc/gcc-4.5.2/gcc/testsuite/g++/../../g++  version 4.5.2 (GCC) 

		=== gcc tests ===


Running target unix
FAIL: gcc.c-torture/compile/labels-3.c  -O0  (test for excess errors)
FAIL: gcc.c-torture/compile/labels-3.c  -O1  (test for excess errors)
FAIL: gcc.c-torture/compile/labels-3.c  -O2  (test for excess errors)
FAIL: gcc.c-torture/compile/labels-3.c  -O3 -fomit-frame-pointer  (test for excess errors)
FAIL: gcc.c-torture/compile/labels-3.c  -O3 -g  (test for excess errors)
FAIL: gcc.c-torture/compile/labels-3.c  -Os  (test for excess errors)
FAIL: gcc.c-torture/compile/limits-declparen.c  -O3 -g  (test for excess errors)
FAIL: gcc.c-torture/compile/limits-pointer.c  -O3 -g  (test for excess errors)
WARNING: program timed out.
FAIL: gcc.c-torture/compile/limits-structnest.c  -O2  (test for excess errors)
WARNING: program timed out.
FAIL: gcc.c-torture/compile/limits-structnest.c  -O3 -fomit-frame-pointer  (test for excess errors)
WARNING: Could not compile gcc.dg/compat/struct-layout-1 generator
FAIL: gcc.dg/array-quals-1.c scan-assembler-not \\\\.data(?!\\\\.rel\\\\.ro)
FAIL: gcc.dg/builtins-20.c (test for excess errors)
FAIL: gcc.dg/builtins-55.c (test for excess errors)
FAIL: gcc.dg/builtins-57.c (test for excess errors)
FAIL: gcc.dg/builtins-58.c scan-assembler-not pow
FAIL: gcc.dg/builtins-59.c scan-tree-dump gimple "__builtin_cexpi"
FAIL: gcc.dg/builtins-59.c scan-tree-dump-not gimple "sincos"
FAIL: gcc.dg/builtins-61.c scan-tree-dump optimized "cexpi"
FAIL: gcc.dg/builtins-61.c scan-tree-dump optimized "sin"
FAIL: gcc.dg/builtins-61.c scan-tree-dump optimized "cos"
FAIL: gcc.dg/builtins-61.c scan-tree-dump optimized "return 0.0"
FAIL: gcc.dg/builtins-62.c scan-tree-dump-times optimized "cexpi" 3
FAIL: gcc.dg/builtins-65.c (test for excess errors)
FAIL: gcc.dg/c99-tgmath-1.c (test for excess errors)
FAIL: gcc.dg/c99-tgmath-2.c (test for excess errors)
ERROR: gcc.dg/c99-tgmath-2.c: error executing dg-final: couldn't open "c99-tgmath-2.s": no such file or directory
UNRESOLVED: gcc.dg/c99-tgmath-2.c: error executing dg-final: couldn't open "c99-tgmath-2.s": no such file or directory
FAIL: gcc.dg/c99-tgmath-3.c (test for excess errors)
ERROR: gcc.dg/c99-tgmath-3.c: error executing dg-final: couldn't open "c99-tgmath-3.s": no such file or directory
UNRESOLVED: gcc.dg/c99-tgmath-3.c: error executing dg-final: couldn't open "c99-tgmath-3.s": no such file or directory
FAIL: gcc.dg/c99-tgmath-4.c (test for excess errors)
ERROR: gcc.dg/c99-tgmath-4.c: error executing dg-final: couldn't open "c99-tgmath-4.s": no such file or directory
UNRESOLVED: gcc.dg/c99-tgmath-4.c: error executing dg-final: couldn't open "c99-tgmath-4.s": no such file or directory
FAIL: gcc.dg/pr17957.c (test for excess errors)
FAIL: gcc.dg/pr36224.c (test for excess errors)
FAIL: gcc.dg/pthread-init-1.c (test for excess errors)
FAIL: gcc.dg/pthread-init-2.c (test for excess errors)
WARNING: program timed out.
FAIL: largefile.c  -O0 -g -I. (test for excess errors)
FAIL: gcc.dg/pch/largefile.c -O0 -g assembly comparison
WARNING: program timed out.
FAIL: largefile.c   -O0  -I. (test for excess errors)
FAIL: gcc.dg/pch/largefile.c  -O0  assembly comparison
WARNING: program timed out.
FAIL: largefile.c   -O1  -I. (test for excess errors)
FAIL: gcc.dg/pch/largefile.c  -O1  assembly comparison
WARNING: program timed out.
FAIL: largefile.c   -O2  -I. (test for excess errors)
FAIL: gcc.dg/pch/largefile.c  -O2  assembly comparison
WARNING: program timed out.
FAIL: largefile.c   -O3 -fomit-frame-pointer  -I. (test for excess errors)
FAIL: gcc.dg/pch/largefile.c  -O3 -fomit-frame-pointer  assembly comparison
WARNING: program timed out.
FAIL: largefile.c   -O3 -g  -I. (test for excess errors)
FAIL: gcc.dg/pch/largefile.c  -O3 -g  assembly comparison
WARNING: program timed out.
FAIL: largefile.c   -Os  -I. (test for excess errors)
FAIL: gcc.dg/pch/largefile.c  -Os  assembly comparison
FAIL: gcc.dg/torture/builtin-convert-1.c  -O1  (test for excess errors)
FAIL: gcc.dg/torture/builtin-convert-1.c  -O2  (test for excess errors)
FAIL: gcc.dg/torture/builtin-convert-1.c  -O3 -fomit-frame-pointer  (test for excess errors)
FAIL: gcc.dg/torture/builtin-convert-1.c  -O3 -g  (test for excess errors)
FAIL: gcc.dg/torture/builtin-convert-1.c  -Os  (test for excess errors)
FAIL: gcc.dg/torture/builtin-convert-2.c  -O1  (test for excess errors)
FAIL: gcc.dg/torture/builtin-convert-2.c  -O2  (test for excess errors)
FAIL: gcc.dg/torture/builtin-convert-2.c  -O3 -fomit-frame-pointer  (test for excess errors)
FAIL: gcc.dg/torture/builtin-convert-2.c  -O3 -g  (test for excess errors)
FAIL: gcc.dg/torture/builtin-convert-2.c  -Os  (test for excess errors)
FAIL: gcc.dg/torture/builtin-convert-3.c  -O1  (test for excess errors)
FAIL: gcc.dg/torture/builtin-convert-3.c  -O2  (test for excess errors)
FAIL: gcc.dg/torture/builtin-convert-3.c  -O3 -fomit-frame-pointer  (test for excess errors)
FAIL: gcc.dg/torture/builtin-convert-3.c  -O3 -g  (test for excess errors)
FAIL: gcc.dg/torture/builtin-convert-3.c  -Os  (test for excess errors)
FAIL: gcc.dg/torture/builtin-power-1.c  -O0  (test for excess errors)
FAIL: gcc.dg/torture/builtin-power-1.c  -O1  (test for excess errors)
FAIL: gcc.dg/torture/builtin-power-1.c  -O2  (test for excess errors)
FAIL: gcc.dg/torture/builtin-power-1.c  -O3 -fomit-frame-pointer  (test for excess errors)
FAIL: gcc.dg/torture/builtin-power-1.c  -O3 -g  (test for excess errors)
FAIL: gcc.dg/torture/builtin-power-1.c  -Os  (test for excess errors)
FAIL: gcc.dg/tree-ssa/pr42585.c scan-tree-dump-times optimized "struct _fat_ptr _ans" 0
FAIL: gcc.dg/tree-ssa/pr42585.c scan-tree-dump-times optimized "struct _fat_ptr _T2" 0

		=== gcc Summary ===

# of expected passes		53025
# of unexpected failures	68
# of expected failures		86
# of unresolved testcases	3
# of unsupported tests		775
/var/gcc/gcc-4.5.2/gcc/xgcc  version 4.5.2 (GCC) 

		=== gfortran tests ===


Running target unix
FAIL: gfortran.dg/c_by_val_1.f  -O0  (test for excess errors)
WARNING: gfortran.dg/c_by_val_1.f  -O0  compilation failed to produce executable
FAIL: gfortran.dg/c_by_val_1.f  -O1  (test for excess errors)
WARNING: gfortran.dg/c_by_val_1.f  -O1  compilation failed to produce executable
FAIL: gfortran.dg/c_by_val_1.f  -O2  (test for excess errors)
WARNING: gfortran.dg/c_by_val_1.f  -O2  compilation failed to produce executable
FAIL: gfortran.dg/c_by_val_1.f  -O3 -fomit-frame-pointer  (test for excess errors)
WARNING: gfortran.dg/c_by_val_1.f  -O3 -fomit-frame-pointer  compilation failed to produce executable
FAIL: gfortran.dg/c_by_val_1.f  -O3 -fomit-frame-pointer -funroll-loops  (test for excess errors)
WARNING: gfortran.dg/c_by_val_1.f  -O3 -fomit-frame-pointer -funroll-loops  compilation failed to produce executable
FAIL: gfortran.dg/c_by_val_1.f  -O3 -fomit-frame-pointer -funroll-all-loops -finline-functions  (test for excess errors)
WARNING: gfortran.dg/c_by_val_1.f  -O3 -fomit-frame-pointer -funroll-all-loops -finline-functions  compilation failed to produce executable
FAIL: gfortran.dg/c_by_val_1.f  -O3 -g  (test for excess errors)
WARNING: gfortran.dg/c_by_val_1.f  -O3 -g  compilation failed to produce executable
FAIL: gfortran.dg/c_by_val_1.f  -Os  (test for excess errors)
WARNING: gfortran.dg/c_by_val_1.f  -Os  compilation failed to produce executable
FAIL: gfortran.dg/namelist_42.f90  -O0  execution test
FAIL: gfortran.dg/namelist_42.f90  -O1  execution test
FAIL: gfortran.dg/namelist_42.f90  -O2  execution test
FAIL: gfortran.dg/namelist_42.f90  -O3 -fomit-frame-pointer  execution test
FAIL: gfortran.dg/namelist_42.f90  -O3 -fomit-frame-pointer -funroll-loops  execution test
FAIL: gfortran.dg/namelist_42.f90  -O3 -fomit-frame-pointer -funroll-all-loops -finline-functions  execution test
FAIL: gfortran.dg/namelist_42.f90  -O3 -g  execution test
FAIL: gfortran.dg/namelist_42.f90  -Os  execution test
FAIL: gfortran.dg/namelist_43.f90  -O0  execution test
FAIL: gfortran.dg/namelist_43.f90  -O1  execution test
FAIL: gfortran.dg/namelist_43.f90  -O2  execution test
FAIL: gfortran.dg/namelist_43.f90  -O3 -fomit-frame-pointer  execution test
FAIL: gfortran.dg/namelist_43.f90  -O3 -fomit-frame-pointer -funroll-loops  execution test
FAIL: gfortran.dg/namelist_43.f90  -O3 -fomit-frame-pointer -funroll-all-loops -finline-functions  execution test
FAIL: gfortran.dg/namelist_43.f90  -O3 -g  execution test
FAIL: gfortran.dg/namelist_43.f90  -Os  execution test
FAIL: gfortran.dg/nan_3.f90  -O0  execution test
FAIL: gfortran.dg/nan_3.f90  -O1  execution test
FAIL: gfortran.dg/nan_3.f90  -O2  execution test
FAIL: gfortran.dg/nan_3.f90  -O3 -fomit-frame-pointer  execution test
FAIL: gfortran.dg/nan_3.f90  -O3 -fomit-frame-pointer -funroll-loops  execution test
FAIL: gfortran.dg/nan_3.f90  -O3 -fomit-frame-pointer -funroll-all-loops -finline-functions  execution test
FAIL: gfortran.dg/nan_3.f90  -O3 -g  execution test
FAIL: gfortran.dg/nan_3.f90  -Os  execution test

		=== gfortran Summary ===

# of expected passes		33744
# of unexpected failures	32
# of expected failures		20
# of unsupported tests		244
/var/gcc/gcc-4.5.2/gcc/testsuite/gfortran/../../gfortran  version 4.5.2 (GCC) 

		=== gnat tests ===


Running target unix
FAIL: gnat.dg/atomic1.adb scan-tree-dump-times gimple "v_16" 1
FAIL: gnat.dg/socket1.adb (test for excess errors)
WARNING: gnat.dg/socket1.adb compilation failed to produce executable
FAIL: gnat.dg/stack_check1.adb execution test
FAIL: gnat.dg/specs/alignment1.ads (test for excess errors)
FAIL: gnat.dg/specs/alignment2.ads  (test for warnings, line 12)
FAIL: gnat.dg/specs/alignment2.ads  (test for warnings, line 18)
FAIL: gnat.dg/specs/alignment2.ads  (test for warnings, line 36)
FAIL: gnat.dg/specs/alignment2.ads  (test for warnings, line 40)
FAIL: gnat.dg/specs/alignment2.ads (test for excess errors)

		=== gnat Summary ===

# of expected passes		754
# of unexpected failures	9
# of expected failures		7
# of unsupported tests		1
		=== objc tests ===


Running target unix
WARNING: Could not compile objc.dg/gnu-encoding/struct-layout-encoding-1 generator

		=== objc Summary ===

# of expected passes		1811
# of expected failures		8
# of unsupported tests		24
/var/gcc/gcc-4.5.2/gcc/xgcc  version 4.5.2 (GCC) 


Compiler version: 4.5.2 (GCC) 
Platform: alpha-dec-osf4.0f
configure flags: --prefix=/vol/gcc-4.5 --with-gmp=/vol/gcc --with-mpfr=/vol/gcc --disable-nls --enable-languages=all,ada --host alpha-dec-osf4.0f --build alpha-dec-osf4.0f --target alpha-dec-osf4.0f --enable-obsolete
BOOT_CFLAGS=-g -O2


Index Nav: [Date Index] [Subject Index] [Author Index] [Thread Index]
Message Nav: [Date Prev] [Date Next] [Thread Prev] [Thread Next]