This is the mail archive of the gcc-testresults@gcc.gnu.org mailing list for the GCC project.


Index Nav: [Date Index] [Subject Index] [Author Index] [Thread Index]
Message Nav: [Date Prev] [Date Next] [Thread Prev] [Thread Next]
Other format: [Raw text]

Results for 4.4.3 (GCC) testsuite on x86_64-apple-darwin10


LAST_UPDATED: Obtained from SVN: tags/gcc_4_4_3_release revision 156151

Native configuration is x86_64-apple-darwin10

		=== g++ tests ===


Running target unix
FAIL: g++.dg/debug/dwarf2/pubnames-1.C scan-assembler-times .debug_pubnames 1
FAIL: g++.dg/debug/dwarf2/pubnames-1.C scan-assembler-times "main".*external name 1
FAIL: g++.dg/debug/dwarf2/typedef1.C scan-assembler-times DW_AT_name: "foo<1u>" 1
FAIL: g++.dg/debug/dwarf2/typedef1.C scan-assembler-times DW_AT_name: "typedef foo<1u>::type type" 1

		=== g++ Summary ===

# of expected passes		19649
# of unexpected failures	4
# of expected failures		156
# of unsupported tests		297
/sw/src/fink.build/gcc44-4.4.3-1000/darwin_objdir/gcc/testsuite/g++/../../g++  version 4.4.3 (GCC) 

		=== gcc tests ===


Running target unix
FAIL: gcc.dg/darwin-weakimport-1.c scan-assembler-not weak_[a-z \\t]*_b
FAIL: gcc.dg/darwin-weakimport-3.c scan-assembler-not coalesced
FAIL: gcc.dg/framework-1.c (test for excess errors)

		=== gcc Summary ===

# of expected passes		55194
# of unexpected failures	3
# of expected failures		191
# of unsupported tests		1338
/sw/src/fink.build/gcc44-4.4.3-1000/darwin_objdir/gcc/xgcc  version 4.4.3 (GCC) 

		=== gfortran tests ===


Running target unix

		=== gfortran Summary ===

# of expected passes		29866
# of expected failures		14
# of unsupported tests		66
/sw/src/fink.build/gcc44-4.4.3-1000/darwin_objdir/gcc/testsuite/gfortran/../../gfortran  version 4.4.3 (GCC) 

		=== objc tests ===


Running target unix
FAIL: objc/execute/exceptions/catchall-1.m execution,  -O0 -fgnu-runtime
FAIL: objc/execute/exceptions/catchall-1.m execution,  -O1 -fgnu-runtime
FAIL: objc/execute/exceptions/catchall-1.m execution,  -O2 -fgnu-runtime
FAIL: objc/execute/exceptions/catchall-1.m execution,  -O3 -fomit-frame-pointer -fgnu-runtime
FAIL: objc/execute/exceptions/catchall-1.m execution,  -O3 -g -fgnu-runtime
FAIL: objc/execute/exceptions/catchall-1.m execution,  -Os -fgnu-runtime
FAIL: objc/execute/exceptions/finally-1.m execution,  -O0 -fgnu-runtime
FAIL: objc/execute/exceptions/finally-1.m execution,  -O1 -fgnu-runtime
FAIL: objc/execute/exceptions/finally-1.m execution,  -O2 -fgnu-runtime
FAIL: objc/execute/exceptions/finally-1.m execution,  -O3 -fomit-frame-pointer -fgnu-runtime
FAIL: objc/execute/exceptions/finally-1.m execution,  -O3 -g -fgnu-runtime
FAIL: objc/execute/exceptions/finally-1.m execution,  -Os -fgnu-runtime
FAIL: objc/execute/exceptions/foward-1.m execution,  -O0 -fgnu-runtime
FAIL: objc/execute/exceptions/foward-1.m execution,  -O1 -fgnu-runtime
FAIL: objc/execute/exceptions/foward-1.m execution,  -O2 -fgnu-runtime
FAIL: objc/execute/exceptions/foward-1.m execution,  -O3 -fomit-frame-pointer -fgnu-runtime
FAIL: objc/execute/exceptions/foward-1.m execution,  -O3 -fomit-frame-pointer -funroll-loops -fgnu-runtime
FAIL: objc/execute/exceptions/foward-1.m execution,  -O3 -fomit-frame-pointer -funroll-all-loops -finline-functions -fgnu-runtime
FAIL: objc/execute/exceptions/foward-1.m execution,  -O3 -g -fgnu-runtime
FAIL: objc/execute/exceptions/foward-1.m execution,  -Os -fgnu-runtime
FAIL: objc/execute/exceptions/handler-1.m execution,  -O0 -fgnu-runtime
FAIL: objc/execute/exceptions/handler-1.m execution,  -O1 -fgnu-runtime
FAIL: objc/execute/exceptions/handler-1.m execution,  -O2 -fgnu-runtime
FAIL: objc/execute/exceptions/handler-1.m execution,  -O3 -fomit-frame-pointer -fgnu-runtime
FAIL: objc/execute/exceptions/handler-1.m execution,  -O3 -g -fgnu-runtime
FAIL: objc/execute/exceptions/handler-1.m execution,  -Os -fgnu-runtime
FAIL: objc/execute/exceptions/local-variables-1.m execution,  -O0 -fgnu-runtime
FAIL: objc/execute/exceptions/local-variables-1.m execution,  -O1 -fgnu-runtime
FAIL: objc/execute/exceptions/local-variables-1.m execution,  -O2 -fgnu-runtime
FAIL: objc/execute/exceptions/local-variables-1.m execution,  -O3 -fomit-frame-pointer -fgnu-runtime
FAIL: objc/execute/exceptions/local-variables-1.m execution,  -O3 -g -fgnu-runtime
FAIL: objc/execute/exceptions/local-variables-1.m execution,  -Os -fgnu-runtime
FAIL: objc/execute/forward-1.m execution,  -O0 -fgnu-runtime
FAIL: objc/execute/forward-1.m execution,  -O1 -fgnu-runtime
FAIL: objc/execute/forward-1.m execution,  -O2 -fgnu-runtime
FAIL: objc/execute/forward-1.m execution,  -O3 -fomit-frame-pointer -fgnu-runtime
FAIL: objc/execute/forward-1.m execution,  -O3 -fomit-frame-pointer -funroll-loops -fgnu-runtime
FAIL: objc/execute/forward-1.m execution,  -O3 -fomit-frame-pointer -funroll-all-loops -finline-functions -fgnu-runtime
FAIL: objc/execute/forward-1.m execution,  -O3 -g -fgnu-runtime
FAIL: objc/execute/forward-1.m execution,  -Os -fgnu-runtime
FAIL: objc.dg/bitfield-1.m (test for excess errors)
WARNING: objc.dg/bitfield-1.m compilation failed to produce executable
FAIL: objc.dg/bitfield-3.m (test for excess errors)
FAIL: objc.dg/bitfield-5.m (test for excess errors)
FAIL: objc.dg/call-super-1.m (test for excess errors)
WARNING: objc.dg/call-super-1.m compilation failed to produce executable
FAIL: objc.dg/call-super-3.m (test for excess errors)
WARNING: objc.dg/call-super-3.m compilation failed to produce executable
FAIL: objc.dg/category-1.m (test for excess errors)
WARNING: objc.dg/category-1.m compilation failed to produce executable
FAIL: objc.dg/const-str-10.m (test for excess errors)
FAIL: objc.dg/const-str-10.m scan-assembler .long\\t__NSConstantStringClassReference\\n\\t.long\\t.*\\n\\t.long\\t5\\n\\t.data
FAIL: objc.dg/const-str-11.m (test for excess errors)
FAIL: objc.dg/const-str-11.m scan-assembler .long\\t__XStrClassReference\\n\\t.long\\t.*\\n\\t.long\\t5\\n\\t.data
FAIL: objc.dg/const-str-3.m (test for excess errors)
WARNING: objc.dg/const-str-3.m compilation failed to produce executable
FAIL: objc.dg/const-str-7.m (test for excess errors)
WARNING: objc.dg/const-str-7.m compilation failed to produce executable
FAIL: objc.dg/const-str-8.m (test for excess errors)
WARNING: objc.dg/const-str-8.m compilation failed to produce executable
FAIL: objc.dg/const-str-9.m (test for excess errors)
FAIL: objc.dg/const-str-9.m scan-assembler .long\\t__NSConstantStringClassReference\\n\\t.long\\t.*\\n\\t.long\\t5\\n\\t.data
FAIL: objc.dg/defs.m (test for excess errors)
WARNING: objc.dg/defs.m compilation failed to produce executable
FAIL: objc.dg/desig-init-1.m (test for excess errors)
WARNING: objc.dg/desig-init-1.m compilation failed to produce executable
FAIL: objc.dg/encode-2.m (test for excess errors)
WARNING: objc.dg/encode-2.m compilation failed to produce executable
FAIL: objc.dg/encode-3.m (test for excess errors)
WARNING: objc.dg/encode-3.m compilation failed to produce executable
FAIL: objc.dg/encode-4.m (test for excess errors)
WARNING: objc.dg/encode-4.m compilation failed to produce executable
FAIL: objc.dg/encode-5.m (test for excess errors)
FAIL: objc.dg/fix-and-continue-1.m (test for excess errors)
WARNING: objc.dg/fix-and-continue-1.m compilation failed to produce executable
FAIL: objc.dg/func-ptr-1.m (test for excess errors)
WARNING: objc.dg/func-ptr-1.m compilation failed to produce executable
FAIL: objc.dg/func-ptr-2.m (test for excess errors)
WARNING: objc.dg/func-ptr-2.m compilation failed to produce executable
FAIL: objc.dg/headers.m (test for excess errors)
FAIL: objc.dg/layout-1.m (test for excess errors)
FAIL: objc.dg/lookup-1.m (test for excess errors)
WARNING: objc.dg/lookup-1.m compilation failed to produce executable
FAIL: objc.dg/method-10.m (test for excess errors)
WARNING: objc.dg/method-10.m compilation failed to produce executable
FAIL: objc.dg/method-13.m execution test
FAIL: objc.dg/method-3.m (test for excess errors)
WARNING: objc.dg/method-3.m compilation failed to produce executable
FAIL: objc.dg/method-6.m (test for excess errors)
FAIL: objc.dg/next-runtime-1.m scan-assembler L_OBJC_MODULES:\\n[ \\t]*.long\\t6\\n
FAIL: objc.dg/no-extra-load.m (test for excess errors)
ERROR: objc.dg/no-extra-load.m: error executing dg-final: couldn't open "no-extra-load.s": no such file or directory
UNRESOLVED: objc.dg/no-extra-load.m: error executing dg-final: couldn't open "no-extra-load.s": no such file or directory
FAIL: objc.dg/proto-lossage-3.m (test for excess errors)
WARNING: objc.dg/proto-lossage-3.m compilation failed to produce executable
FAIL: objc.dg/proto-qual-1.m (test for excess errors)
WARNING: objc.dg/proto-qual-1.m compilation failed to produce executable
FAIL: objc.dg/sizeof-1.m (test for excess errors)
WARNING: objc.dg/sizeof-1.m compilation failed to produce executable
FAIL: objc.dg/stret-1.m (test for excess errors)
WARNING: objc.dg/stret-1.m compilation failed to produce executable
FAIL: objc.dg/stret-2.m scan-assembler objc_msgSend_stret
FAIL: objc.dg/stret-2.m scan-assembler-not objc_msgSend[^_S]
FAIL: objc.dg/stret-2.m scan-assembler-not objc_msgSendSuper[^_]
FAIL: objc.dg/stubify-1.m (test for excess errors)
ERROR: objc.dg/stubify-1.m: error executing dg-final: couldn't open "stubify-1.s": no such file or directory
UNRESOLVED: objc.dg/stubify-1.m: error executing dg-final: couldn't open "stubify-1.s": no such file or directory
FAIL: objc.dg/stubify-2.m (test for excess errors)
FAIL: objc.dg/stubify-2.m scan-rtl-dump-not jump "symbol_ref.*"objc_msgSend"": dump file does not exist
FAIL: objc.dg/super-class-3.m (test for excess errors)
WARNING: objc.dg/super-class-3.m compilation failed to produce executable
FAIL: objc.dg/symtab-1.m scan-assembler L_OBJC_SYMBOLS.*:\\n\\t.long\\t0\\n\\t.long\\t0\\n\\t.short\\t2\\n\\t.short\\t0\\n\\t.long\\tL_OBJC_CLASS_Derived.*\\n\\t.long\\tL_OBJC_CLASS_Base.*\\n
FAIL: objc.dg/type-size-2.m (test for excess errors)
FAIL: objc.dg/type-size-2.m execution test
FAIL: objc.dg/va-meth-1.m (test for excess errors)
WARNING: objc.dg/va-meth-1.m compilation failed to produce executable
FAIL: objc.dg/zero-link-3.m (test for excess errors)
WARNING: objc.dg/zero-link-3.m compilation failed to produce executable
FAIL: objc.dg/special/unclaimed-category-1.m unclaimed-category-1a.o (test for excess errors)
FAIL: objc.dg/special/unclaimed-category-1.m unclaimed-category-1a.o execution test

		=== objc Summary ===

# of expected passes		1802
# of unexpected failures	91
# of expected failures		7
# of unresolved testcases	2
# of unsupported tests		2
/sw/src/fink.build/gcc44-4.4.3-1000/darwin_objdir/gcc/xgcc  version 4.4.3 (GCC) 

		=== libffi tests ===


Running target unix

		=== libffi Summary ===

# of expected passes		1389
# of unsupported tests		10
		=== libgomp tests ===


Running target unix

		=== libgomp Summary ===

# of expected passes		2168
# of unsupported tests		128
		=== libjava tests ===


Running target unix
FAIL: PR16923 run
FAIL: StackTrace2 output - source compiled test
FAIL: StackTrace2 -findirect-dispatch output - source compiled test
FAIL: StackTrace2 -O3 output - source compiled test
FAIL: StackTrace2 -O3 -findirect-dispatch output - source compiled test
FAIL: Throw_3 output - source compiled test
FAIL: Throw_3 -findirect-dispatch output - source compiled test
FAIL: Throw_3 -O3 output - source compiled test
FAIL: Throw_3 -O3 -findirect-dispatch output - source compiled test
FAIL: WalkerTest execution - source compiled test
FAIL: WalkerTest -findirect-dispatch execution - source compiled test
FAIL: WalkerTest -O3 execution - source compiled test
FAIL: WalkerTest -O3 -findirect-dispatch execution - source compiled test
FAIL: stacktrace -O3 output - source compiled test

		=== libjava Summary ===

# of expected passes		2556
# of unexpected failures	14
# of untested testcases		5
		=== libstdc++ tests ===


Running target unix
FAIL: 21_strings/basic_string/element_access/char/21674.cc execution test
FAIL: 21_strings/basic_string/element_access/wchar_t/21674.cc execution test

		=== libstdc++ Summary ===

# of expected passes		5617
# of unexpected failures	2
# of expected failures		75
# of unsupported tests		463

Compiler version: 4.4.3 (GCC) 
Platform: x86_64-apple-darwin10
configure flags: --prefix=/sw --prefix=/sw/lib/gcc4.4 --mandir=/sw/share/man --infodir=/sw/share/info --enable-languages=c,c++,fortran,objc,java --with-gmp=/sw --with-libiconv-prefix=/sw --with-ppl=/sw --with-cloog=/sw --with-system-zlib --x-includes=/usr/X11R6/include --x-libraries=/usr/X11R6/lib --disable-libjava-multilib --build=x86_64-apple-darwin10 --host=x86_64-apple-darwin10 --target=x86_64-apple-darwin10


Index Nav: [Date Index] [Subject Index] [Author Index] [Thread Index]
Message Nav: [Date Prev] [Date Next] [Thread Prev] [Thread Next]