This is the mail archive of the gcc-testresults@gcc.gnu.org mailing list for the GCC project.


Index Nav: [Date Index] [Subject Index] [Author Index] [Thread Index]
Message Nav: [Date Prev] [Date Next] [Thread Prev] [Thread Next]
Other format: [Raw text]

Results for 4.5.0 20090421 (experimental) [trunk revision 146514] (GCC) testsuite on powerpc-unknown-linux-gnu


LAST_UPDATED: Tue Apr 21 09:32:56 UTC 2009 (revision 146514)

		=== acats tests ===
FAIL:	c48009a

		=== acats Summary ===
# of expected passes		2314
# of unexpected failures	1
Native configuration is powerpc-unknown-linux-gnu

		=== gcc tests ===


Running target unix
XPASS: gcc.dg/Warray-bounds.c  (test for warnings, line 59)
XPASS: gcc.dg/Warray-bounds.c  (test for warnings, line 65)
FAIL: gcc.dg/and-1.c scan-assembler-not nand
FAIL: gcc.dg/c99-stdint-1.c (test for excess errors)
FAIL: gcc.dg/pr39323-2.c scan-assembler .align[\\\\t ]*268435456
FAIL: gcc.dg/pr39323-3.c scan-assembler .align[\\\\t ]*268435456
FAIL: gcc.dg/var-expand3.c (internal compiler error)
FAIL: gcc.dg/var-expand3.c (test for excess errors)
UNRESOLVED: gcc.dg/var-expand3.c compilation failed to produce executable
FAIL: gcc.dg/var-expand3.c scan-rtl-dump loop2_unroll "Expanding Accumulator": dump file does not exist
XPASS: gcc.dg/struct/wo_prof_array_through_pointer.c scan-ipa-dump ipa_struct_reorg "Number of structures to transform is 1"
FAIL: gcc.dg/tree-ssa/vrp47.c scan-tree-dump-times vrp1 "[xy][^ ]* !=" 0
FAIL: gcc.dg/tree-ssa/vrp47.c scan-tree-dump-times dom1 "x[^ ]* & y" 1
FAIL: gcc.dg/vect/pr35821-altivec.c scan-tree-dump-times vect "vectorized 1 loops" 1
FAIL: gcc.dg/vmx/1b-01.c  -O0  (test for excess errors)
UNRESOLVED: gcc.dg/vmx/1b-01.c  -O0  compilation failed to produce executable
FAIL: gcc.dg/vmx/1b-01.c  -O1  (test for excess errors)
UNRESOLVED: gcc.dg/vmx/1b-01.c  -O1  compilation failed to produce executable
FAIL: gcc.dg/vmx/1b-01.c  -O2  (test for excess errors)
UNRESOLVED: gcc.dg/vmx/1b-01.c  -O2  compilation failed to produce executable
FAIL: gcc.dg/vmx/1b-01.c  -O3 -fomit-frame-pointer  (test for excess errors)
UNRESOLVED: gcc.dg/vmx/1b-01.c  -O3 -fomit-frame-pointer  compilation failed to produce executable
FAIL: gcc.dg/vmx/1b-01.c  -O3 -g  (test for excess errors)
UNRESOLVED: gcc.dg/vmx/1b-01.c  -O3 -g  compilation failed to produce executable
FAIL: gcc.dg/vmx/1b-01.c  -Os  (test for excess errors)
UNRESOLVED: gcc.dg/vmx/1b-01.c  -Os  compilation failed to produce executable
FAIL: gcc.dg/vmx/3a-01.c  -O0  (internal compiler error)
FAIL: gcc.dg/vmx/3a-01.c  -O0  (test for excess errors)
UNRESOLVED: gcc.dg/vmx/3a-01.c  -O0  compilation failed to produce executable
FAIL: gcc.dg/vmx/3a-01.c  -O1  (internal compiler error)
FAIL: gcc.dg/vmx/3a-01.c  -O1  (test for excess errors)
UNRESOLVED: gcc.dg/vmx/3a-01.c  -O1  compilation failed to produce executable
FAIL: gcc.dg/vmx/3a-01.c  -O2  (internal compiler error)
FAIL: gcc.dg/vmx/3a-01.c  -O2  (test for excess errors)
UNRESOLVED: gcc.dg/vmx/3a-01.c  -O2  compilation failed to produce executable
FAIL: gcc.dg/vmx/3a-01.c  -O3 -fomit-frame-pointer  (internal compiler error)
FAIL: gcc.dg/vmx/3a-01.c  -O3 -fomit-frame-pointer  (test for excess errors)
UNRESOLVED: gcc.dg/vmx/3a-01.c  -O3 -fomit-frame-pointer  compilation failed to produce executable
FAIL: gcc.dg/vmx/3a-01.c  -O3 -g  (internal compiler error)
FAIL: gcc.dg/vmx/3a-01.c  -O3 -g  (test for excess errors)
UNRESOLVED: gcc.dg/vmx/3a-01.c  -O3 -g  compilation failed to produce executable
FAIL: gcc.dg/vmx/3a-01.c  -Os  (internal compiler error)
FAIL: gcc.dg/vmx/3a-01.c  -Os  (test for excess errors)
UNRESOLVED: gcc.dg/vmx/3a-01.c  -Os  compilation failed to produce executable
FAIL: gcc.dg/vmx/3a-01a.c  -O0  (internal compiler error)
FAIL: gcc.dg/vmx/3a-01a.c  -O0  (test for excess errors)
UNRESOLVED: gcc.dg/vmx/3a-01a.c  -O0  compilation failed to produce executable
FAIL: gcc.dg/vmx/3a-01a.c  -O1  (internal compiler error)
FAIL: gcc.dg/vmx/3a-01a.c  -O1  (test for excess errors)
UNRESOLVED: gcc.dg/vmx/3a-01a.c  -O1  compilation failed to produce executable
FAIL: gcc.dg/vmx/3a-01a.c  -O2  (internal compiler error)
FAIL: gcc.dg/vmx/3a-01a.c  -O2  (test for excess errors)
UNRESOLVED: gcc.dg/vmx/3a-01a.c  -O2  compilation failed to produce executable
FAIL: gcc.dg/vmx/3a-01a.c  -O3 -fomit-frame-pointer  (internal compiler error)
FAIL: gcc.dg/vmx/3a-01a.c  -O3 -fomit-frame-pointer  (test for excess errors)
UNRESOLVED: gcc.dg/vmx/3a-01a.c  -O3 -fomit-frame-pointer  compilation failed to produce executable
FAIL: gcc.dg/vmx/3a-01a.c  -O3 -g  (internal compiler error)
FAIL: gcc.dg/vmx/3a-01a.c  -O3 -g  (test for excess errors)
UNRESOLVED: gcc.dg/vmx/3a-01a.c  -O3 -g  compilation failed to produce executable
FAIL: gcc.dg/vmx/3a-01a.c  -Os  (internal compiler error)
FAIL: gcc.dg/vmx/3a-01a.c  -Os  (test for excess errors)
UNRESOLVED: gcc.dg/vmx/3a-01a.c  -Os  compilation failed to produce executable
FAIL: gcc.dg/vmx/3a-01m.c  -O0  (internal compiler error)
FAIL: gcc.dg/vmx/3a-01m.c  -O0  (test for excess errors)
UNRESOLVED: gcc.dg/vmx/3a-01m.c  -O0  compilation failed to produce executable
FAIL: gcc.dg/vmx/3a-01m.c  -O1  (internal compiler error)
FAIL: gcc.dg/vmx/3a-01m.c  -O1  (test for excess errors)
UNRESOLVED: gcc.dg/vmx/3a-01m.c  -O1  compilation failed to produce executable
FAIL: gcc.dg/vmx/3a-01m.c  -O2  (internal compiler error)
FAIL: gcc.dg/vmx/3a-01m.c  -O2  (test for excess errors)
UNRESOLVED: gcc.dg/vmx/3a-01m.c  -O2  compilation failed to produce executable
FAIL: gcc.dg/vmx/3a-01m.c  -O3 -fomit-frame-pointer  (internal compiler error)
FAIL: gcc.dg/vmx/3a-01m.c  -O3 -fomit-frame-pointer  (test for excess errors)
UNRESOLVED: gcc.dg/vmx/3a-01m.c  -O3 -fomit-frame-pointer  compilation failed to produce executable
FAIL: gcc.dg/vmx/3a-01m.c  -O3 -g  (internal compiler error)
FAIL: gcc.dg/vmx/3a-01m.c  -O3 -g  (test for excess errors)
UNRESOLVED: gcc.dg/vmx/3a-01m.c  -O3 -g  compilation failed to produce executable
FAIL: gcc.dg/vmx/3a-01m.c  -Os  (internal compiler error)
FAIL: gcc.dg/vmx/3a-01m.c  -Os  (test for excess errors)
UNRESOLVED: gcc.dg/vmx/3a-01m.c  -Os  compilation failed to produce executable
FAIL: gcc.dg/vmx/3a-03.c  -O0  (internal compiler error)
FAIL: gcc.dg/vmx/3a-03.c  -O0  (test for excess errors)
UNRESOLVED: gcc.dg/vmx/3a-03.c  -O0  compilation failed to produce executable
FAIL: gcc.dg/vmx/3a-03.c  -O1  (internal compiler error)
FAIL: gcc.dg/vmx/3a-03.c  -O1  (test for excess errors)
UNRESOLVED: gcc.dg/vmx/3a-03.c  -O1  compilation failed to produce executable
FAIL: gcc.dg/vmx/3a-03.c  -O2  (internal compiler error)
FAIL: gcc.dg/vmx/3a-03.c  -O2  (test for excess errors)
UNRESOLVED: gcc.dg/vmx/3a-03.c  -O2  compilation failed to produce executable
FAIL: gcc.dg/vmx/3a-03.c  -O3 -fomit-frame-pointer  (internal compiler error)
FAIL: gcc.dg/vmx/3a-03.c  -O3 -fomit-frame-pointer  (test for excess errors)
UNRESOLVED: gcc.dg/vmx/3a-03.c  -O3 -fomit-frame-pointer  compilation failed to produce executable
FAIL: gcc.dg/vmx/3a-03.c  -O3 -g  (internal compiler error)
FAIL: gcc.dg/vmx/3a-03.c  -O3 -g  (test for excess errors)
UNRESOLVED: gcc.dg/vmx/3a-03.c  -O3 -g  compilation failed to produce executable
FAIL: gcc.dg/vmx/3a-03.c  -Os  (internal compiler error)
FAIL: gcc.dg/vmx/3a-03.c  -Os  (test for excess errors)
UNRESOLVED: gcc.dg/vmx/3a-03.c  -Os  compilation failed to produce executable
FAIL: gcc.dg/vmx/3a-03m.c  -O0  (internal compiler error)
FAIL: gcc.dg/vmx/3a-03m.c  -O0  (test for excess errors)
UNRESOLVED: gcc.dg/vmx/3a-03m.c  -O0  compilation failed to produce executable
FAIL: gcc.dg/vmx/3a-03m.c  -O1  (internal compiler error)
FAIL: gcc.dg/vmx/3a-03m.c  -O1  (test for excess errors)
UNRESOLVED: gcc.dg/vmx/3a-03m.c  -O1  compilation failed to produce executable
FAIL: gcc.dg/vmx/3a-03m.c  -O2  (internal compiler error)
FAIL: gcc.dg/vmx/3a-03m.c  -O2  (test for excess errors)
UNRESOLVED: gcc.dg/vmx/3a-03m.c  -O2  compilation failed to produce executable
FAIL: gcc.dg/vmx/3a-03m.c  -O3 -fomit-frame-pointer  (internal compiler error)
FAIL: gcc.dg/vmx/3a-03m.c  -O3 -fomit-frame-pointer  (test for excess errors)
UNRESOLVED: gcc.dg/vmx/3a-03m.c  -O3 -fomit-frame-pointer  compilation failed to produce executable
FAIL: gcc.dg/vmx/3a-03m.c  -O3 -g  (internal compiler error)
FAIL: gcc.dg/vmx/3a-03m.c  -O3 -g  (test for excess errors)
UNRESOLVED: gcc.dg/vmx/3a-03m.c  -O3 -g  compilation failed to produce executable
FAIL: gcc.dg/vmx/3a-03m.c  -Os  (internal compiler error)
FAIL: gcc.dg/vmx/3a-03m.c  -Os  (test for excess errors)
UNRESOLVED: gcc.dg/vmx/3a-03m.c  -Os  compilation failed to produce executable
FAIL: gcc.dg/vmx/3a-04.c  -O0  (internal compiler error)
FAIL: gcc.dg/vmx/3a-04.c  -O0  (test for excess errors)
UNRESOLVED: gcc.dg/vmx/3a-04.c  -O0  compilation failed to produce executable
FAIL: gcc.dg/vmx/3a-04.c  -O1  (internal compiler error)
FAIL: gcc.dg/vmx/3a-04.c  -O1  (test for excess errors)
UNRESOLVED: gcc.dg/vmx/3a-04.c  -O1  compilation failed to produce executable
FAIL: gcc.dg/vmx/3a-04.c  -O2  (internal compiler error)
FAIL: gcc.dg/vmx/3a-04.c  -O2  (test for excess errors)
UNRESOLVED: gcc.dg/vmx/3a-04.c  -O2  compilation failed to produce executable
FAIL: gcc.dg/vmx/3a-04.c  -O3 -fomit-frame-pointer  (internal compiler error)
FAIL: gcc.dg/vmx/3a-04.c  -O3 -fomit-frame-pointer  (test for excess errors)
UNRESOLVED: gcc.dg/vmx/3a-04.c  -O3 -fomit-frame-pointer  compilation failed to produce executable
FAIL: gcc.dg/vmx/3a-04.c  -O3 -g  (internal compiler error)
FAIL: gcc.dg/vmx/3a-04.c  -O3 -g  (test for excess errors)
UNRESOLVED: gcc.dg/vmx/3a-04.c  -O3 -g  compilation failed to produce executable
FAIL: gcc.dg/vmx/3a-04.c  -Os  (internal compiler error)
FAIL: gcc.dg/vmx/3a-04.c  -Os  (test for excess errors)
UNRESOLVED: gcc.dg/vmx/3a-04.c  -Os  compilation failed to produce executable
FAIL: gcc.dg/vmx/3a-04m.c  -O0  (internal compiler error)
FAIL: gcc.dg/vmx/3a-04m.c  -O0  (test for excess errors)
UNRESOLVED: gcc.dg/vmx/3a-04m.c  -O0  compilation failed to produce executable
FAIL: gcc.dg/vmx/3a-04m.c  -O1  (internal compiler error)
FAIL: gcc.dg/vmx/3a-04m.c  -O1  (test for excess errors)
UNRESOLVED: gcc.dg/vmx/3a-04m.c  -O1  compilation failed to produce executable
FAIL: gcc.dg/vmx/3a-04m.c  -O2  (internal compiler error)
FAIL: gcc.dg/vmx/3a-04m.c  -O2  (test for excess errors)
UNRESOLVED: gcc.dg/vmx/3a-04m.c  -O2  compilation failed to produce executable
FAIL: gcc.dg/vmx/3a-04m.c  -O3 -fomit-frame-pointer  (internal compiler error)
FAIL: gcc.dg/vmx/3a-04m.c  -O3 -fomit-frame-pointer  (test for excess errors)
UNRESOLVED: gcc.dg/vmx/3a-04m.c  -O3 -fomit-frame-pointer  compilation failed to produce executable
FAIL: gcc.dg/vmx/3a-04m.c  -O3 -g  (internal compiler error)
FAIL: gcc.dg/vmx/3a-04m.c  -O3 -g  (test for excess errors)
UNRESOLVED: gcc.dg/vmx/3a-04m.c  -O3 -g  compilation failed to produce executable
FAIL: gcc.dg/vmx/3a-04m.c  -Os  (internal compiler error)
FAIL: gcc.dg/vmx/3a-04m.c  -Os  (test for excess errors)
UNRESOLVED: gcc.dg/vmx/3a-04m.c  -Os  compilation failed to produce executable
FAIL: gcc.dg/vmx/3a-05.c  -O0  (internal compiler error)
FAIL: gcc.dg/vmx/3a-05.c  -O0  (test for excess errors)
UNRESOLVED: gcc.dg/vmx/3a-05.c  -O0  compilation failed to produce executable
FAIL: gcc.dg/vmx/3a-05.c  -O1  (internal compiler error)
FAIL: gcc.dg/vmx/3a-05.c  -O1  (test for excess errors)
UNRESOLVED: gcc.dg/vmx/3a-05.c  -O1  compilation failed to produce executable
FAIL: gcc.dg/vmx/3a-05.c  -O2  (internal compiler error)
FAIL: gcc.dg/vmx/3a-05.c  -O2  (test for excess errors)
UNRESOLVED: gcc.dg/vmx/3a-05.c  -O2  compilation failed to produce executable
FAIL: gcc.dg/vmx/3a-05.c  -O3 -fomit-frame-pointer  (internal compiler error)
FAIL: gcc.dg/vmx/3a-05.c  -O3 -fomit-frame-pointer  (test for excess errors)
UNRESOLVED: gcc.dg/vmx/3a-05.c  -O3 -fomit-frame-pointer  compilation failed to produce executable
FAIL: gcc.dg/vmx/3a-05.c  -O3 -g  (internal compiler error)
FAIL: gcc.dg/vmx/3a-05.c  -O3 -g  (test for excess errors)
UNRESOLVED: gcc.dg/vmx/3a-05.c  -O3 -g  compilation failed to produce executable
FAIL: gcc.dg/vmx/3a-05.c  -Os  (internal compiler error)
FAIL: gcc.dg/vmx/3a-05.c  -Os  (test for excess errors)
UNRESOLVED: gcc.dg/vmx/3a-05.c  -Os  compilation failed to produce executable
FAIL: gcc.dg/vmx/3a-06.c  -O0  (internal compiler error)
FAIL: gcc.dg/vmx/3a-06.c  -O0  (test for excess errors)
UNRESOLVED: gcc.dg/vmx/3a-06.c  -O0  compilation failed to produce executable
FAIL: gcc.dg/vmx/3a-06.c  -O1  (internal compiler error)
FAIL: gcc.dg/vmx/3a-06.c  -O1  (test for excess errors)
UNRESOLVED: gcc.dg/vmx/3a-06.c  -O1  compilation failed to produce executable
FAIL: gcc.dg/vmx/3a-06.c  -O2  (internal compiler error)
FAIL: gcc.dg/vmx/3a-06.c  -O2  (test for excess errors)
UNRESOLVED: gcc.dg/vmx/3a-06.c  -O2  compilation failed to produce executable
FAIL: gcc.dg/vmx/3a-06.c  -O3 -fomit-frame-pointer  (internal compiler error)
FAIL: gcc.dg/vmx/3a-06.c  -O3 -fomit-frame-pointer  (test for excess errors)
UNRESOLVED: gcc.dg/vmx/3a-06.c  -O3 -fomit-frame-pointer  compilation failed to produce executable
FAIL: gcc.dg/vmx/3a-06.c  -O3 -g  (internal compiler error)
FAIL: gcc.dg/vmx/3a-06.c  -O3 -g  (test for excess errors)
UNRESOLVED: gcc.dg/vmx/3a-06.c  -O3 -g  compilation failed to produce executable
FAIL: gcc.dg/vmx/3a-06.c  -Os  (internal compiler error)
FAIL: gcc.dg/vmx/3a-06.c  -Os  (test for excess errors)
UNRESOLVED: gcc.dg/vmx/3a-06.c  -Os  compilation failed to produce executable
FAIL: gcc.dg/vmx/3a-06m.c  -O0  (internal compiler error)
FAIL: gcc.dg/vmx/3a-06m.c  -O0  (test for excess errors)
UNRESOLVED: gcc.dg/vmx/3a-06m.c  -O0  compilation failed to produce executable
FAIL: gcc.dg/vmx/3a-06m.c  -O1  (internal compiler error)
FAIL: gcc.dg/vmx/3a-06m.c  -O1  (test for excess errors)
UNRESOLVED: gcc.dg/vmx/3a-06m.c  -O1  compilation failed to produce executable
FAIL: gcc.dg/vmx/3a-06m.c  -O2  (internal compiler error)
FAIL: gcc.dg/vmx/3a-06m.c  -O2  (test for excess errors)
UNRESOLVED: gcc.dg/vmx/3a-06m.c  -O2  compilation failed to produce executable
FAIL: gcc.dg/vmx/3a-06m.c  -O3 -fomit-frame-pointer  (internal compiler error)
FAIL: gcc.dg/vmx/3a-06m.c  -O3 -fomit-frame-pointer  (test for excess errors)
UNRESOLVED: gcc.dg/vmx/3a-06m.c  -O3 -fomit-frame-pointer  compilation failed to produce executable
FAIL: gcc.dg/vmx/3a-06m.c  -O3 -g  (internal compiler error)
FAIL: gcc.dg/vmx/3a-06m.c  -O3 -g  (test for excess errors)
UNRESOLVED: gcc.dg/vmx/3a-06m.c  -O3 -g  compilation failed to produce executable
FAIL: gcc.dg/vmx/3a-06m.c  -Os  (internal compiler error)
FAIL: gcc.dg/vmx/3a-06m.c  -Os  (test for excess errors)
UNRESOLVED: gcc.dg/vmx/3a-06m.c  -Os  compilation failed to produce executable
FAIL: gcc.dg/vmx/3a-07.c  -O0  (internal compiler error)
FAIL: gcc.dg/vmx/3a-07.c  -O0  (test for excess errors)
UNRESOLVED: gcc.dg/vmx/3a-07.c  -O0  compilation failed to produce executable
FAIL: gcc.dg/vmx/3a-07.c  -O1  (internal compiler error)
FAIL: gcc.dg/vmx/3a-07.c  -O1  (test for excess errors)
UNRESOLVED: gcc.dg/vmx/3a-07.c  -O1  compilation failed to produce executable
FAIL: gcc.dg/vmx/3a-07.c  -O2  (internal compiler error)
FAIL: gcc.dg/vmx/3a-07.c  -O2  (test for excess errors)
UNRESOLVED: gcc.dg/vmx/3a-07.c  -O2  compilation failed to produce executable
FAIL: gcc.dg/vmx/3a-07.c  -O3 -fomit-frame-pointer  (internal compiler error)
FAIL: gcc.dg/vmx/3a-07.c  -O3 -fomit-frame-pointer  (test for excess errors)
UNRESOLVED: gcc.dg/vmx/3a-07.c  -O3 -fomit-frame-pointer  compilation failed to produce executable
FAIL: gcc.dg/vmx/3a-07.c  -O3 -g  (internal compiler error)
FAIL: gcc.dg/vmx/3a-07.c  -O3 -g  (test for excess errors)
UNRESOLVED: gcc.dg/vmx/3a-07.c  -O3 -g  compilation failed to produce executable
FAIL: gcc.dg/vmx/3a-07.c  -Os  (internal compiler error)
FAIL: gcc.dg/vmx/3a-07.c  -Os  (test for excess errors)
UNRESOLVED: gcc.dg/vmx/3a-07.c  -Os  compilation failed to produce executable
FAIL: gcc.dg/vmx/3b-01.c  -O0  (internal compiler error)
FAIL: gcc.dg/vmx/3b-01.c  -O0  (test for excess errors)
UNRESOLVED: gcc.dg/vmx/3b-01.c  -O0  compilation failed to produce executable
FAIL: gcc.dg/vmx/3b-01.c  -O1  (internal compiler error)
FAIL: gcc.dg/vmx/3b-01.c  -O1  (test for excess errors)
UNRESOLVED: gcc.dg/vmx/3b-01.c  -O1  compilation failed to produce executable
FAIL: gcc.dg/vmx/3b-01.c  -O2  (internal compiler error)
FAIL: gcc.dg/vmx/3b-01.c  -O2  (test for excess errors)
UNRESOLVED: gcc.dg/vmx/3b-01.c  -O2  compilation failed to produce executable
FAIL: gcc.dg/vmx/3b-01.c  -O3 -fomit-frame-pointer  (internal compiler error)
FAIL: gcc.dg/vmx/3b-01.c  -O3 -fomit-frame-pointer  (test for excess errors)
UNRESOLVED: gcc.dg/vmx/3b-01.c  -O3 -fomit-frame-pointer  compilation failed to produce executable
FAIL: gcc.dg/vmx/3b-01.c  -O3 -g  (internal compiler error)
FAIL: gcc.dg/vmx/3b-01.c  -O3 -g  (test for excess errors)
UNRESOLVED: gcc.dg/vmx/3b-01.c  -O3 -g  compilation failed to produce executable
FAIL: gcc.dg/vmx/3b-01.c  -Os  (internal compiler error)
FAIL: gcc.dg/vmx/3b-01.c  -Os  (test for excess errors)
UNRESOLVED: gcc.dg/vmx/3b-01.c  -Os  compilation failed to produce executable
FAIL: gcc.dg/vmx/3b-02.c  -O0  (internal compiler error)
FAIL: gcc.dg/vmx/3b-02.c  -O0  (test for excess errors)
UNRESOLVED: gcc.dg/vmx/3b-02.c  -O0  compilation failed to produce executable
FAIL: gcc.dg/vmx/3b-02.c  -O1  (internal compiler error)
FAIL: gcc.dg/vmx/3b-02.c  -O1  (test for excess errors)
UNRESOLVED: gcc.dg/vmx/3b-02.c  -O1  compilation failed to produce executable
FAIL: gcc.dg/vmx/3b-02.c  -O2  (internal compiler error)
FAIL: gcc.dg/vmx/3b-02.c  -O2  (test for excess errors)
UNRESOLVED: gcc.dg/vmx/3b-02.c  -O2  compilation failed to produce executable
FAIL: gcc.dg/vmx/3b-02.c  -O3 -fomit-frame-pointer  (internal compiler error)
FAIL: gcc.dg/vmx/3b-02.c  -O3 -fomit-frame-pointer  (test for excess errors)
UNRESOLVED: gcc.dg/vmx/3b-02.c  -O3 -fomit-frame-pointer  compilation failed to produce executable
FAIL: gcc.dg/vmx/3b-02.c  -O3 -g  (internal compiler error)
FAIL: gcc.dg/vmx/3b-02.c  -O3 -g  (test for excess errors)
UNRESOLVED: gcc.dg/vmx/3b-02.c  -O3 -g  compilation failed to produce executable
FAIL: gcc.dg/vmx/3b-02.c  -Os  (internal compiler error)
FAIL: gcc.dg/vmx/3b-02.c  -Os  (test for excess errors)
UNRESOLVED: gcc.dg/vmx/3b-02.c  -Os  compilation failed to produce executable
FAIL: gcc.dg/vmx/3b-10.c  -O0  (internal compiler error)
FAIL: gcc.dg/vmx/3b-10.c  -O0  (test for excess errors)
UNRESOLVED: gcc.dg/vmx/3b-10.c  -O0  compilation failed to produce executable
FAIL: gcc.dg/vmx/3b-10.c  -O1  (internal compiler error)
FAIL: gcc.dg/vmx/3b-10.c  -O1  (test for excess errors)
UNRESOLVED: gcc.dg/vmx/3b-10.c  -O1  compilation failed to produce executable
FAIL: gcc.dg/vmx/3b-10.c  -O2  (internal compiler error)
FAIL: gcc.dg/vmx/3b-10.c  -O2  (test for excess errors)
UNRESOLVED: gcc.dg/vmx/3b-10.c  -O2  compilation failed to produce executable
FAIL: gcc.dg/vmx/3b-10.c  -O3 -fomit-frame-pointer  (internal compiler error)
FAIL: gcc.dg/vmx/3b-10.c  -O3 -fomit-frame-pointer  (test for excess errors)
UNRESOLVED: gcc.dg/vmx/3b-10.c  -O3 -fomit-frame-pointer  compilation failed to produce executable
FAIL: gcc.dg/vmx/3b-10.c  -O3 -g  (internal compiler error)
FAIL: gcc.dg/vmx/3b-10.c  -O3 -g  (test for excess errors)
UNRESOLVED: gcc.dg/vmx/3b-10.c  -O3 -g  compilation failed to produce executable
FAIL: gcc.dg/vmx/3b-10.c  -Os  (internal compiler error)
FAIL: gcc.dg/vmx/3b-10.c  -Os  (test for excess errors)
UNRESOLVED: gcc.dg/vmx/3b-10.c  -Os  compilation failed to produce executable
FAIL: gcc.dg/vmx/3b-13.c  -O0  (internal compiler error)
FAIL: gcc.dg/vmx/3b-13.c  -O0  (test for excess errors)
UNRESOLVED: gcc.dg/vmx/3b-13.c  -O0  compilation failed to produce executable
FAIL: gcc.dg/vmx/3b-13.c  -O1  (internal compiler error)
FAIL: gcc.dg/vmx/3b-13.c  -O1  (test for excess errors)
UNRESOLVED: gcc.dg/vmx/3b-13.c  -O1  compilation failed to produce executable
FAIL: gcc.dg/vmx/3b-13.c  -O2  (internal compiler error)
FAIL: gcc.dg/vmx/3b-13.c  -O2  (test for excess errors)
UNRESOLVED: gcc.dg/vmx/3b-13.c  -O2  compilation failed to produce executable
FAIL: gcc.dg/vmx/3b-13.c  -O3 -fomit-frame-pointer  (internal compiler error)
FAIL: gcc.dg/vmx/3b-13.c  -O3 -fomit-frame-pointer  (test for excess errors)
UNRESOLVED: gcc.dg/vmx/3b-13.c  -O3 -fomit-frame-pointer  compilation failed to produce executable
FAIL: gcc.dg/vmx/3b-13.c  -O3 -g  (internal compiler error)
FAIL: gcc.dg/vmx/3b-13.c  -O3 -g  (test for excess errors)
UNRESOLVED: gcc.dg/vmx/3b-13.c  -O3 -g  compilation failed to produce executable
FAIL: gcc.dg/vmx/3b-13.c  -Os  (internal compiler error)
FAIL: gcc.dg/vmx/3b-13.c  -Os  (test for excess errors)
UNRESOLVED: gcc.dg/vmx/3b-13.c  -Os  compilation failed to produce executable
FAIL: gcc.dg/vmx/3b-14.c  -O0  (test for excess errors)
UNRESOLVED: gcc.dg/vmx/3b-14.c  -O0  compilation failed to produce executable
FAIL: gcc.dg/vmx/3b-14.c  -O1  (test for excess errors)
UNRESOLVED: gcc.dg/vmx/3b-14.c  -O1  compilation failed to produce executable
FAIL: gcc.dg/vmx/3b-14.c  -O2  (test for excess errors)
UNRESOLVED: gcc.dg/vmx/3b-14.c  -O2  compilation failed to produce executable
FAIL: gcc.dg/vmx/3b-14.c  -O3 -fomit-frame-pointer  (test for excess errors)
UNRESOLVED: gcc.dg/vmx/3b-14.c  -O3 -fomit-frame-pointer  compilation failed to produce executable
FAIL: gcc.dg/vmx/3b-14.c  -O3 -g  (test for excess errors)
UNRESOLVED: gcc.dg/vmx/3b-14.c  -O3 -g  compilation failed to produce executable
FAIL: gcc.dg/vmx/3b-14.c  -Os  (test for excess errors)
UNRESOLVED: gcc.dg/vmx/3b-14.c  -Os  compilation failed to produce executable
FAIL: gcc.dg/vmx/3b-15.c  -O0  (internal compiler error)
FAIL: gcc.dg/vmx/3b-15.c  -O0  (test for excess errors)
UNRESOLVED: gcc.dg/vmx/3b-15.c  -O0  compilation failed to produce executable
FAIL: gcc.dg/vmx/3b-15.c  -O1  (internal compiler error)
FAIL: gcc.dg/vmx/3b-15.c  -O1  (test for excess errors)
UNRESOLVED: gcc.dg/vmx/3b-15.c  -O1  compilation failed to produce executable
FAIL: gcc.dg/vmx/3b-15.c  -O2  (internal compiler error)
FAIL: gcc.dg/vmx/3b-15.c  -O2  (test for excess errors)
UNRESOLVED: gcc.dg/vmx/3b-15.c  -O2  compilation failed to produce executable
FAIL: gcc.dg/vmx/3b-15.c  -O3 -fomit-frame-pointer  (internal compiler error)
FAIL: gcc.dg/vmx/3b-15.c  -O3 -fomit-frame-pointer  (test for excess errors)
UNRESOLVED: gcc.dg/vmx/3b-15.c  -O3 -fomit-frame-pointer  compilation failed to produce executable
FAIL: gcc.dg/vmx/3b-15.c  -O3 -g  (internal compiler error)
FAIL: gcc.dg/vmx/3b-15.c  -O3 -g  (test for excess errors)
UNRESOLVED: gcc.dg/vmx/3b-15.c  -O3 -g  compilation failed to produce executable
FAIL: gcc.dg/vmx/3b-15.c  -Os  (internal compiler error)
FAIL: gcc.dg/vmx/3b-15.c  -Os  (test for excess errors)
UNRESOLVED: gcc.dg/vmx/3b-15.c  -Os  compilation failed to produce executable
FAIL: gcc.dg/vmx/3c-01.c  -O0  (internal compiler error)
FAIL: gcc.dg/vmx/3c-01.c  -O0  (test for excess errors)
UNRESOLVED: gcc.dg/vmx/3c-01.c  -O0  compilation failed to produce executable
FAIL: gcc.dg/vmx/3c-01.c  -O1  (internal compiler error)
FAIL: gcc.dg/vmx/3c-01.c  -O1  (test for excess errors)
UNRESOLVED: gcc.dg/vmx/3c-01.c  -O1  compilation failed to produce executable
FAIL: gcc.dg/vmx/3c-01.c  -O2  (internal compiler error)
FAIL: gcc.dg/vmx/3c-01.c  -O2  (test for excess errors)
UNRESOLVED: gcc.dg/vmx/3c-01.c  -O2  compilation failed to produce executable
FAIL: gcc.dg/vmx/3c-01.c  -O3 -fomit-frame-pointer  (internal compiler error)
FAIL: gcc.dg/vmx/3c-01.c  -O3 -fomit-frame-pointer  (test for excess errors)
UNRESOLVED: gcc.dg/vmx/3c-01.c  -O3 -fomit-frame-pointer  compilation failed to produce executable
FAIL: gcc.dg/vmx/3c-01.c  -O3 -g  (internal compiler error)
FAIL: gcc.dg/vmx/3c-01.c  -O3 -g  (test for excess errors)
UNRESOLVED: gcc.dg/vmx/3c-01.c  -O3 -g  compilation failed to produce executable
FAIL: gcc.dg/vmx/3c-01.c  -Os  (internal compiler error)
FAIL: gcc.dg/vmx/3c-01.c  -Os  (test for excess errors)
UNRESOLVED: gcc.dg/vmx/3c-01.c  -Os  compilation failed to produce executable
FAIL: gcc.dg/vmx/3c-01a.c  -O0  (test for excess errors)
FAIL: gcc.dg/vmx/3c-01a.c  -O1  (test for excess errors)
FAIL: gcc.dg/vmx/3c-01a.c  -O2  (test for excess errors)
FAIL: gcc.dg/vmx/3c-01a.c  -O3 -fomit-frame-pointer  (test for excess errors)
FAIL: gcc.dg/vmx/3c-01a.c  -O3 -g  (test for excess errors)
FAIL: gcc.dg/vmx/3c-01a.c  -Os  (test for excess errors)
FAIL: gcc.dg/vmx/3c-02.c  -O0  (internal compiler error)
FAIL: gcc.dg/vmx/3c-02.c  -O0  (test for excess errors)
UNRESOLVED: gcc.dg/vmx/3c-02.c  -O0  compilation failed to produce executable
FAIL: gcc.dg/vmx/3c-02.c  -O1  (internal compiler error)
FAIL: gcc.dg/vmx/3c-02.c  -O1  (test for excess errors)
UNRESOLVED: gcc.dg/vmx/3c-02.c  -O1  compilation failed to produce executable
FAIL: gcc.dg/vmx/3c-02.c  -O2  (internal compiler error)
FAIL: gcc.dg/vmx/3c-02.c  -O2  (test for excess errors)
UNRESOLVED: gcc.dg/vmx/3c-02.c  -O2  compilation failed to produce executable
FAIL: gcc.dg/vmx/3c-02.c  -O3 -fomit-frame-pointer  (internal compiler error)
FAIL: gcc.dg/vmx/3c-02.c  -O3 -fomit-frame-pointer  (test for excess errors)
UNRESOLVED: gcc.dg/vmx/3c-02.c  -O3 -fomit-frame-pointer  compilation failed to produce executable
FAIL: gcc.dg/vmx/3c-02.c  -O3 -g  (internal compiler error)
FAIL: gcc.dg/vmx/3c-02.c  -O3 -g  (test for excess errors)
UNRESOLVED: gcc.dg/vmx/3c-02.c  -O3 -g  compilation failed to produce executable
FAIL: gcc.dg/vmx/3c-02.c  -Os  (internal compiler error)
FAIL: gcc.dg/vmx/3c-02.c  -Os  (test for excess errors)
UNRESOLVED: gcc.dg/vmx/3c-02.c  -Os  compilation failed to produce executable
FAIL: gcc.dg/vmx/3c-03.c  -O0  (internal compiler error)
FAIL: gcc.dg/vmx/3c-03.c  -O0  (test for excess errors)
UNRESOLVED: gcc.dg/vmx/3c-03.c  -O0  compilation failed to produce executable
FAIL: gcc.dg/vmx/3c-03.c  -O1  (internal compiler error)
FAIL: gcc.dg/vmx/3c-03.c  -O1  (test for excess errors)
UNRESOLVED: gcc.dg/vmx/3c-03.c  -O1  compilation failed to produce executable
FAIL: gcc.dg/vmx/3c-03.c  -O2  (internal compiler error)
FAIL: gcc.dg/vmx/3c-03.c  -O2  (test for excess errors)
UNRESOLVED: gcc.dg/vmx/3c-03.c  -O2  compilation failed to produce executable
FAIL: gcc.dg/vmx/3c-03.c  -O3 -fomit-frame-pointer  (internal compiler error)
FAIL: gcc.dg/vmx/3c-03.c  -O3 -fomit-frame-pointer  (test for excess errors)
UNRESOLVED: gcc.dg/vmx/3c-03.c  -O3 -fomit-frame-pointer  compilation failed to produce executable
FAIL: gcc.dg/vmx/3c-03.c  -O3 -g  (internal compiler error)
FAIL: gcc.dg/vmx/3c-03.c  -O3 -g  (test for excess errors)
UNRESOLVED: gcc.dg/vmx/3c-03.c  -O3 -g  compilation failed to produce executable
FAIL: gcc.dg/vmx/3c-03.c  -Os  (internal compiler error)
FAIL: gcc.dg/vmx/3c-03.c  -Os  (test for excess errors)
UNRESOLVED: gcc.dg/vmx/3c-03.c  -Os  compilation failed to produce executable
FAIL: gcc.dg/vmx/3d-01.c  -O0  (test for excess errors)
FAIL: gcc.dg/vmx/3d-01.c  -O1  (test for excess errors)
FAIL: gcc.dg/vmx/3d-01.c  -O2  (test for excess errors)
FAIL: gcc.dg/vmx/3d-01.c  -O3 -fomit-frame-pointer  (test for excess errors)
FAIL: gcc.dg/vmx/3d-01.c  -O3 -g  (test for excess errors)
FAIL: gcc.dg/vmx/3d-01.c  -Os  (test for excess errors)
FAIL: gcc.dg/vmx/5-11.c  -O0  (internal compiler error)
FAIL: gcc.dg/vmx/5-11.c  -O0  (test for excess errors)
FAIL: gcc.dg/vmx/5-11.c  -O1  (test for excess errors)
FAIL: gcc.dg/vmx/5-11.c  -O2  (test for excess errors)
FAIL: gcc.dg/vmx/5-11.c  -O3 -fomit-frame-pointer  (test for excess errors)
FAIL: gcc.dg/vmx/5-11.c  -O3 -g  (test for excess errors)
FAIL: gcc.dg/vmx/5-11.c  -Os  (test for excess errors)
FAIL: gcc.dg/vmx/7-01.c  -O0  (internal compiler error)
FAIL: gcc.dg/vmx/7-01.c  -O0  (test for excess errors)
FAIL: gcc.dg/vmx/7-01.c  -O1  (internal compiler error)
FAIL: gcc.dg/vmx/7-01.c  -O1  (test for excess errors)
FAIL: gcc.dg/vmx/7-01.c  -O2  (internal compiler error)
FAIL: gcc.dg/vmx/7-01.c  -O2  (test for excess errors)
FAIL: gcc.dg/vmx/7-01.c  -O3 -fomit-frame-pointer  (internal compiler error)
FAIL: gcc.dg/vmx/7-01.c  -O3 -fomit-frame-pointer  (test for excess errors)
FAIL: gcc.dg/vmx/7-01.c  -O3 -fomit-frame-pointer -funroll-loops  (internal compiler error)
FAIL: gcc.dg/vmx/7-01.c  -O3 -fomit-frame-pointer -funroll-loops  (test for excess errors)
FAIL: gcc.dg/vmx/7-01.c  -O3 -fomit-frame-pointer -funroll-all-loops -finline-functions  (internal compiler error)
FAIL: gcc.dg/vmx/7-01.c  -O3 -fomit-frame-pointer -funroll-all-loops -finline-functions  (test for excess errors)
FAIL: gcc.dg/vmx/7-01.c  -O3 -g  (internal compiler error)
FAIL: gcc.dg/vmx/7-01.c  -O3 -g  (test for excess errors)
FAIL: gcc.dg/vmx/7-01.c  -Os  (internal compiler error)
FAIL: gcc.dg/vmx/7-01.c  -Os  (test for excess errors)
FAIL: gcc.dg/vmx/7-01a.c  -O0  (internal compiler error)
FAIL: gcc.dg/vmx/7-01a.c  -O0  (test for excess errors)
FAIL: gcc.dg/vmx/7-01a.c  -O1  (internal compiler error)
FAIL: gcc.dg/vmx/7-01a.c  -O1  (test for excess errors)
FAIL: gcc.dg/vmx/7-01a.c  -O2  (internal compiler error)
FAIL: gcc.dg/vmx/7-01a.c  -O2  (test for excess errors)
FAIL: gcc.dg/vmx/7-01a.c  -O3 -fomit-frame-pointer  (internal compiler error)
FAIL: gcc.dg/vmx/7-01a.c  -O3 -fomit-frame-pointer  (test for excess errors)
FAIL: gcc.dg/vmx/7-01a.c  -O3 -fomit-frame-pointer -funroll-loops  (internal compiler error)
FAIL: gcc.dg/vmx/7-01a.c  -O3 -fomit-frame-pointer -funroll-loops  (test for excess errors)
FAIL: gcc.dg/vmx/7-01a.c  -O3 -fomit-frame-pointer -funroll-all-loops -finline-functions  (internal compiler error)
FAIL: gcc.dg/vmx/7-01a.c  -O3 -fomit-frame-pointer -funroll-all-loops -finline-functions  (test for excess errors)
FAIL: gcc.dg/vmx/7-01a.c  -O3 -g  (internal compiler error)
FAIL: gcc.dg/vmx/7-01a.c  -O3 -g  (test for excess errors)
FAIL: gcc.dg/vmx/7-01a.c  -Os  (internal compiler error)
FAIL: gcc.dg/vmx/7-01a.c  -Os  (test for excess errors)
FAIL: gcc.dg/vmx/7d-01.c  -O0  (internal compiler error)
FAIL: gcc.dg/vmx/7d-01.c  -O0  (test for excess errors)
FAIL: gcc.dg/vmx/7d-01.c  -O1  (internal compiler error)
FAIL: gcc.dg/vmx/7d-01.c  -O1  (test for excess errors)
FAIL: gcc.dg/vmx/7d-01.c  -O2  (internal compiler error)
FAIL: gcc.dg/vmx/7d-01.c  -O2  (test for excess errors)
FAIL: gcc.dg/vmx/7d-01.c  -O3 -fomit-frame-pointer  (internal compiler error)
FAIL: gcc.dg/vmx/7d-01.c  -O3 -fomit-frame-pointer  (test for excess errors)
FAIL: gcc.dg/vmx/7d-01.c  -O3 -g  (internal compiler error)
FAIL: gcc.dg/vmx/7d-01.c  -O3 -g  (test for excess errors)
FAIL: gcc.dg/vmx/7d-01.c  -Os  (internal compiler error)
FAIL: gcc.dg/vmx/7d-01.c  -Os  (test for excess errors)
FAIL: gcc.dg/vmx/7d-02.c  -O0  (test for excess errors)
FAIL: gcc.dg/vmx/7d-02.c  -O1  (test for excess errors)
FAIL: gcc.dg/vmx/7d-02.c  -O2  (test for excess errors)
FAIL: gcc.dg/vmx/7d-02.c  -O3 -fomit-frame-pointer  (test for excess errors)
FAIL: gcc.dg/vmx/7d-02.c  -O3 -g  (test for excess errors)
FAIL: gcc.dg/vmx/7d-02.c  -Os  (test for excess errors)
FAIL: gcc.dg/vmx/8-01.c  -O0  (test for excess errors)
FAIL: gcc.dg/vmx/8-01.c  -O1  (test for excess errors)
FAIL: gcc.dg/vmx/8-01.c  -O2  (test for excess errors)
FAIL: gcc.dg/vmx/8-01.c  -O3 -fomit-frame-pointer  (test for excess errors)
FAIL: gcc.dg/vmx/8-01.c  -O3 -g  (test for excess errors)
FAIL: gcc.dg/vmx/8-01.c  -Os  (test for excess errors)
FAIL: gcc.dg/vmx/8-02.c  -O0  (test for excess errors)
UNRESOLVED: gcc.dg/vmx/8-02.c  -O0  compilation failed to produce executable
FAIL: gcc.dg/vmx/8-02.c  -O1  (test for excess errors)
UNRESOLVED: gcc.dg/vmx/8-02.c  -O1  compilation failed to produce executable
FAIL: gcc.dg/vmx/8-02.c  -O2  (test for excess errors)
UNRESOLVED: gcc.dg/vmx/8-02.c  -O2  compilation failed to produce executable
FAIL: gcc.dg/vmx/8-02.c  -O3 -fomit-frame-pointer  (test for excess errors)
UNRESOLVED: gcc.dg/vmx/8-02.c  -O3 -fomit-frame-pointer  compilation failed to produce executable
FAIL: gcc.dg/vmx/8-02.c  -O3 -g  (test for excess errors)
UNRESOLVED: gcc.dg/vmx/8-02.c  -O3 -g  compilation failed to produce executable
FAIL: gcc.dg/vmx/8-02.c  -Os  (test for excess errors)
UNRESOLVED: gcc.dg/vmx/8-02.c  -Os  compilation failed to produce executable
FAIL: gcc.dg/vmx/8-02a.c  -O0  (test for excess errors)
UNRESOLVED: gcc.dg/vmx/8-02a.c  -O0  compilation failed to produce executable
FAIL: gcc.dg/vmx/8-02a.c  -O1  (test for excess errors)
UNRESOLVED: gcc.dg/vmx/8-02a.c  -O1  compilation failed to produce executable
FAIL: gcc.dg/vmx/8-02a.c  -O2  (test for excess errors)
UNRESOLVED: gcc.dg/vmx/8-02a.c  -O2  compilation failed to produce executable
FAIL: gcc.dg/vmx/8-02a.c  -O3 -fomit-frame-pointer  (test for excess errors)
UNRESOLVED: gcc.dg/vmx/8-02a.c  -O3 -fomit-frame-pointer  compilation failed to produce executable
FAIL: gcc.dg/vmx/8-02a.c  -O3 -g  (test for excess errors)
UNRESOLVED: gcc.dg/vmx/8-02a.c  -O3 -g  compilation failed to produce executable
FAIL: gcc.dg/vmx/8-02a.c  -Os  (test for excess errors)
UNRESOLVED: gcc.dg/vmx/8-02a.c  -Os  compilation failed to produce executable
FAIL: gcc.dg/vmx/brode-1.c  -O0  (internal compiler error)
FAIL: gcc.dg/vmx/brode-1.c  -O0  (test for excess errors)
UNRESOLVED: gcc.dg/vmx/brode-1.c  -O0  compilation failed to produce executable
FAIL: gcc.dg/vmx/brode-1.c  -O1  (test for excess errors)
UNRESOLVED: gcc.dg/vmx/brode-1.c  -O1  compilation failed to produce executable
FAIL: gcc.dg/vmx/brode-1.c  -O2  (test for excess errors)
UNRESOLVED: gcc.dg/vmx/brode-1.c  -O2  compilation failed to produce executable
FAIL: gcc.dg/vmx/brode-1.c  -O3 -fomit-frame-pointer  (test for excess errors)
UNRESOLVED: gcc.dg/vmx/brode-1.c  -O3 -fomit-frame-pointer  compilation failed to produce executable
FAIL: gcc.dg/vmx/brode-1.c  -O3 -g  (test for excess errors)
UNRESOLVED: gcc.dg/vmx/brode-1.c  -O3 -g  compilation failed to produce executable
FAIL: gcc.dg/vmx/brode-1.c  -Os  (test for excess errors)
UNRESOLVED: gcc.dg/vmx/brode-1.c  -Os  compilation failed to produce executable
FAIL: gcc.dg/vmx/bug-1.c  -O0  (test for excess errors)
UNRESOLVED: gcc.dg/vmx/bug-1.c  -O0  compilation failed to produce executable
FAIL: gcc.dg/vmx/bug-1.c  -O1  (test for excess errors)
UNRESOLVED: gcc.dg/vmx/bug-1.c  -O1  compilation failed to produce executable
FAIL: gcc.dg/vmx/bug-1.c  -O2  (test for excess errors)
UNRESOLVED: gcc.dg/vmx/bug-1.c  -O2  compilation failed to produce executable
FAIL: gcc.dg/vmx/bug-1.c  -O3 -fomit-frame-pointer  (test for excess errors)
UNRESOLVED: gcc.dg/vmx/bug-1.c  -O3 -fomit-frame-pointer  compilation failed to produce executable
FAIL: gcc.dg/vmx/bug-1.c  -O3 -fomit-frame-pointer -funroll-loops  (test for excess errors)
UNRESOLVED: gcc.dg/vmx/bug-1.c  -O3 -fomit-frame-pointer -funroll-loops  compilation failed to produce executable
FAIL: gcc.dg/vmx/bug-1.c  -O3 -fomit-frame-pointer -funroll-all-loops -finline-functions  (test for excess errors)
UNRESOLVED: gcc.dg/vmx/bug-1.c  -O3 -fomit-frame-pointer -funroll-all-loops -finline-functions  compilation failed to produce executable
FAIL: gcc.dg/vmx/bug-1.c  -O3 -g  (test for excess errors)
UNRESOLVED: gcc.dg/vmx/bug-1.c  -O3 -g  compilation failed to produce executable
FAIL: gcc.dg/vmx/bug-1.c  -Os  (test for excess errors)
UNRESOLVED: gcc.dg/vmx/bug-1.c  -Os  compilation failed to produce executable
FAIL: gcc.dg/vmx/bug-2.c  -O0  (test for excess errors)
UNRESOLVED: gcc.dg/vmx/bug-2.c  -O0  compilation failed to produce executable
FAIL: gcc.dg/vmx/bug-2.c  -O1  (test for excess errors)
UNRESOLVED: gcc.dg/vmx/bug-2.c  -O1  compilation failed to produce executable
FAIL: gcc.dg/vmx/bug-2.c  -O2  (test for excess errors)
UNRESOLVED: gcc.dg/vmx/bug-2.c  -O2  compilation failed to produce executable
FAIL: gcc.dg/vmx/bug-2.c  -O3 -fomit-frame-pointer  (test for excess errors)
UNRESOLVED: gcc.dg/vmx/bug-2.c  -O3 -fomit-frame-pointer  compilation failed to produce executable
FAIL: gcc.dg/vmx/bug-2.c  -O3 -g  (test for excess errors)
UNRESOLVED: gcc.dg/vmx/bug-2.c  -O3 -g  compilation failed to produce executable
FAIL: gcc.dg/vmx/bug-2.c  -Os  (test for excess errors)
UNRESOLVED: gcc.dg/vmx/bug-2.c  -Os  compilation failed to produce executable
FAIL: gcc.dg/vmx/bug-3.c  -O0  (test for excess errors)
UNRESOLVED: gcc.dg/vmx/bug-3.c  -O0  compilation failed to produce executable
FAIL: gcc.dg/vmx/bug-3.c  -O1  (test for excess errors)
UNRESOLVED: gcc.dg/vmx/bug-3.c  -O1  compilation failed to produce executable
FAIL: gcc.dg/vmx/bug-3.c  -O2  (test for excess errors)
UNRESOLVED: gcc.dg/vmx/bug-3.c  -O2  compilation failed to produce executable
FAIL: gcc.dg/vmx/bug-3.c  -O3 -fomit-frame-pointer  (test for excess errors)
UNRESOLVED: gcc.dg/vmx/bug-3.c  -O3 -fomit-frame-pointer  compilation failed to produce executable
FAIL: gcc.dg/vmx/bug-3.c  -O3 -g  (test for excess errors)
UNRESOLVED: gcc.dg/vmx/bug-3.c  -O3 -g  compilation failed to produce executable
FAIL: gcc.dg/vmx/bug-3.c  -Os  (test for excess errors)
UNRESOLVED: gcc.dg/vmx/bug-3.c  -Os  compilation failed to produce executable
FAIL: gcc.dg/vmx/cw-bug-1.c  -O0  (test for excess errors)
UNRESOLVED: gcc.dg/vmx/cw-bug-1.c  -O0  compilation failed to produce executable
FAIL: gcc.dg/vmx/cw-bug-1.c  -O1  (test for excess errors)
UNRESOLVED: gcc.dg/vmx/cw-bug-1.c  -O1  compilation failed to produce executable
FAIL: gcc.dg/vmx/cw-bug-1.c  -O2  (test for excess errors)
UNRESOLVED: gcc.dg/vmx/cw-bug-1.c  -O2  compilation failed to produce executable
FAIL: gcc.dg/vmx/cw-bug-1.c  -O3 -fomit-frame-pointer  (test for excess errors)
UNRESOLVED: gcc.dg/vmx/cw-bug-1.c  -O3 -fomit-frame-pointer  compilation failed to produce executable
FAIL: gcc.dg/vmx/cw-bug-1.c  -O3 -g  (test for excess errors)
UNRESOLVED: gcc.dg/vmx/cw-bug-1.c  -O3 -g  compilation failed to produce executable
FAIL: gcc.dg/vmx/cw-bug-1.c  -Os  (test for excess errors)
UNRESOLVED: gcc.dg/vmx/cw-bug-1.c  -Os  compilation failed to produce executable
FAIL: gcc.dg/vmx/dct.c  -O0  (internal compiler error)
FAIL: gcc.dg/vmx/dct.c  -O0  (test for excess errors)
FAIL: gcc.dg/vmx/dct.c  -O1  (internal compiler error)
FAIL: gcc.dg/vmx/dct.c  -O1  (test for excess errors)
FAIL: gcc.dg/vmx/dct.c  -O2  (internal compiler error)
FAIL: gcc.dg/vmx/dct.c  -O2  (test for excess errors)
FAIL: gcc.dg/vmx/dct.c  -O3 -fomit-frame-pointer  (internal compiler error)
FAIL: gcc.dg/vmx/dct.c  -O3 -fomit-frame-pointer  (test for excess errors)
FAIL: gcc.dg/vmx/dct.c  -O3 -g  (internal compiler error)
FAIL: gcc.dg/vmx/dct.c  -O3 -g  (test for excess errors)
FAIL: gcc.dg/vmx/dct.c  -Os  (internal compiler error)
FAIL: gcc.dg/vmx/dct.c  -Os  (test for excess errors)
FAIL: gcc.dg/vmx/debug-4.c  -O0  (internal compiler error)
FAIL: gcc.dg/vmx/debug-4.c  -O0  (test for excess errors)
UNRESOLVED: gcc.dg/vmx/debug-4.c  -O0  compilation failed to produce executable
FAIL: gcc.dg/vmx/debug-4.c  -O1  (internal compiler error)
FAIL: gcc.dg/vmx/debug-4.c  -O1  (test for excess errors)
UNRESOLVED: gcc.dg/vmx/debug-4.c  -O1  compilation failed to produce executable
FAIL: gcc.dg/vmx/debug-4.c  -O2  (internal compiler error)
FAIL: gcc.dg/vmx/debug-4.c  -O2  (test for excess errors)
UNRESOLVED: gcc.dg/vmx/debug-4.c  -O2  compilation failed to produce executable
FAIL: gcc.dg/vmx/debug-4.c  -O3 -fomit-frame-pointer  (internal compiler error)
FAIL: gcc.dg/vmx/debug-4.c  -O3 -fomit-frame-pointer  (test for excess errors)
UNRESOLVED: gcc.dg/vmx/debug-4.c  -O3 -fomit-frame-pointer  compilation failed to produce executable
FAIL: gcc.dg/vmx/debug-4.c  -O3 -g  (internal compiler error)
FAIL: gcc.dg/vmx/debug-4.c  -O3 -g  (test for excess errors)
UNRESOLVED: gcc.dg/vmx/debug-4.c  -O3 -g  compilation failed to produce executable
FAIL: gcc.dg/vmx/debug-4.c  -Os  (internal compiler error)
FAIL: gcc.dg/vmx/debug-4.c  -Os  (test for excess errors)
UNRESOLVED: gcc.dg/vmx/debug-4.c  -Os  compilation failed to produce executable
FAIL: gcc.dg/vmx/dos-bug-2-gdb.c  -O0  (internal compiler error)
FAIL: gcc.dg/vmx/dos-bug-2-gdb.c  -O0  (test for excess errors)
UNRESOLVED: gcc.dg/vmx/dos-bug-2-gdb.c  -O0  compilation failed to produce executable
FAIL: gcc.dg/vmx/dos-bug-2-gdb.c  -O1  (test for excess errors)
UNRESOLVED: gcc.dg/vmx/dos-bug-2-gdb.c  -O1  compilation failed to produce executable
FAIL: gcc.dg/vmx/dos-bug-2-gdb.c  -O2  (test for excess errors)
UNRESOLVED: gcc.dg/vmx/dos-bug-2-gdb.c  -O2  compilation failed to produce executable
FAIL: gcc.dg/vmx/dos-bug-2-gdb.c  -O3 -fomit-frame-pointer  (test for excess errors)
UNRESOLVED: gcc.dg/vmx/dos-bug-2-gdb.c  -O3 -fomit-frame-pointer  compilation failed to produce executable
FAIL: gcc.dg/vmx/dos-bug-2-gdb.c  -O3 -g  (test for excess errors)
UNRESOLVED: gcc.dg/vmx/dos-bug-2-gdb.c  -O3 -g  compilation failed to produce executable
FAIL: gcc.dg/vmx/dos-bug-2-gdb.c  -Os  (test for excess errors)
UNRESOLVED: gcc.dg/vmx/dos-bug-2-gdb.c  -Os  compilation failed to produce executable
FAIL: gcc.dg/vmx/eg-5.c  -O0  (internal compiler error)
FAIL: gcc.dg/vmx/eg-5.c  -O0  (test for excess errors)
UNRESOLVED: gcc.dg/vmx/eg-5.c  -O0  compilation failed to produce executable
FAIL: gcc.dg/vmx/eg-5.c  -O1  (internal compiler error)
FAIL: gcc.dg/vmx/eg-5.c  -O1  (test for excess errors)
UNRESOLVED: gcc.dg/vmx/eg-5.c  -O1  compilation failed to produce executable
FAIL: gcc.dg/vmx/eg-5.c  -O2  (internal compiler error)
FAIL: gcc.dg/vmx/eg-5.c  -O2  (test for excess errors)
UNRESOLVED: gcc.dg/vmx/eg-5.c  -O2  compilation failed to produce executable
FAIL: gcc.dg/vmx/eg-5.c  -O3 -fomit-frame-pointer  (internal compiler error)
FAIL: gcc.dg/vmx/eg-5.c  -O3 -fomit-frame-pointer  (test for excess errors)
UNRESOLVED: gcc.dg/vmx/eg-5.c  -O3 -fomit-frame-pointer  compilation failed to produce executable
FAIL: gcc.dg/vmx/eg-5.c  -O3 -g  (internal compiler error)
FAIL: gcc.dg/vmx/eg-5.c  -O3 -g  (test for excess errors)
UNRESOLVED: gcc.dg/vmx/eg-5.c  -O3 -g  compilation failed to produce executable
FAIL: gcc.dg/vmx/eg-5.c  -Os  (internal compiler error)
FAIL: gcc.dg/vmx/eg-5.c  -Os  (test for excess errors)
UNRESOLVED: gcc.dg/vmx/eg-5.c  -Os  compilation failed to produce executable
FAIL: gcc.dg/vmx/fft.c  -O0  (internal compiler error)
FAIL: gcc.dg/vmx/fft.c  -O0  (test for excess errors)
FAIL: gcc.dg/vmx/fft.c  -O1  (internal compiler error)
FAIL: gcc.dg/vmx/fft.c  -O1  (test for excess errors)
FAIL: gcc.dg/vmx/fft.c  -O2  (internal compiler error)
FAIL: gcc.dg/vmx/fft.c  -O2  (test for excess errors)
FAIL: gcc.dg/vmx/fft.c  -O3 -fomit-frame-pointer  (internal compiler error)
FAIL: gcc.dg/vmx/fft.c  -O3 -fomit-frame-pointer  (test for excess errors)
FAIL: gcc.dg/vmx/fft.c  -O3 -fomit-frame-pointer -funroll-loops  (internal compiler error)
FAIL: gcc.dg/vmx/fft.c  -O3 -fomit-frame-pointer -funroll-loops  (test for excess errors)
FAIL: gcc.dg/vmx/fft.c  -O3 -fomit-frame-pointer -funroll-all-loops -finline-functions  (internal compiler error)
FAIL: gcc.dg/vmx/fft.c  -O3 -fomit-frame-pointer -funroll-all-loops -finline-functions  (test for excess errors)
FAIL: gcc.dg/vmx/fft.c  -O3 -g  (internal compiler error)
FAIL: gcc.dg/vmx/fft.c  -O3 -g  (test for excess errors)
FAIL: gcc.dg/vmx/fft.c  -Os  (internal compiler error)
FAIL: gcc.dg/vmx/fft.c  -Os  (test for excess errors)
FAIL: gcc.dg/vmx/gcc-bug-b.c  -O0  (internal compiler error)
FAIL: gcc.dg/vmx/gcc-bug-b.c  -O0  (test for excess errors)
FAIL: gcc.dg/vmx/gcc-bug-b.c  -O1  (internal compiler error)
FAIL: gcc.dg/vmx/gcc-bug-b.c  -O1  (test for excess errors)
FAIL: gcc.dg/vmx/gcc-bug-b.c  -O2  (internal compiler error)
FAIL: gcc.dg/vmx/gcc-bug-b.c  -O2  (test for excess errors)
FAIL: gcc.dg/vmx/gcc-bug-b.c  -O3 -fomit-frame-pointer  (internal compiler error)
FAIL: gcc.dg/vmx/gcc-bug-b.c  -O3 -fomit-frame-pointer  (test for excess errors)
FAIL: gcc.dg/vmx/gcc-bug-b.c  -O3 -g  (internal compiler error)
FAIL: gcc.dg/vmx/gcc-bug-b.c  -O3 -g  (test for excess errors)
FAIL: gcc.dg/vmx/gcc-bug-b.c  -Os  (internal compiler error)
FAIL: gcc.dg/vmx/gcc-bug-b.c  -Os  (test for excess errors)
FAIL: gcc.dg/vmx/gcc-bug-c.c  -O0  (internal compiler error)
FAIL: gcc.dg/vmx/gcc-bug-c.c  -O0  (test for excess errors)
FAIL: gcc.dg/vmx/gcc-bug-c.c  -O1  (internal compiler error)
FAIL: gcc.dg/vmx/gcc-bug-c.c  -O1  (test for excess errors)
FAIL: gcc.dg/vmx/gcc-bug-c.c  -O2  (internal compiler error)
FAIL: gcc.dg/vmx/gcc-bug-c.c  -O2  (test for excess errors)
FAIL: gcc.dg/vmx/gcc-bug-c.c  -O3 -fomit-frame-pointer  (internal compiler error)
FAIL: gcc.dg/vmx/gcc-bug-c.c  -O3 -fomit-frame-pointer  (test for excess errors)
FAIL: gcc.dg/vmx/gcc-bug-c.c  -O3 -g  (internal compiler error)
FAIL: gcc.dg/vmx/gcc-bug-c.c  -O3 -g  (test for excess errors)
FAIL: gcc.dg/vmx/gcc-bug-c.c  -Os  (internal compiler error)
FAIL: gcc.dg/vmx/gcc-bug-c.c  -Os  (test for excess errors)
FAIL: gcc.dg/vmx/gcc-bug-e.c  -O0  (test for excess errors)
UNRESOLVED: gcc.dg/vmx/gcc-bug-e.c  -O0  compilation failed to produce executable
FAIL: gcc.dg/vmx/gcc-bug-e.c  -O1  (test for excess errors)
UNRESOLVED: gcc.dg/vmx/gcc-bug-e.c  -O1  compilation failed to produce executable
FAIL: gcc.dg/vmx/gcc-bug-e.c  -O2  (test for excess errors)
UNRESOLVED: gcc.dg/vmx/gcc-bug-e.c  -O2  compilation failed to produce executable
FAIL: gcc.dg/vmx/gcc-bug-e.c  -O3 -fomit-frame-pointer  (test for excess errors)
UNRESOLVED: gcc.dg/vmx/gcc-bug-e.c  -O3 -fomit-frame-pointer  compilation failed to produce executable
FAIL: gcc.dg/vmx/gcc-bug-e.c  -O3 -g  (test for excess errors)
UNRESOLVED: gcc.dg/vmx/gcc-bug-e.c  -O3 -g  compilation failed to produce executable
FAIL: gcc.dg/vmx/gcc-bug-e.c  -Os  (test for excess errors)
UNRESOLVED: gcc.dg/vmx/gcc-bug-e.c  -Os  compilation failed to produce executable
FAIL: gcc.dg/vmx/gcc-bug-f.c  -O0  (internal compiler error)
FAIL: gcc.dg/vmx/gcc-bug-f.c  -O0  (test for excess errors)
FAIL: gcc.dg/vmx/gcc-bug-f.c  -O1  (internal compiler error)
FAIL: gcc.dg/vmx/gcc-bug-f.c  -O1  (test for excess errors)
FAIL: gcc.dg/vmx/gcc-bug-f.c  -O2  (internal compiler error)
FAIL: gcc.dg/vmx/gcc-bug-f.c  -O2  (test for excess errors)
FAIL: gcc.dg/vmx/gcc-bug-f.c  -O3 -fomit-frame-pointer  (internal compiler error)
FAIL: gcc.dg/vmx/gcc-bug-f.c  -O3 -fomit-frame-pointer  (test for excess errors)
FAIL: gcc.dg/vmx/gcc-bug-f.c  -O3 -g  (internal compiler error)
FAIL: gcc.dg/vmx/gcc-bug-f.c  -O3 -g  (test for excess errors)
FAIL: gcc.dg/vmx/gcc-bug-f.c  -Os  (internal compiler error)
FAIL: gcc.dg/vmx/gcc-bug-f.c  -Os  (test for excess errors)
FAIL: gcc.dg/vmx/gcc-bug-g.c  -O0  (internal compiler error)
FAIL: gcc.dg/vmx/gcc-bug-g.c  -O0  (test for excess errors)
FAIL: gcc.dg/vmx/gcc-bug-g.c  -O1  (internal compiler error)
FAIL: gcc.dg/vmx/gcc-bug-g.c  -O1  (test for excess errors)
FAIL: gcc.dg/vmx/gcc-bug-g.c  -O2  (internal compiler error)
FAIL: gcc.dg/vmx/gcc-bug-g.c  -O2  (test for excess errors)
FAIL: gcc.dg/vmx/gcc-bug-g.c  -O3 -fomit-frame-pointer  (internal compiler error)
FAIL: gcc.dg/vmx/gcc-bug-g.c  -O3 -fomit-frame-pointer  (test for excess errors)
FAIL: gcc.dg/vmx/gcc-bug-g.c  -O3 -g  (internal compiler error)
FAIL: gcc.dg/vmx/gcc-bug-g.c  -O3 -g  (test for excess errors)
FAIL: gcc.dg/vmx/gcc-bug-g.c  -Os  (internal compiler error)
FAIL: gcc.dg/vmx/gcc-bug-g.c  -Os  (test for excess errors)
FAIL: gcc.dg/vmx/ira1.c  -O0  (test for excess errors)
UNRESOLVED: gcc.dg/vmx/ira1.c  -O0  compilation failed to produce executable
FAIL: gcc.dg/vmx/ira1.c  -O1  (test for excess errors)
UNRESOLVED: gcc.dg/vmx/ira1.c  -O1  compilation failed to produce executable
FAIL: gcc.dg/vmx/ira1.c  -O2  (test for excess errors)
UNRESOLVED: gcc.dg/vmx/ira1.c  -O2  compilation failed to produce executable
FAIL: gcc.dg/vmx/ira1.c  -O3 -fomit-frame-pointer  (test for excess errors)
UNRESOLVED: gcc.dg/vmx/ira1.c  -O3 -fomit-frame-pointer  compilation failed to produce executable
FAIL: gcc.dg/vmx/ira1.c  -O3 -g  (test for excess errors)
UNRESOLVED: gcc.dg/vmx/ira1.c  -O3 -g  compilation failed to produce executable
FAIL: gcc.dg/vmx/ira1.c  -Os  (test for excess errors)
UNRESOLVED: gcc.dg/vmx/ira1.c  -Os  compilation failed to produce executable
FAIL: gcc.dg/vmx/ira2.c  -O0  (internal compiler error)
FAIL: gcc.dg/vmx/ira2.c  -O0  (test for excess errors)
FAIL: gcc.dg/vmx/ira2.c  -O1  (internal compiler error)
FAIL: gcc.dg/vmx/ira2.c  -O1  (test for excess errors)
FAIL: gcc.dg/vmx/ira2.c  -O2  (internal compiler error)
FAIL: gcc.dg/vmx/ira2.c  -O2  (test for excess errors)
FAIL: gcc.dg/vmx/ira2.c  -O3 -fomit-frame-pointer  (internal compiler error)
FAIL: gcc.dg/vmx/ira2.c  -O3 -fomit-frame-pointer  (test for excess errors)
FAIL: gcc.dg/vmx/ira2.c  -O3 -g  (internal compiler error)
FAIL: gcc.dg/vmx/ira2.c  -O3 -g  (test for excess errors)
FAIL: gcc.dg/vmx/ira2.c  -Os  (internal compiler error)
FAIL: gcc.dg/vmx/ira2.c  -Os  (test for excess errors)
FAIL: gcc.dg/vmx/ira2a.c  -O0  (test for excess errors)
UNRESOLVED: gcc.dg/vmx/ira2a.c  -O0  compilation failed to produce executable
FAIL: gcc.dg/vmx/ira2a.c  -O1  (test for excess errors)
UNRESOLVED: gcc.dg/vmx/ira2a.c  -O1  compilation failed to produce executable
FAIL: gcc.dg/vmx/ira2a.c  -O2  (test for excess errors)
UNRESOLVED: gcc.dg/vmx/ira2a.c  -O2  compilation failed to produce executable
FAIL: gcc.dg/vmx/ira2a.c  -O3 -fomit-frame-pointer  (test for excess errors)
UNRESOLVED: gcc.dg/vmx/ira2a.c  -O3 -fomit-frame-pointer  compilation failed to produce executable
FAIL: gcc.dg/vmx/ira2a.c  -O3 -g  (test for excess errors)
UNRESOLVED: gcc.dg/vmx/ira2a.c  -O3 -g  compilation failed to produce executable
FAIL: gcc.dg/vmx/ira2a.c  -Os  (test for excess errors)
UNRESOLVED: gcc.dg/vmx/ira2a.c  -Os  compilation failed to produce executable
FAIL: gcc.dg/vmx/ira2b.c  -O0  (internal compiler error)
FAIL: gcc.dg/vmx/ira2b.c  -O0  (test for excess errors)
UNRESOLVED: gcc.dg/vmx/ira2b.c  -O0  compilation failed to produce executable
FAIL: gcc.dg/vmx/ira2b.c  -O1  (internal compiler error)
FAIL: gcc.dg/vmx/ira2b.c  -O1  (test for excess errors)
UNRESOLVED: gcc.dg/vmx/ira2b.c  -O1  compilation failed to produce executable
FAIL: gcc.dg/vmx/ira2b.c  -O2  (internal compiler error)
FAIL: gcc.dg/vmx/ira2b.c  -O2  (test for excess errors)
UNRESOLVED: gcc.dg/vmx/ira2b.c  -O2  compilation failed to produce executable
FAIL: gcc.dg/vmx/ira2b.c  -O3 -fomit-frame-pointer  (internal compiler error)
FAIL: gcc.dg/vmx/ira2b.c  -O3 -fomit-frame-pointer  (test for excess errors)
UNRESOLVED: gcc.dg/vmx/ira2b.c  -O3 -fomit-frame-pointer  compilation failed to produce executable
FAIL: gcc.dg/vmx/ira2b.c  -O3 -g  (internal compiler error)
FAIL: gcc.dg/vmx/ira2b.c  -O3 -g  (test for excess errors)
UNRESOLVED: gcc.dg/vmx/ira2b.c  -O3 -g  compilation failed to produce executable
FAIL: gcc.dg/vmx/ira2b.c  -Os  (internal compiler error)
FAIL: gcc.dg/vmx/ira2b.c  -Os  (test for excess errors)
UNRESOLVED: gcc.dg/vmx/ira2b.c  -Os  compilation failed to produce executable
FAIL: gcc.dg/vmx/mem.c  -O0  (internal compiler error)
FAIL: gcc.dg/vmx/mem.c  -O0  (test for excess errors)
FAIL: gcc.dg/vmx/mem.c  -O1  (internal compiler error)
FAIL: gcc.dg/vmx/mem.c  -O1  (test for excess errors)
FAIL: gcc.dg/vmx/mem.c  -O2  (internal compiler error)
FAIL: gcc.dg/vmx/mem.c  -O2  (test for excess errors)
FAIL: gcc.dg/vmx/mem.c  -O3 -fomit-frame-pointer  (internal compiler error)
FAIL: gcc.dg/vmx/mem.c  -O3 -fomit-frame-pointer  (test for excess errors)
FAIL: gcc.dg/vmx/mem.c  -O3 -fomit-frame-pointer -funroll-loops  (internal compiler error)
FAIL: gcc.dg/vmx/mem.c  -O3 -fomit-frame-pointer -funroll-loops  (test for excess errors)
FAIL: gcc.dg/vmx/mem.c  -O3 -fomit-frame-pointer -funroll-all-loops -finline-functions  (internal compiler error)
FAIL: gcc.dg/vmx/mem.c  -O3 -fomit-frame-pointer -funroll-all-loops -finline-functions  (test for excess errors)
FAIL: gcc.dg/vmx/mem.c  -O3 -g  (internal compiler error)
FAIL: gcc.dg/vmx/mem.c  -O3 -g  (test for excess errors)
FAIL: gcc.dg/vmx/mem.c  -Os  (internal compiler error)
FAIL: gcc.dg/vmx/mem.c  -Os  (test for excess errors)
FAIL: gcc.dg/vmx/newton-1.c  -O0  (internal compiler error)
FAIL: gcc.dg/vmx/newton-1.c  -O0  (test for excess errors)
FAIL: gcc.dg/vmx/newton-1.c  -O1  (internal compiler error)
FAIL: gcc.dg/vmx/newton-1.c  -O1  (test for excess errors)
FAIL: gcc.dg/vmx/newton-1.c  -O2  (internal compiler error)
FAIL: gcc.dg/vmx/newton-1.c  -O2  (test for excess errors)
FAIL: gcc.dg/vmx/newton-1.c  -O3 -fomit-frame-pointer  (internal compiler error)
FAIL: gcc.dg/vmx/newton-1.c  -O3 -fomit-frame-pointer  (test for excess errors)
FAIL: gcc.dg/vmx/newton-1.c  -O3 -fomit-frame-pointer -funroll-loops  (internal compiler error)
FAIL: gcc.dg/vmx/newton-1.c  -O3 -fomit-frame-pointer -funroll-loops  (test for excess errors)
FAIL: gcc.dg/vmx/newton-1.c  -O3 -fomit-frame-pointer -funroll-all-loops -finline-functions  (internal compiler error)
FAIL: gcc.dg/vmx/newton-1.c  -O3 -fomit-frame-pointer -funroll-all-loops -finline-functions  (test for excess errors)
FAIL: gcc.dg/vmx/newton-1.c  -O3 -g  (internal compiler error)
FAIL: gcc.dg/vmx/newton-1.c  -O3 -g  (test for excess errors)
FAIL: gcc.dg/vmx/newton-1.c  -Os  (internal compiler error)
FAIL: gcc.dg/vmx/newton-1.c  -Os  (test for excess errors)
FAIL: gcc.dg/vmx/ops-long-1.c  -O0  (test for excess errors)
FAIL: gcc.dg/vmx/ops-long-1.c  -O1  (test for excess errors)
FAIL: gcc.dg/vmx/ops-long-1.c  -O2  (test for excess errors)
FAIL: gcc.dg/vmx/ops-long-1.c  -O3 -fomit-frame-pointer  (test for excess errors)
FAIL: gcc.dg/vmx/ops-long-1.c  -O3 -g  (test for excess errors)
FAIL: gcc.dg/vmx/ops-long-1.c  -Os  (test for excess errors)
FAIL: gcc.dg/vmx/ops-long-2.c  -O0   (test for errors, line 20)
FAIL: gcc.dg/vmx/ops-long-2.c  -O0   (test for errors, line 21)
FAIL: gcc.dg/vmx/ops-long-2.c  -O0   (test for errors, line 24)
FAIL: gcc.dg/vmx/ops-long-2.c  -O0   (test for errors, line 25)
FAIL: gcc.dg/vmx/ops-long-2.c  -O0   (test for errors, line 26)
FAIL: gcc.dg/vmx/ops-long-2.c  -O0   (test for errors, line 27)
FAIL: gcc.dg/vmx/ops-long-2.c  -O0   (test for errors, line 28)
FAIL: gcc.dg/vmx/ops-long-2.c  -O0   (test for errors, line 29)
FAIL: gcc.dg/vmx/ops-long-2.c  -O0   (test for errors, line 30)
FAIL: gcc.dg/vmx/ops-long-2.c  -O0   (test for errors, line 31)
FAIL: gcc.dg/vmx/ops-long-2.c  -O0   (test for errors, line 32)
FAIL: gcc.dg/vmx/ops-long-2.c  -O0   (test for errors, line 33)
FAIL: gcc.dg/vmx/ops-long-2.c  -O0  (test for excess errors)
FAIL: gcc.dg/vmx/ops-long-2.c  -O1   (test for errors, line 20)
FAIL: gcc.dg/vmx/ops-long-2.c  -O1   (test for errors, line 21)
FAIL: gcc.dg/vmx/ops-long-2.c  -O1   (test for errors, line 24)
FAIL: gcc.dg/vmx/ops-long-2.c  -O1   (test for errors, line 25)
FAIL: gcc.dg/vmx/ops-long-2.c  -O1   (test for errors, line 26)
FAIL: gcc.dg/vmx/ops-long-2.c  -O1   (test for errors, line 27)
FAIL: gcc.dg/vmx/ops-long-2.c  -O1   (test for errors, line 28)
FAIL: gcc.dg/vmx/ops-long-2.c  -O1   (test for errors, line 29)
FAIL: gcc.dg/vmx/ops-long-2.c  -O1   (test for errors, line 30)
FAIL: gcc.dg/vmx/ops-long-2.c  -O1   (test for errors, line 31)
FAIL: gcc.dg/vmx/ops-long-2.c  -O1   (test for errors, line 32)
FAIL: gcc.dg/vmx/ops-long-2.c  -O1   (test for errors, line 33)
FAIL: gcc.dg/vmx/ops-long-2.c  -O1  (test for excess errors)
FAIL: gcc.dg/vmx/ops-long-2.c  -O2   (test for errors, line 20)
FAIL: gcc.dg/vmx/ops-long-2.c  -O2   (test for errors, line 21)
FAIL: gcc.dg/vmx/ops-long-2.c  -O2   (test for errors, line 24)
FAIL: gcc.dg/vmx/ops-long-2.c  -O2   (test for errors, line 25)
FAIL: gcc.dg/vmx/ops-long-2.c  -O2   (test for errors, line 26)
FAIL: gcc.dg/vmx/ops-long-2.c  -O2   (test for errors, line 27)
FAIL: gcc.dg/vmx/ops-long-2.c  -O2   (test for errors, line 28)
FAIL: gcc.dg/vmx/ops-long-2.c  -O2   (test for errors, line 29)
FAIL: gcc.dg/vmx/ops-long-2.c  -O2   (test for errors, line 30)
FAIL: gcc.dg/vmx/ops-long-2.c  -O2   (test for errors, line 31)
FAIL: gcc.dg/vmx/ops-long-2.c  -O2   (test for errors, line 32)
FAIL: gcc.dg/vmx/ops-long-2.c  -O2   (test for errors, line 33)
FAIL: gcc.dg/vmx/ops-long-2.c  -O2  (test for excess errors)
FAIL: gcc.dg/vmx/ops-long-2.c  -O3 -fomit-frame-pointer   (test for errors, line 20)
FAIL: gcc.dg/vmx/ops-long-2.c  -O3 -fomit-frame-pointer   (test for errors, line 21)
FAIL: gcc.dg/vmx/ops-long-2.c  -O3 -fomit-frame-pointer   (test for errors, line 24)
FAIL: gcc.dg/vmx/ops-long-2.c  -O3 -fomit-frame-pointer   (test for errors, line 25)
FAIL: gcc.dg/vmx/ops-long-2.c  -O3 -fomit-frame-pointer   (test for errors, line 26)
FAIL: gcc.dg/vmx/ops-long-2.c  -O3 -fomit-frame-pointer   (test for errors, line 27)
FAIL: gcc.dg/vmx/ops-long-2.c  -O3 -fomit-frame-pointer   (test for errors, line 28)
FAIL: gcc.dg/vmx/ops-long-2.c  -O3 -fomit-frame-pointer   (test for errors, line 29)
FAIL: gcc.dg/vmx/ops-long-2.c  -O3 -fomit-frame-pointer   (test for errors, line 30)
FAIL: gcc.dg/vmx/ops-long-2.c  -O3 -fomit-frame-pointer   (test for errors, line 31)
FAIL: gcc.dg/vmx/ops-long-2.c  -O3 -fomit-frame-pointer   (test for errors, line 32)
FAIL: gcc.dg/vmx/ops-long-2.c  -O3 -fomit-frame-pointer   (test for errors, line 33)
FAIL: gcc.dg/vmx/ops-long-2.c  -O3 -fomit-frame-pointer  (test for excess errors)
FAIL: gcc.dg/vmx/ops-long-2.c  -O3 -g   (test for errors, line 20)
FAIL: gcc.dg/vmx/ops-long-2.c  -O3 -g   (test for errors, line 21)
FAIL: gcc.dg/vmx/ops-long-2.c  -O3 -g   (test for errors, line 24)
FAIL: gcc.dg/vmx/ops-long-2.c  -O3 -g   (test for errors, line 25)
FAIL: gcc.dg/vmx/ops-long-2.c  -O3 -g   (test for errors, line 26)
FAIL: gcc.dg/vmx/ops-long-2.c  -O3 -g   (test for errors, line 27)
FAIL: gcc.dg/vmx/ops-long-2.c  -O3 -g   (test for errors, line 28)
FAIL: gcc.dg/vmx/ops-long-2.c  -O3 -g   (test for errors, line 29)
FAIL: gcc.dg/vmx/ops-long-2.c  -O3 -g   (test for errors, line 30)
FAIL: gcc.dg/vmx/ops-long-2.c  -O3 -g   (test for errors, line 31)
FAIL: gcc.dg/vmx/ops-long-2.c  -O3 -g   (test for errors, line 32)
FAIL: gcc.dg/vmx/ops-long-2.c  -O3 -g   (test for errors, line 33)
FAIL: gcc.dg/vmx/ops-long-2.c  -O3 -g  (test for excess errors)
FAIL: gcc.dg/vmx/ops-long-2.c  -Os   (test for errors, line 20)
FAIL: gcc.dg/vmx/ops-long-2.c  -Os   (test for errors, line 21)
FAIL: gcc.dg/vmx/ops-long-2.c  -Os   (test for errors, line 24)
FAIL: gcc.dg/vmx/ops-long-2.c  -Os   (test for errors, line 25)
FAIL: gcc.dg/vmx/ops-long-2.c  -Os   (test for errors, line 26)
FAIL: gcc.dg/vmx/ops-long-2.c  -Os   (test for errors, line 27)
FAIL: gcc.dg/vmx/ops-long-2.c  -Os   (test for errors, line 28)
FAIL: gcc.dg/vmx/ops-long-2.c  -Os   (test for errors, line 29)
FAIL: gcc.dg/vmx/ops-long-2.c  -Os   (test for errors, line 30)
FAIL: gcc.dg/vmx/ops-long-2.c  -Os   (test for errors, line 31)
FAIL: gcc.dg/vmx/ops-long-2.c  -Os   (test for errors, line 32)
FAIL: gcc.dg/vmx/ops-long-2.c  -Os   (test for errors, line 33)
FAIL: gcc.dg/vmx/ops-long-2.c  -Os  (test for excess errors)
FAIL: gcc.dg/vmx/ops.c  -O0  (test for excess errors)
FAIL: gcc.dg/vmx/ops.c  -O1  (test for excess errors)
FAIL: gcc.dg/vmx/ops.c  -O2  (test for excess errors)
FAIL: gcc.dg/vmx/ops.c  -O3 -fomit-frame-pointer  (test for excess errors)
FAIL: gcc.dg/vmx/ops.c  -O3 -g  (test for excess errors)
FAIL: gcc.dg/vmx/ops.c  -Os  (test for excess errors)
FAIL: gcc.dg/vmx/pr27842.c  -O0  (internal compiler error)
FAIL: gcc.dg/vmx/pr27842.c  -O0  (test for excess errors)
UNRESOLVED: gcc.dg/vmx/pr27842.c  -O0  compilation failed to produce executable
FAIL: gcc.dg/vmx/pr27842.c  -O1  (internal compiler error)
FAIL: gcc.dg/vmx/pr27842.c  -O1  (test for excess errors)
UNRESOLVED: gcc.dg/vmx/pr27842.c  -O1  compilation failed to produce executable
FAIL: gcc.dg/vmx/pr27842.c  -O2  (internal compiler error)
FAIL: gcc.dg/vmx/pr27842.c  -O2  (test for excess errors)
UNRESOLVED: gcc.dg/vmx/pr27842.c  -O2  compilation failed to produce executable
FAIL: gcc.dg/vmx/pr27842.c  -O3 -fomit-frame-pointer  (internal compiler error)
FAIL: gcc.dg/vmx/pr27842.c  -O3 -fomit-frame-pointer  (test for excess errors)
UNRESOLVED: gcc.dg/vmx/pr27842.c  -O3 -fomit-frame-pointer  compilation failed to produce executable
FAIL: gcc.dg/vmx/pr27842.c  -O3 -fomit-frame-pointer -funroll-loops  (internal compiler error)
FAIL: gcc.dg/vmx/pr27842.c  -O3 -fomit-frame-pointer -funroll-loops  (test for excess errors)
UNRESOLVED: gcc.dg/vmx/pr27842.c  -O3 -fomit-frame-pointer -funroll-loops  compilation failed to produce executable
FAIL: gcc.dg/vmx/pr27842.c  -O3 -fomit-frame-pointer -funroll-all-loops -finline-functions  (internal compiler error)
FAIL: gcc.dg/vmx/pr27842.c  -O3 -fomit-frame-pointer -funroll-all-loops -finline-functions  (test for excess errors)
UNRESOLVED: gcc.dg/vmx/pr27842.c  -O3 -fomit-frame-pointer -funroll-all-loops -finline-functions  compilation failed to produce executable
FAIL: gcc.dg/vmx/pr27842.c  -O3 -g  (internal compiler error)
FAIL: gcc.dg/vmx/pr27842.c  -O3 -g  (test for excess errors)
UNRESOLVED: gcc.dg/vmx/pr27842.c  -O3 -g  compilation failed to produce executable
FAIL: gcc.dg/vmx/pr27842.c  -Os  (internal compiler error)
FAIL: gcc.dg/vmx/pr27842.c  -Os  (test for excess errors)
UNRESOLVED: gcc.dg/vmx/pr27842.c  -Os  compilation failed to produce executable
FAIL: gcc.dg/vmx/sn7153.c  -O0  (internal compiler error)
FAIL: gcc.dg/vmx/sn7153.c  -O0  (test for excess errors)
UNRESOLVED: gcc.dg/vmx/sn7153.c  -O0  compilation failed to produce executable
FAIL: gcc.dg/vmx/sn7153.c  -O1  (internal compiler error)
FAIL: gcc.dg/vmx/sn7153.c  -O1  (test for excess errors)
UNRESOLVED: gcc.dg/vmx/sn7153.c  -O1  compilation failed to produce executable
FAIL: gcc.dg/vmx/sn7153.c  -O2  (internal compiler error)
FAIL: gcc.dg/vmx/sn7153.c  -O2  (test for excess errors)
UNRESOLVED: gcc.dg/vmx/sn7153.c  -O2  compilation failed to produce executable
FAIL: gcc.dg/vmx/sn7153.c  -O3 -fomit-frame-pointer  (internal compiler error)
FAIL: gcc.dg/vmx/sn7153.c  -O3 -fomit-frame-pointer  (test for excess errors)
UNRESOLVED: gcc.dg/vmx/sn7153.c  -O3 -fomit-frame-pointer  compilation failed to produce executable
FAIL: gcc.dg/vmx/sn7153.c  -O3 -fomit-frame-pointer -funroll-loops  (internal compiler error)
FAIL: gcc.dg/vmx/sn7153.c  -O3 -fomit-frame-pointer -funroll-loops  (test for excess errors)
UNRESOLVED: gcc.dg/vmx/sn7153.c  -O3 -fomit-frame-pointer -funroll-loops  compilation failed to produce executable
FAIL: gcc.dg/vmx/sn7153.c  -O3 -fomit-frame-pointer -funroll-all-loops -finline-functions  (internal compiler error)
FAIL: gcc.dg/vmx/sn7153.c  -O3 -fomit-frame-pointer -funroll-all-loops -finline-functions  (test for excess errors)
UNRESOLVED: gcc.dg/vmx/sn7153.c  -O3 -fomit-frame-pointer -funroll-all-loops -finline-functions  compilation failed to produce executable
FAIL: gcc.dg/vmx/sn7153.c  -O3 -g  (internal compiler error)
FAIL: gcc.dg/vmx/sn7153.c  -O3 -g  (test for excess errors)
UNRESOLVED: gcc.dg/vmx/sn7153.c  -O3 -g  compilation failed to produce executable
FAIL: gcc.dg/vmx/sn7153.c  -Os  (internal compiler error)
FAIL: gcc.dg/vmx/sn7153.c  -Os  (test for excess errors)
UNRESOLVED: gcc.dg/vmx/sn7153.c  -Os  compilation failed to produce executable
FAIL: gcc.dg/vmx/varargs-2.c  -O0  (test for excess errors)
UNRESOLVED: gcc.dg/vmx/varargs-2.c  -O0  compilation failed to produce executable
FAIL: gcc.dg/vmx/varargs-2.c  -O1  (test for excess errors)
UNRESOLVED: gcc.dg/vmx/varargs-2.c  -O1  compilation failed to produce executable
FAIL: gcc.dg/vmx/varargs-2.c  -O2  (test for excess errors)
UNRESOLVED: gcc.dg/vmx/varargs-2.c  -O2  compilation failed to produce executable
FAIL: gcc.dg/vmx/varargs-2.c  -O3 -fomit-frame-pointer  (test for excess errors)
UNRESOLVED: gcc.dg/vmx/varargs-2.c  -O3 -fomit-frame-pointer  compilation failed to produce executable
FAIL: gcc.dg/vmx/varargs-2.c  -O3 -g  (test for excess errors)
UNRESOLVED: gcc.dg/vmx/varargs-2.c  -O3 -g  compilation failed to produce executable
FAIL: gcc.dg/vmx/varargs-2.c  -Os  (test for excess errors)
UNRESOLVED: gcc.dg/vmx/varargs-2.c  -Os  compilation failed to produce executable
FAIL: gcc.dg/vmx/varargs-3.c  -O0  (test for excess errors)
UNRESOLVED: gcc.dg/vmx/varargs-3.c  -O0  compilation failed to produce executable
FAIL: gcc.dg/vmx/varargs-3.c  -O1  (test for excess errors)
UNRESOLVED: gcc.dg/vmx/varargs-3.c  -O1  compilation failed to produce executable
FAIL: gcc.dg/vmx/varargs-3.c  -O2  (test for excess errors)
UNRESOLVED: gcc.dg/vmx/varargs-3.c  -O2  compilation failed to produce executable
FAIL: gcc.dg/vmx/varargs-3.c  -O3 -fomit-frame-pointer  (test for excess errors)
UNRESOLVED: gcc.dg/vmx/varargs-3.c  -O3 -fomit-frame-pointer  compilation failed to produce executable
FAIL: gcc.dg/vmx/varargs-3.c  -O3 -g  (test for excess errors)
UNRESOLVED: gcc.dg/vmx/varargs-3.c  -O3 -g  compilation failed to produce executable
FAIL: gcc.dg/vmx/varargs-3.c  -Os  (test for excess errors)
UNRESOLVED: gcc.dg/vmx/varargs-3.c  -Os  compilation failed to produce executable
FAIL: gcc.dg/vmx/varargs-4.c  -O0  (test for excess errors)
UNRESOLVED: gcc.dg/vmx/varargs-4.c  -O0  compilation failed to produce executable
FAIL: gcc.dg/vmx/varargs-4.c  -O1  (test for excess errors)
UNRESOLVED: gcc.dg/vmx/varargs-4.c  -O1  compilation failed to produce executable
FAIL: gcc.dg/vmx/varargs-4.c  -O2  (test for excess errors)
UNRESOLVED: gcc.dg/vmx/varargs-4.c  -O2  compilation failed to produce executable
FAIL: gcc.dg/vmx/varargs-4.c  -O3 -fomit-frame-pointer  (test for excess errors)
UNRESOLVED: gcc.dg/vmx/varargs-4.c  -O3 -fomit-frame-pointer  compilation failed to produce executable
FAIL: gcc.dg/vmx/varargs-4.c  -O3 -fomit-frame-pointer -funroll-loops  (test for excess errors)
UNRESOLVED: gcc.dg/vmx/varargs-4.c  -O3 -fomit-frame-pointer -funroll-loops  compilation failed to produce executable
FAIL: gcc.dg/vmx/varargs-4.c  -O3 -fomit-frame-pointer -funroll-all-loops -finline-functions  (test for excess errors)
UNRESOLVED: gcc.dg/vmx/varargs-4.c  -O3 -fomit-frame-pointer -funroll-all-loops -finline-functions  compilation failed to produce executable
FAIL: gcc.dg/vmx/varargs-4.c  -O3 -g  (test for excess errors)
UNRESOLVED: gcc.dg/vmx/varargs-4.c  -O3 -g  compilation failed to produce executable
FAIL: gcc.dg/vmx/varargs-4.c  -Os  (test for excess errors)
UNRESOLVED: gcc.dg/vmx/varargs-4.c  -Os  compilation failed to produce executable
FAIL: gcc.dg/vmx/varargs-5.c  -O0  (test for excess errors)
UNRESOLVED: gcc.dg/vmx/varargs-5.c  -O0  compilation failed to produce executable
FAIL: gcc.dg/vmx/varargs-5.c  -O1  (test for excess errors)
UNRESOLVED: gcc.dg/vmx/varargs-5.c  -O1  compilation failed to produce executable
FAIL: gcc.dg/vmx/varargs-5.c  -O2  (test for excess errors)
UNRESOLVED: gcc.dg/vmx/varargs-5.c  -O2  compilation failed to produce executable
FAIL: gcc.dg/vmx/varargs-5.c  -O3 -fomit-frame-pointer  (test for excess errors)
UNRESOLVED: gcc.dg/vmx/varargs-5.c  -O3 -fomit-frame-pointer  compilation failed to produce executable
FAIL: gcc.dg/vmx/varargs-5.c  -O3 -g  (test for excess errors)
UNRESOLVED: gcc.dg/vmx/varargs-5.c  -O3 -g  compilation failed to produce executable
FAIL: gcc.dg/vmx/varargs-5.c  -Os  (test for excess errors)
UNRESOLVED: gcc.dg/vmx/varargs-5.c  -Os  compilation failed to produce executable
FAIL: gcc.dg/vmx/varargs-6.c  -O0  (test for excess errors)
UNRESOLVED: gcc.dg/vmx/varargs-6.c  -O0  compilation failed to produce executable
FAIL: gcc.dg/vmx/varargs-6.c  -O1  (test for excess errors)
UNRESOLVED: gcc.dg/vmx/varargs-6.c  -O1  compilation failed to produce executable
FAIL: gcc.dg/vmx/varargs-6.c  -O2  (test for excess errors)
UNRESOLVED: gcc.dg/vmx/varargs-6.c  -O2  compilation failed to produce executable
FAIL: gcc.dg/vmx/varargs-6.c  -O3 -fomit-frame-pointer  (test for excess errors)
UNRESOLVED: gcc.dg/vmx/varargs-6.c  -O3 -fomit-frame-pointer  compilation failed to produce executable
FAIL: gcc.dg/vmx/varargs-6.c  -O3 -g  (test for excess errors)
UNRESOLVED: gcc.dg/vmx/varargs-6.c  -O3 -g  compilation failed to produce executable
FAIL: gcc.dg/vmx/varargs-6.c  -Os  (test for excess errors)
UNRESOLVED: gcc.dg/vmx/varargs-6.c  -Os  compilation failed to produce executable
FAIL: gcc.dg/vmx/varargs-7.c  -O0  (test for excess errors)
UNRESOLVED: gcc.dg/vmx/varargs-7.c  -O0  compilation failed to produce executable
FAIL: gcc.dg/vmx/varargs-7.c  -O1  (test for excess errors)
UNRESOLVED: gcc.dg/vmx/varargs-7.c  -O1  compilation failed to produce executable
FAIL: gcc.dg/vmx/varargs-7.c  -O2  (test for excess errors)
UNRESOLVED: gcc.dg/vmx/varargs-7.c  -O2  compilation failed to produce executable
FAIL: gcc.dg/vmx/varargs-7.c  -O3 -fomit-frame-pointer  (test for excess errors)
UNRESOLVED: gcc.dg/vmx/varargs-7.c  -O3 -fomit-frame-pointer  compilation failed to produce executable
FAIL: gcc.dg/vmx/varargs-7.c  -O3 -g  (test for excess errors)
UNRESOLVED: gcc.dg/vmx/varargs-7.c  -O3 -g  compilation failed to produce executable
FAIL: gcc.dg/vmx/varargs-7.c  -Os  (test for excess errors)
UNRESOLVED: gcc.dg/vmx/varargs-7.c  -Os  compilation failed to produce executable
FAIL: gcc.dg/vmx/x-04.c  -O0  (internal compiler error)
FAIL: gcc.dg/vmx/x-04.c  -O0  (test for excess errors)
UNRESOLVED: gcc.dg/vmx/x-04.c  -O0  compilation failed to produce executable
FAIL: gcc.dg/vmx/x-04.c  -O1  (internal compiler error)
FAIL: gcc.dg/vmx/x-04.c  -O1  (test for excess errors)
UNRESOLVED: gcc.dg/vmx/x-04.c  -O1  compilation failed to produce executable
FAIL: gcc.dg/vmx/x-04.c  -O2  (internal compiler error)
FAIL: gcc.dg/vmx/x-04.c  -O2  (test for excess errors)
UNRESOLVED: gcc.dg/vmx/x-04.c  -O2  compilation failed to produce executable
FAIL: gcc.dg/vmx/x-04.c  -O3 -fomit-frame-pointer  (internal compiler error)
FAIL: gcc.dg/vmx/x-04.c  -O3 -fomit-frame-pointer  (test for excess errors)
UNRESOLVED: gcc.dg/vmx/x-04.c  -O3 -fomit-frame-pointer  compilation failed to produce executable
FAIL: gcc.dg/vmx/x-04.c  -O3 -g  (internal compiler error)
FAIL: gcc.dg/vmx/x-04.c  -O3 -g  (test for excess errors)
UNRESOLVED: gcc.dg/vmx/x-04.c  -O3 -g  compilation failed to produce executable
FAIL: gcc.dg/vmx/x-04.c  -Os  (internal compiler error)
FAIL: gcc.dg/vmx/x-04.c  -Os  (test for excess errors)
UNRESOLVED: gcc.dg/vmx/x-04.c  -Os  compilation failed to produce executable
FAIL: gcc.dg/vmx/x-05.c  -O0  (internal compiler error)
FAIL: gcc.dg/vmx/x-05.c  -O0  (test for excess errors)
UNRESOLVED: gcc.dg/vmx/x-05.c  -O0  compilation failed to produce executable
FAIL: gcc.dg/vmx/x-05.c  -O1  (internal compiler error)
FAIL: gcc.dg/vmx/x-05.c  -O1  (test for excess errors)
UNRESOLVED: gcc.dg/vmx/x-05.c  -O1  compilation failed to produce executable
FAIL: gcc.dg/vmx/x-05.c  -O2  (internal compiler error)
FAIL: gcc.dg/vmx/x-05.c  -O2  (test for excess errors)
UNRESOLVED: gcc.dg/vmx/x-05.c  -O2  compilation failed to produce executable
FAIL: gcc.dg/vmx/x-05.c  -O3 -fomit-frame-pointer  (internal compiler error)
FAIL: gcc.dg/vmx/x-05.c  -O3 -fomit-frame-pointer  (test for excess errors)
UNRESOLVED: gcc.dg/vmx/x-05.c  -O3 -fomit-frame-pointer  compilation failed to produce executable
FAIL: gcc.dg/vmx/x-05.c  -O3 -g  (internal compiler error)
FAIL: gcc.dg/vmx/x-05.c  -O3 -g  (test for excess errors)
UNRESOLVED: gcc.dg/vmx/x-05.c  -O3 -g  compilation failed to produce executable
FAIL: gcc.dg/vmx/x-05.c  -Os  (internal compiler error)
FAIL: gcc.dg/vmx/x-05.c  -Os  (test for excess errors)
UNRESOLVED: gcc.dg/vmx/x-05.c  -Os  compilation failed to produce executable
FAIL: gcc.dg/vmx/yousufi-1.c  -O0  (internal compiler error)
FAIL: gcc.dg/vmx/yousufi-1.c  -O0  (test for excess errors)
UNRESOLVED: gcc.dg/vmx/yousufi-1.c  -O0  compilation failed to produce executable
FAIL: gcc.dg/vmx/yousufi-1.c  -O1  (internal compiler error)
FAIL: gcc.dg/vmx/yousufi-1.c  -O1  (test for excess errors)
UNRESOLVED: gcc.dg/vmx/yousufi-1.c  -O1  compilation failed to produce executable
FAIL: gcc.dg/vmx/yousufi-1.c  -O2  (internal compiler error)
FAIL: gcc.dg/vmx/yousufi-1.c  -O2  (test for excess errors)
UNRESOLVED: gcc.dg/vmx/yousufi-1.c  -O2  compilation failed to produce executable
FAIL: gcc.dg/vmx/yousufi-1.c  -O3 -fomit-frame-pointer  (internal compiler error)
FAIL: gcc.dg/vmx/yousufi-1.c  -O3 -fomit-frame-pointer  (test for excess errors)
UNRESOLVED: gcc.dg/vmx/yousufi-1.c  -O3 -fomit-frame-pointer  compilation failed to produce executable
FAIL: gcc.dg/vmx/yousufi-1.c  -O3 -g  (internal compiler error)
FAIL: gcc.dg/vmx/yousufi-1.c  -O3 -g  (test for excess errors)
UNRESOLVED: gcc.dg/vmx/yousufi-1.c  -O3 -g  compilation failed to produce executable
FAIL: gcc.dg/vmx/yousufi-1.c  -Os  (internal compiler error)
FAIL: gcc.dg/vmx/yousufi-1.c  -Os  (test for excess errors)
UNRESOLVED: gcc.dg/vmx/yousufi-1.c  -Os  compilation failed to produce executable
FAIL: gcc.dg/vmx/zero-1.c  -O0  (internal compiler error)
FAIL: gcc.dg/vmx/zero-1.c  -O0  (test for excess errors)
UNRESOLVED: gcc.dg/vmx/zero-1.c  -O0  compilation failed to produce executable
FAIL: gcc.dg/vmx/zero-1.c  -O1  (internal compiler error)
FAIL: gcc.dg/vmx/zero-1.c  -O1  (test for excess errors)
UNRESOLVED: gcc.dg/vmx/zero-1.c  -O1  compilation failed to produce executable
FAIL: gcc.dg/vmx/zero-1.c  -O2  (internal compiler error)
FAIL: gcc.dg/vmx/zero-1.c  -O2  (test for excess errors)
UNRESOLVED: gcc.dg/vmx/zero-1.c  -O2  compilation failed to produce executable
FAIL: gcc.dg/vmx/zero-1.c  -O3 -fomit-frame-pointer  (internal compiler error)
FAIL: gcc.dg/vmx/zero-1.c  -O3 -fomit-frame-pointer  (test for excess errors)
UNRESOLVED: gcc.dg/vmx/zero-1.c  -O3 -fomit-frame-pointer  compilation failed to produce executable
FAIL: gcc.dg/vmx/zero-1.c  -O3 -g  (internal compiler error)
FAIL: gcc.dg/vmx/zero-1.c  -O3 -g  (test for excess errors)
UNRESOLVED: gcc.dg/vmx/zero-1.c  -O3 -g  compilation failed to produce executable
FAIL: gcc.dg/vmx/zero-1.c  -Os  (internal compiler error)
FAIL: gcc.dg/vmx/zero-1.c  -Os  (test for excess errors)
UNRESOLVED: gcc.dg/vmx/zero-1.c  -Os  compilation failed to produce executable
FAIL: gcc.dg/vmx/zero.c  -O0  (internal compiler error)
FAIL: gcc.dg/vmx/zero.c  -O0  (test for excess errors)
UNRESOLVED: gcc.dg/vmx/zero.c  -O0  compilation failed to produce executable
FAIL: gcc.dg/vmx/zero.c  -O1  (internal compiler error)
FAIL: gcc.dg/vmx/zero.c  -O1  (test for excess errors)
UNRESOLVED: gcc.dg/vmx/zero.c  -O1  compilation failed to produce executable
FAIL: gcc.dg/vmx/zero.c  -O2  (internal compiler error)
FAIL: gcc.dg/vmx/zero.c  -O2  (test for excess errors)
UNRESOLVED: gcc.dg/vmx/zero.c  -O2  compilation failed to produce executable
FAIL: gcc.dg/vmx/zero.c  -O3 -fomit-frame-pointer  (internal compiler error)
FAIL: gcc.dg/vmx/zero.c  -O3 -fomit-frame-pointer  (test for excess errors)
UNRESOLVED: gcc.dg/vmx/zero.c  -O3 -fomit-frame-pointer  compilation failed to produce executable
FAIL: gcc.dg/vmx/zero.c  -O3 -g  (internal compiler error)
FAIL: gcc.dg/vmx/zero.c  -O3 -g  (test for excess errors)
UNRESOLVED: gcc.dg/vmx/zero.c  -O3 -g  compilation failed to produce executable
FAIL: gcc.dg/vmx/zero.c  -Os  (internal compiler error)
FAIL: gcc.dg/vmx/zero.c  -Os  (test for excess errors)
UNRESOLVED: gcc.dg/vmx/zero.c  -Os  compilation failed to produce executable
FAIL: gcc.target/powerpc/altivec-1.c (internal compiler error)
FAIL: gcc.target/powerpc/altivec-1.c (test for excess errors)
FAIL: gcc.target/powerpc/altivec-10.c (internal compiler error)
FAIL: gcc.target/powerpc/altivec-10.c (test for excess errors)
FAIL: gcc.target/powerpc/altivec-12.c (internal compiler error)
FAIL: gcc.target/powerpc/altivec-12.c (test for excess errors)
FAIL: gcc.target/powerpc/altivec-13.c (internal compiler error)
FAIL: gcc.target/powerpc/altivec-13.c (test for excess errors)
FAIL: gcc.target/powerpc/altivec-15.c (test for excess errors)
FAIL: gcc.target/powerpc/altivec-18.c (test for excess errors)
ERROR: gcc.target/powerpc/altivec-18.c: error executing dg-final: couldn't open "altivec-18.s": no such file or directory
UNRESOLVED: gcc.target/powerpc/altivec-18.c: error executing dg-final: couldn't open "altivec-18.s": no such file or directory
FAIL: gcc.target/powerpc/altivec-20.c (internal compiler error)
FAIL: gcc.target/powerpc/altivec-20.c (test for excess errors)
FAIL: gcc.target/powerpc/altivec-22.c (test for excess errors)
ERROR: gcc.target/powerpc/altivec-22.c: error executing dg-final: couldn't open "altivec-22.s": no such file or directory
UNRESOLVED: gcc.target/powerpc/altivec-22.c: error executing dg-final: couldn't open "altivec-22.s": no such file or directory
FAIL: gcc.target/powerpc/altivec-24.c (test for excess errors)
FAIL: gcc.target/powerpc/altivec-3.c (test for excess errors)
FAIL: gcc.target/powerpc/altivec-6.c (internal compiler error)
FAIL: gcc.target/powerpc/altivec-6.c (test for excess errors)
FAIL: gcc.target/powerpc/altivec-7.c (internal compiler error)
FAIL: gcc.target/powerpc/altivec-7.c (test for excess errors)
FAIL: gcc.target/powerpc/altivec-cell-6.c (test for excess errors)
FAIL: gcc.target/powerpc/altivec-cell-7.c (internal compiler error)
FAIL: gcc.target/powerpc/altivec-cell-7.c (test for excess errors)
ERROR: gcc.target/powerpc/altivec-cell-7.c: error executing dg-final: couldn't open "altivec-cell-7.s": no such file or directory
UNRESOLVED: gcc.target/powerpc/altivec-cell-7.c: error executing dg-final: couldn't open "altivec-cell-7.s": no such file or directory
FAIL: gcc.target/powerpc/altivec-cell-8.c (internal compiler error)
FAIL: gcc.target/powerpc/altivec-cell-8.c (test for excess errors)
FAIL: gcc.target/powerpc/altivec-pr22085.c (test for excess errors)
FAIL: gcc.target/powerpc/altivec-vec-merge.c (test for excess errors)
FAIL: gcc.target/powerpc/ppc64-double-1.c scan-assembler-not stfd
FAIL: gcc.target/powerpc/pr16155.c (internal compiler error)
FAIL: gcc.target/powerpc/pr16155.c (test for excess errors)
FAIL: gcc.target/powerpc/pr16286.c (internal compiler error)
FAIL: gcc.target/powerpc/pr16286.c (test for excess errors)
FAIL: gcc.target/powerpc/pr37168.c (internal compiler error)
FAIL: gcc.target/powerpc/pr37168.c (test for excess errors)

		=== gcc Summary ===

# of expected passes		53611
# of unexpected failures	804
# of unexpected successes	3
# of expected failures		141
# of unresolved testcases	300
# of unsupported tests		556
/home/guerby/build/gcc/xgcc  version 4.5.0 20090421 (experimental) [trunk revision 146514] (GCC) 

		=== gnat tests ===


Running target unix

		=== gnat Summary ===

# of expected passes		622
# of expected failures		6
		=== libgomp tests ===


Running target unix

		=== libgomp Summary ===

# of expected passes		260
		=== libmudflap tests ===


Running target unix

		=== libmudflap Summary ===

# of expected passes		1740
# of unsupported tests		2

Compiler version: 4.5.0 20090421 (experimental) [trunk revision 146514] (GCC) 
Platform: powerpc-unknown-linux-gnu
configure flags: --prefix=/n/53/guerby/install-trunk --enable-languages=c,ada --enable-__cxa_atexit --disable-nls --enable-threads=posix --with-mpfr=/opt/cfarm/mpfr-2.3.2 --enable-stage1-checking=release


Index Nav: [Date Index] [Subject Index] [Author Index] [Thread Index]
Message Nav: [Date Prev] [Date Next] [Thread Prev] [Thread Next]