This is the mail archive of the gcc-testresults@gcc.gnu.org mailing list for the GCC project.


Index Nav: [Date Index] [Subject Index] [Author Index] [Thread Index]
Message Nav: [Date Prev] [Date Next] [Thread Prev] [Thread Next]
Other format: [Raw text]

Results for 4.4.0 20080314 (experimental) [trunk revision 133203] (GCC) testsuite on i686-apple-darwin9


LAST_UPDATED: Fri 14 Mar 2008 02:02:13 UTC (revision 133203)

		=== acats tests ===
FAIL:	c43204c

		=== acats Summary ===
# of expected passes		2314
# of unexpected failures	1
Native configuration is i686-apple-darwin9

		=== g++ tests ===


Running target unix
WARNING: Could not compile g++.dg/compat/struct-layout-1 generator
FAIL: g++.dg/ext/visibility/anon6.C scan-assembler 1BIiE1cE
FAIL: g++.dg/other/anon5.C  (test for errors, line 14)
FAIL: g++.dg/other/anon5.C (test for excess errors)
FAIL: g++.dg/pubtypes.C scan-assembler long+[ \\t]+0x24+[ \\t]+[#;]+[ \\t]+Length of Public Type Names Info
FAIL: g++.dg/special/conpr-3.C execution test
FAIL: g++.dg/special/initpri1.C execution test
FAIL: g++.old-deja/g++.pt/const2.C (test for excess errors)

		=== g++ Summary ===

# of expected passes		17261
# of unexpected failures	7
# of expected failures		82
# of unsupported tests		128
/Users/dave/gnu/gcc/objdir/gcc/testsuite/g++/../../g++  version 4.4.0 20080314 (experimental) [trunk revision 133203] (GCC) 

		=== gcc tests ===


Running target unix
FAIL: gcc.c-torture/compile/pr11832.c  -O0  (internal compiler error)
FAIL: gcc.c-torture/compile/pr11832.c  -O0  (test for excess errors)
FAIL: gcc.c-torture/compile/pr11832.c  -O1  (internal compiler error)
FAIL: gcc.c-torture/compile/pr11832.c  -O1  (test for excess errors)
FAIL: gcc.c-torture/compile/pr11832.c  -O2  (internal compiler error)
FAIL: gcc.c-torture/compile/pr11832.c  -O2  (test for excess errors)
FAIL: gcc.c-torture/compile/pr11832.c  -O3 -fomit-frame-pointer  (internal compiler error)
FAIL: gcc.c-torture/compile/pr11832.c  -O3 -fomit-frame-pointer  (test for excess errors)
FAIL: gcc.c-torture/compile/pr11832.c  -O3 -g  (internal compiler error)
FAIL: gcc.c-torture/compile/pr11832.c  -O3 -g  (test for excess errors)
FAIL: gcc.c-torture/compile/pr11832.c  -Os  (internal compiler error)
FAIL: gcc.c-torture/compile/pr11832.c  -Os  (test for excess errors)
FAIL: gcc.c-torture/compile/pr33009.c  -O0  (internal compiler error)
FAIL: gcc.c-torture/compile/pr33009.c  -O0  (test for excess errors)
FAIL: gcc.c-torture/compile/pr33009.c  -O1  (internal compiler error)
FAIL: gcc.c-torture/compile/pr33009.c  -O1  (test for excess errors)
FAIL: gcc.c-torture/compile/pr33009.c  -O2  (internal compiler error)
FAIL: gcc.c-torture/compile/pr33009.c  -O2  (test for excess errors)
FAIL: gcc.c-torture/compile/pr33009.c  -O3 -fomit-frame-pointer  (internal compiler error)
FAIL: gcc.c-torture/compile/pr33009.c  -O3 -fomit-frame-pointer  (test for excess errors)
FAIL: gcc.c-torture/compile/pr33009.c  -O3 -fomit-frame-pointer -funroll-loops  (internal compiler error)
FAIL: gcc.c-torture/compile/pr33009.c  -O3 -fomit-frame-pointer -funroll-loops  (test for excess errors)
FAIL: gcc.c-torture/compile/pr33009.c  -O3 -fomit-frame-pointer -funroll-all-loops -finline-functions  (internal compiler error)
FAIL: gcc.c-torture/compile/pr33009.c  -O3 -fomit-frame-pointer -funroll-all-loops -finline-functions  (test for excess errors)
FAIL: gcc.c-torture/compile/pr33009.c  -O3 -g  (internal compiler error)
FAIL: gcc.c-torture/compile/pr33009.c  -O3 -g  (test for excess errors)
FAIL: gcc.c-torture/compile/pr33009.c  -Os  (internal compiler error)
FAIL: gcc.c-torture/compile/pr33009.c  -Os  (test for excess errors)
WARNING: Could not compile gcc.dg/compat/struct-layout-1 generator
FAIL: gcc.dg/cpp/pr35322.c (test for excess errors)
FAIL: gcc.dg/bf-ms-layout-2.c execution test
FAIL: gcc.dg/bf-ms-layout.c execution test
FAIL: gcc.dg/initpri1.c execution test
FAIL: gcc.dg/tree-ssa/ssa-store-ccp-4.c scan-tree-dump-times optimized "conststaticvariable" 1
FAIL: gcc.target/i386/sse4_1-blendvpd.c (test for excess errors)
WARNING: gcc.target/i386/sse4_1-blendvpd.c compilation failed to produce executable
FAIL: gcc.target/i386/sse4_1-blendvps.c (test for excess errors)
WARNING: gcc.target/i386/sse4_1-blendvps.c compilation failed to produce executable
FAIL: gcc.target/i386/sse4_1-insertps-1.c (test for excess errors)
WARNING: gcc.target/i386/sse4_1-insertps-1.c compilation failed to produce executable
FAIL: gcc.target/i386/sse4_1-insertps-2.c (test for excess errors)
WARNING: gcc.target/i386/sse4_1-insertps-2.c compilation failed to produce executable
FAIL: gcc.target/i386/sse4_1-pblendvb.c (test for excess errors)
WARNING: gcc.target/i386/sse4_1-pblendvb.c compilation failed to produce executable
FAIL: gcc.target/i386/sse4_2-popcntl.c (test for excess errors)
WARNING: gcc.target/i386/sse4_2-popcntl.c compilation failed to produce executable

		=== gcc Summary ===

# of expected passes		47831
# of unexpected failures	39
# of expected failures		166
# of untested testcases		35
# of unsupported tests		372
/Users/dave/gnu/gcc/objdir/gcc/xgcc  version 4.4.0 20080314 (experimental) [trunk revision 133203] (GCC) 

		=== gfortran tests ===


Running target unix

		=== gfortran Summary ===

# of expected passes		23802
# of expected failures		11
# of unsupported tests		38
/Users/dave/gnu/gcc/objdir/gcc/testsuite/gfortran/../../gfortran  version 4.4.0 20080314 (experimental) [trunk revision 133203] (GCC) 

		=== gnat tests ===


Running target unix

		=== gnat Summary ===

# of expected passes		366
		=== obj-c++ tests ===


Running target unix
FAIL: obj-c++.dg/basic.mm (test for excess errors)
FAIL: obj-c++.dg/basic.mm execution test
FAIL: obj-c++.dg/bitfield-2.mm (test for excess errors)
FAIL: obj-c++.dg/bitfield-2.mm execution test
FAIL: obj-c++.dg/const-str-10.mm (test for excess errors)
FAIL: obj-c++.dg/const-str-11.mm (test for excess errors)
FAIL: obj-c++.dg/const-str-3.mm (test for excess errors)
FAIL: obj-c++.dg/const-str-7.mm (test for excess errors)
FAIL: obj-c++.dg/const-str-8.mm (test for excess errors)
FAIL: obj-c++.dg/const-str-9.mm (test for excess errors)
FAIL: obj-c++.dg/cxx-ivars-1.mm (test for excess errors)
FAIL: obj-c++.dg/cxx-ivars-1.mm execution test
FAIL: obj-c++.dg/cxx-ivars-2.mm (test for excess errors)
FAIL: obj-c++.dg/cxx-ivars-3.mm (test for excess errors)
FAIL: obj-c++.dg/cxx-scope-1.mm (test for excess errors)
FAIL: obj-c++.dg/cxx-scope-1.mm execution test
FAIL: obj-c++.dg/defs.mm (test for excess errors)
FAIL: obj-c++.dg/defs.mm execution test
FAIL: obj-c++.dg/encode-4.mm (test for excess errors)
FAIL: obj-c++.dg/encode-4.mm execution test
FAIL: obj-c++.dg/encode-5.mm (test for excess errors)
WARNING: obj-c++.dg/encode-5.mm compilation failed to produce executable
FAIL: obj-c++.dg/encode-6.mm (test for excess errors)
FAIL: obj-c++.dg/encode-7.mm (test for excess errors)
XPASS: obj-c++.dg/encode-8.mm execution test
FAIL: obj-c++.dg/except-1.mm (test for excess errors)
FAIL: obj-c++.dg/except-1.mm execution test
XPASS: obj-c++.dg/isa-field-1.mm (test for excess errors)
FAIL: obj-c++.dg/lookup-2.mm execution test
FAIL: obj-c++.dg/method-10.mm (test for excess errors)
FAIL: obj-c++.dg/method-10.mm execution test
FAIL: obj-c++.dg/method-12.mm (test for excess errors)
FAIL: obj-c++.dg/method-17.mm (test for excess errors)
FAIL: obj-c++.dg/method-17.mm execution test
FAIL: obj-c++.dg/method-19.mm (test for excess errors)
FAIL: obj-c++.dg/method-19.mm execution test
FAIL: obj-c++.dg/proto-lossage-3.mm (test for excess errors)
WARNING: obj-c++.dg/proto-lossage-3.mm compilation failed to produce executable
FAIL: obj-c++.dg/proto-qual-1.mm (test for excess errors)
WARNING: obj-c++.dg/proto-qual-1.mm compilation failed to produce executable
FAIL: obj-c++.dg/qual-types-1.mm (test for excess errors)
FAIL: obj-c++.dg/qual-types-1.mm execution test
FAIL: obj-c++.dg/stubify-2.mm (test for excess errors)
ERROR: obj-c++.dg/stubify-2.mm: error executing dg-final: couldn't open "stubify-2.mm.08.jump": no such file or directory
UNRESOLVED: obj-c++.dg/stubify-2.mm: error executing dg-final: couldn't open "stubify-2.mm.08.jump": no such file or directory
FAIL: obj-c++.dg/template-1.mm (test for excess errors)
FAIL: obj-c++.dg/template-1.mm execution test
FAIL: obj-c++.dg/template-3.mm (test for excess errors)
FAIL: obj-c++.dg/template-3.mm execution test
FAIL: obj-c++.dg/template-4.mm (test for excess errors)
FAIL: obj-c++.dg/template-4.mm execution test
FAIL: obj-c++.dg/try-catch-2.mm execution test
FAIL: obj-c++.dg/try-catch-9.mm execution test
FAIL: obj-c++.dg/va-meth-1.mm (test for excess errors)
FAIL: obj-c++.dg/va-meth-1.mm execution test

		=== obj-c++ Summary ===

# of expected passes		413
# of unexpected failures	48
# of unexpected successes	2
# of expected failures		7
# of unresolved testcases	1
# of unsupported tests		1
/Users/dave/gnu/gcc/objdir/gcc/testsuite/obj-c++/../../g++  version 4.4.0 20080314 (experimental) [trunk revision 133203] (GCC) 

		=== objc tests ===


Running target unix
FAIL: objc/execute/bycopy-1.m compilation,  -O0  -fnext-runtime
UNRESOLVED: objc/execute/bycopy-1.m execution,  -O0  -fnext-runtime
FAIL: objc/execute/bycopy-1.m compilation,  -O1  -fnext-runtime
UNRESOLVED: objc/execute/bycopy-1.m execution,  -O1  -fnext-runtime
FAIL: objc/execute/bycopy-1.m compilation,  -O2  -fnext-runtime
UNRESOLVED: objc/execute/bycopy-1.m execution,  -O2  -fnext-runtime
FAIL: objc/execute/bycopy-1.m compilation,  -O3 -fomit-frame-pointer  -fnext-runtime
UNRESOLVED: objc/execute/bycopy-1.m execution,  -O3 -fomit-frame-pointer  -fnext-runtime
FAIL: objc/execute/bycopy-1.m compilation,  -O3 -g  -fnext-runtime
UNRESOLVED: objc/execute/bycopy-1.m execution,  -O3 -g  -fnext-runtime
FAIL: objc/execute/bycopy-1.m compilation,  -Os  -fnext-runtime
UNRESOLVED: objc/execute/bycopy-1.m execution,  -Os  -fnext-runtime
FAIL: objc/execute/bycopy-2.m compilation,  -O0  -fnext-runtime
UNRESOLVED: objc/execute/bycopy-2.m execution,  -O0  -fnext-runtime
FAIL: objc/execute/bycopy-2.m compilation,  -O1  -fnext-runtime
UNRESOLVED: objc/execute/bycopy-2.m execution,  -O1  -fnext-runtime
FAIL: objc/execute/bycopy-2.m compilation,  -O2  -fnext-runtime
UNRESOLVED: objc/execute/bycopy-2.m execution,  -O2  -fnext-runtime
FAIL: objc/execute/bycopy-2.m compilation,  -O3 -fomit-frame-pointer  -fnext-runtime
UNRESOLVED: objc/execute/bycopy-2.m execution,  -O3 -fomit-frame-pointer  -fnext-runtime
FAIL: objc/execute/bycopy-2.m compilation,  -O3 -g  -fnext-runtime
UNRESOLVED: objc/execute/bycopy-2.m execution,  -O3 -g  -fnext-runtime
FAIL: objc/execute/bycopy-2.m compilation,  -Os  -fnext-runtime
UNRESOLVED: objc/execute/bycopy-2.m execution,  -Os  -fnext-runtime
FAIL: objc/execute/bycopy-3.m compilation,  -O0  -fnext-runtime
UNRESOLVED: objc/execute/bycopy-3.m execution,  -O0  -fnext-runtime
FAIL: objc/execute/bycopy-3.m compilation,  -O1  -fnext-runtime
UNRESOLVED: objc/execute/bycopy-3.m execution,  -O1  -fnext-runtime
FAIL: objc/execute/bycopy-3.m compilation,  -O2  -fnext-runtime
UNRESOLVED: objc/execute/bycopy-3.m execution,  -O2  -fnext-runtime
FAIL: objc/execute/bycopy-3.m compilation,  -O3 -fomit-frame-pointer  -fnext-runtime
UNRESOLVED: objc/execute/bycopy-3.m execution,  -O3 -fomit-frame-pointer  -fnext-runtime
FAIL: objc/execute/bycopy-3.m compilation,  -O3 -g  -fnext-runtime
UNRESOLVED: objc/execute/bycopy-3.m execution,  -O3 -g  -fnext-runtime
FAIL: objc/execute/bycopy-3.m compilation,  -Os  -fnext-runtime
UNRESOLVED: objc/execute/bycopy-3.m execution,  -Os  -fnext-runtime
FAIL: objc/execute/formal_protocol-5.m compilation,  -O0  -fnext-runtime
UNRESOLVED: objc/execute/formal_protocol-5.m execution,  -O0  -fnext-runtime
FAIL: objc/execute/formal_protocol-5.m compilation,  -O1  -fnext-runtime
UNRESOLVED: objc/execute/formal_protocol-5.m execution,  -O1  -fnext-runtime
FAIL: objc/execute/formal_protocol-5.m compilation,  -O2  -fnext-runtime
UNRESOLVED: objc/execute/formal_protocol-5.m execution,  -O2  -fnext-runtime
FAIL: objc/execute/formal_protocol-5.m compilation,  -O3 -fomit-frame-pointer  -fnext-runtime
UNRESOLVED: objc/execute/formal_protocol-5.m execution,  -O3 -fomit-frame-pointer  -fnext-runtime
FAIL: objc/execute/formal_protocol-5.m compilation,  -O3 -g  -fnext-runtime
UNRESOLVED: objc/execute/formal_protocol-5.m execution,  -O3 -g  -fnext-runtime
FAIL: objc/execute/formal_protocol-5.m compilation,  -Os  -fnext-runtime
UNRESOLVED: objc/execute/formal_protocol-5.m execution,  -Os  -fnext-runtime
FAIL: objc/execute/formal_protocol-6.m compilation,  -O0  -fnext-runtime
UNRESOLVED: objc/execute/formal_protocol-6.m execution,  -O0  -fnext-runtime
FAIL: objc/execute/formal_protocol-6.m compilation,  -O1  -fnext-runtime
UNRESOLVED: objc/execute/formal_protocol-6.m execution,  -O1  -fnext-runtime
FAIL: objc/execute/formal_protocol-6.m compilation,  -O2  -fnext-runtime
UNRESOLVED: objc/execute/formal_protocol-6.m execution,  -O2  -fnext-runtime
FAIL: objc/execute/formal_protocol-6.m compilation,  -O3 -fomit-frame-pointer  -fnext-runtime
UNRESOLVED: objc/execute/formal_protocol-6.m execution,  -O3 -fomit-frame-pointer  -fnext-runtime
FAIL: objc/execute/formal_protocol-6.m compilation,  -O3 -g  -fnext-runtime
UNRESOLVED: objc/execute/formal_protocol-6.m execution,  -O3 -g  -fnext-runtime
FAIL: objc/execute/formal_protocol-6.m compilation,  -Os  -fnext-runtime
UNRESOLVED: objc/execute/formal_protocol-6.m execution,  -Os  -fnext-runtime
FAIL: objc/execute/formal_protocol-7.m compilation,  -O0  -fnext-runtime
UNRESOLVED: objc/execute/formal_protocol-7.m execution,  -O0  -fnext-runtime
FAIL: objc/execute/formal_protocol-7.m compilation,  -O1  -fnext-runtime
UNRESOLVED: objc/execute/formal_protocol-7.m execution,  -O1  -fnext-runtime
FAIL: objc/execute/formal_protocol-7.m compilation,  -O2  -fnext-runtime
UNRESOLVED: objc/execute/formal_protocol-7.m execution,  -O2  -fnext-runtime
FAIL: objc/execute/formal_protocol-7.m compilation,  -O3 -fomit-frame-pointer  -fnext-runtime
UNRESOLVED: objc/execute/formal_protocol-7.m execution,  -O3 -fomit-frame-pointer  -fnext-runtime
FAIL: objc/execute/formal_protocol-7.m compilation,  -O3 -g  -fnext-runtime
UNRESOLVED: objc/execute/formal_protocol-7.m execution,  -O3 -g  -fnext-runtime
FAIL: objc/execute/formal_protocol-7.m compilation,  -Os  -fnext-runtime
UNRESOLVED: objc/execute/formal_protocol-7.m execution,  -Os  -fnext-runtime
FAIL: objc/execute/np-1.m compilation,  -O0  -fnext-runtime
UNRESOLVED: objc/execute/np-1.m execution,  -O0  -fnext-runtime
FAIL: objc/execute/np-1.m compilation,  -O1  -fnext-runtime
UNRESOLVED: objc/execute/np-1.m execution,  -O1  -fnext-runtime
FAIL: objc/execute/np-1.m compilation,  -O2  -fnext-runtime
UNRESOLVED: objc/execute/np-1.m execution,  -O2  -fnext-runtime
FAIL: objc/execute/np-1.m compilation,  -O3 -fomit-frame-pointer  -fnext-runtime
UNRESOLVED: objc/execute/np-1.m execution,  -O3 -fomit-frame-pointer  -fnext-runtime
FAIL: objc/execute/np-1.m compilation,  -O3 -g  -fnext-runtime
UNRESOLVED: objc/execute/np-1.m execution,  -O3 -g  -fnext-runtime
FAIL: objc/execute/np-1.m compilation,  -Os  -fnext-runtime
UNRESOLVED: objc/execute/np-1.m execution,  -Os  -fnext-runtime
FAIL: objc/execute/np-2.m compilation,  -O0  -fnext-runtime
UNRESOLVED: objc/execute/np-2.m execution,  -O0  -fnext-runtime
FAIL: objc/execute/np-2.m compilation,  -O1  -fnext-runtime
UNRESOLVED: objc/execute/np-2.m execution,  -O1  -fnext-runtime
FAIL: objc/execute/np-2.m compilation,  -O2  -fnext-runtime
UNRESOLVED: objc/execute/np-2.m execution,  -O2  -fnext-runtime
FAIL: objc/execute/np-2.m compilation,  -O3 -fomit-frame-pointer  -fnext-runtime
UNRESOLVED: objc/execute/np-2.m execution,  -O3 -fomit-frame-pointer  -fnext-runtime
FAIL: objc/execute/np-2.m compilation,  -O3 -g  -fnext-runtime
UNRESOLVED: objc/execute/np-2.m execution,  -O3 -g  -fnext-runtime
FAIL: objc/execute/np-2.m compilation,  -Os  -fnext-runtime
UNRESOLVED: objc/execute/np-2.m execution,  -Os  -fnext-runtime
FAIL: objc/execute/protocol-isEqual-1.m compilation,  -O0  -fnext-runtime
UNRESOLVED: objc/execute/protocol-isEqual-1.m execution,  -O0  -fnext-runtime
FAIL: objc/execute/protocol-isEqual-1.m compilation,  -O1  -fnext-runtime
UNRESOLVED: objc/execute/protocol-isEqual-1.m execution,  -O1  -fnext-runtime
FAIL: objc/execute/protocol-isEqual-1.m compilation,  -O2  -fnext-runtime
UNRESOLVED: objc/execute/protocol-isEqual-1.m execution,  -O2  -fnext-runtime
FAIL: objc/execute/protocol-isEqual-1.m compilation,  -O3 -fomit-frame-pointer  -fnext-runtime
UNRESOLVED: objc/execute/protocol-isEqual-1.m execution,  -O3 -fomit-frame-pointer  -fnext-runtime
FAIL: objc/execute/protocol-isEqual-1.m compilation,  -O3 -g  -fnext-runtime
UNRESOLVED: objc/execute/protocol-isEqual-1.m execution,  -O3 -g  -fnext-runtime
FAIL: objc/execute/protocol-isEqual-1.m compilation,  -Os  -fnext-runtime
UNRESOLVED: objc/execute/protocol-isEqual-1.m execution,  -Os  -fnext-runtime
FAIL: objc/execute/protocol-isEqual-2.m compilation,  -O0  -fnext-runtime
UNRESOLVED: objc/execute/protocol-isEqual-2.m execution,  -O0  -fnext-runtime
FAIL: objc/execute/protocol-isEqual-2.m compilation,  -O1  -fnext-runtime
UNRESOLVED: objc/execute/protocol-isEqual-2.m execution,  -O1  -fnext-runtime
FAIL: objc/execute/protocol-isEqual-2.m compilation,  -O2  -fnext-runtime
UNRESOLVED: objc/execute/protocol-isEqual-2.m execution,  -O2  -fnext-runtime
FAIL: objc/execute/protocol-isEqual-2.m compilation,  -O3 -fomit-frame-pointer  -fnext-runtime
UNRESOLVED: objc/execute/protocol-isEqual-2.m execution,  -O3 -fomit-frame-pointer  -fnext-runtime
FAIL: objc/execute/protocol-isEqual-2.m compilation,  -O3 -g  -fnext-runtime
UNRESOLVED: objc/execute/protocol-isEqual-2.m execution,  -O3 -g  -fnext-runtime
FAIL: objc/execute/protocol-isEqual-2.m compilation,  -Os  -fnext-runtime
UNRESOLVED: objc/execute/protocol-isEqual-2.m execution,  -Os  -fnext-runtime
FAIL: objc/execute/protocol-isEqual-3.m compilation,  -O0  -fnext-runtime
UNRESOLVED: objc/execute/protocol-isEqual-3.m execution,  -O0  -fnext-runtime
FAIL: objc/execute/protocol-isEqual-3.m compilation,  -O1  -fnext-runtime
UNRESOLVED: objc/execute/protocol-isEqual-3.m execution,  -O1  -fnext-runtime
FAIL: objc/execute/protocol-isEqual-3.m compilation,  -O2  -fnext-runtime
UNRESOLVED: objc/execute/protocol-isEqual-3.m execution,  -O2  -fnext-runtime
FAIL: objc/execute/protocol-isEqual-3.m compilation,  -O3 -fomit-frame-pointer  -fnext-runtime
UNRESOLVED: objc/execute/protocol-isEqual-3.m execution,  -O3 -fomit-frame-pointer  -fnext-runtime
FAIL: objc/execute/protocol-isEqual-3.m compilation,  -O3 -g  -fnext-runtime
UNRESOLVED: objc/execute/protocol-isEqual-3.m execution,  -O3 -g  -fnext-runtime
FAIL: objc/execute/protocol-isEqual-3.m compilation,  -Os  -fnext-runtime
UNRESOLVED: objc/execute/protocol-isEqual-3.m execution,  -Os  -fnext-runtime
FAIL: objc/execute/protocol-isEqual-4.m compilation,  -O0  -fnext-runtime
UNRESOLVED: objc/execute/protocol-isEqual-4.m execution,  -O0  -fnext-runtime
FAIL: objc/execute/protocol-isEqual-4.m compilation,  -O1  -fnext-runtime
UNRESOLVED: objc/execute/protocol-isEqual-4.m execution,  -O1  -fnext-runtime
FAIL: objc/execute/protocol-isEqual-4.m compilation,  -O2  -fnext-runtime
UNRESOLVED: objc/execute/protocol-isEqual-4.m execution,  -O2  -fnext-runtime
FAIL: objc/execute/protocol-isEqual-4.m compilation,  -O3 -fomit-frame-pointer  -fnext-runtime
UNRESOLVED: objc/execute/protocol-isEqual-4.m execution,  -O3 -fomit-frame-pointer  -fnext-runtime
FAIL: objc/execute/protocol-isEqual-4.m compilation,  -O3 -g  -fnext-runtime
UNRESOLVED: objc/execute/protocol-isEqual-4.m execution,  -O3 -g  -fnext-runtime
FAIL: objc/execute/protocol-isEqual-4.m compilation,  -Os  -fnext-runtime
UNRESOLVED: objc/execute/protocol-isEqual-4.m execution,  -Os  -fnext-runtime
FAIL: objc.dg/category-1.m (test for excess errors)
FAIL: objc.dg/const-str-10.m (test for excess errors)
FAIL: objc.dg/const-str-11.m (test for excess errors)
FAIL: objc.dg/const-str-3.m (test for excess errors)
FAIL: objc.dg/const-str-7.m (test for excess errors)
FAIL: objc.dg/const-str-8.m (test for excess errors)
FAIL: objc.dg/const-str-9.m (test for excess errors)
FAIL: objc.dg/encode-2.m (test for excess errors)
FAIL: objc.dg/encode-3.m (test for excess errors)
WARNING: objc.dg/encode-3.m compilation failed to produce executable
FAIL: objc.dg/encode-4.m (test for excess errors)
FAIL: objc.dg/encode-5.m (test for excess errors)
FAIL: objc.dg/headers.m (test for excess errors)
FAIL: objc.dg/method-6.m (test for excess errors)
FAIL: objc.dg/no-extra-load.m (test for excess errors)
ERROR: objc.dg/no-extra-load.m: error executing dg-final: couldn't open "no-extra-load.s": no such file or directory
UNRESOLVED: objc.dg/no-extra-load.m: error executing dg-final: couldn't open "no-extra-load.s": no such file or directory
FAIL: objc.dg/proto-lossage-3.m (test for excess errors)
WARNING: objc.dg/proto-lossage-3.m compilation failed to produce executable
FAIL: objc.dg/proto-qual-1.m (test for excess errors)
WARNING: objc.dg/proto-qual-1.m compilation failed to produce executable
FAIL: objc.dg/stret-2.m scan-assembler objc_msgSend_stret
FAIL: objc.dg/stret-2.m scan-assembler-not objc_msgSend[^_S]
FAIL: objc.dg/stret-2.m scan-assembler-not objc_msgSendSuper[^_]
FAIL: objc.dg/stubify-1.m (test for excess errors)
ERROR: objc.dg/stubify-1.m: error executing dg-final: couldn't open "stubify-1.s": no such file or directory
UNRESOLVED: objc.dg/stubify-1.m: error executing dg-final: couldn't open "stubify-1.s": no such file or directory
FAIL: objc.dg/stubify-2.m (test for excess errors)
ERROR: objc.dg/stubify-2.m: error executing dg-final: no files matched glob pattern "stubify-2.m.[0-9][0-9][0-9]r.jump"
UNRESOLVED: objc.dg/stubify-2.m: error executing dg-final: no files matched glob pattern "stubify-2.m.[0-9][0-9][0-9]r.jump"
FAIL: objc.dg/symtab-1.m scan-assembler L_OBJC_SYMBOLS.*:\\n\\t.long\\t0\\n\\t.long\\t0\\n\\t.short\\t2\\n\\t.short\\t0\\n\\t.long\\tL_OBJC_CLASS_Derived.*\\n\\t.long\\tL_OBJC_CLASS_Base.*\\n
FAIL: objc.dg/type-size-2.m (test for excess errors)
WARNING: Could not compile objc.dg/gnu-encoding/struct-layout-encoding-1 generator

		=== objc Summary ===

# of expected passes		2828
# of unexpected failures	95
# of unresolved testcases	75
# of unsupported tests		2
/Users/dave/gnu/gcc/objdir/gcc/xgcc  version 4.4.0 20080314 (experimental) [trunk revision 133203] (GCC) 

		=== libffi tests ===


Running target unix

		=== libffi Summary ===

# of expected passes		1389
# of unsupported tests		10
		=== libgomp tests ===


Running target unix
FAIL: libgomp.fortran/crayptr2.f90  -O0  execution test
FAIL: libgomp.fortran/crayptr2.f90  -O1  execution test
FAIL: libgomp.fortran/crayptr2.f90  -O3 -fomit-frame-pointer  execution test
FAIL: libgomp.fortran/crayptr2.f90  -O3 -fomit-frame-pointer -funroll-loops  execution test
FAIL: libgomp.fortran/crayptr2.f90  -O3 -fomit-frame-pointer -funroll-all-loops -finline-functions  execution test
FAIL: libgomp.fortran/crayptr2.f90  -O3 -g  execution test
FAIL: libgomp.fortran/crayptr2.f90  -Os  execution test

		=== libgomp Summary ===

# of expected passes		1494
# of unexpected failures	7
# of unsupported tests		109
		=== libjava tests ===


Running target unix
FAIL: /Users/dave/gnu/gcc/gcc/libjava/testsuite/libjava.jar/TestClosureGC.jar execution - gij test

		=== libjava Summary ===

# of expected passes		2548
# of unexpected failures	1
# of untested testcases		1
		=== libstdc++ tests ===


Running target unix
XPASS: 21_strings/basic_string/element_access/char/21674.cc execution test
XPASS: 21_strings/basic_string/element_access/wchar_t/21674.cc execution test
XPASS: 26_numerics/headers/cmath/c99_classification_macros_c.cc (test for excess errors)
FAIL: ext/mt_allocator/deallocate_local_thread-5.cc execution test
FAIL: ext/mt_allocator/deallocate_local_thread-7.cc execution test

		=== libstdc++ Summary ===

# of expected passes		4964
# of unexpected failures	2
# of unexpected successes	3
# of expected failures		62
# of unsupported tests		328

Compiler version: 4.4.0 20080314 (experimental) [trunk revision 133203] (GCC) 
Platform: i686-apple-darwin9
configure flags: --build=i686-apple-darwin9 --host=i686-apple-darwin9 --target=i686-apple-darwin9 --with-gnu-as --enable-shared --prefix=/opt/gnu/gcc/gcc-4.4.0 --with-gmp=/opt/gnu/gcc/gcc-4.4.0 --enable-debug=no --disable-nls --enable-languages=c,c++,objc,fortran,ada,obj-c++,java


Index Nav: [Date Index] [Subject Index] [Author Index] [Thread Index]
Message Nav: [Date Prev] [Date Next] [Thread Prev] [Thread Next]