This is the mail archive of the gcc-testresults@gcc.gnu.org mailing list for the GCC project.


Index Nav: [Date Index] [Subject Index] [Author Index] [Thread Index]
Message Nav: [Date Prev] [Date Next] [Thread Prev] [Thread Next]
Other format: [Raw text]

Results for 4.3.0 20070520 (experimental) testsuite on sparc-sun-solaris2.10


LAST_UPDATED:
Native configuration is sparc-sun-solaris2.10

		=== g++ tests ===


Running target unix
WARNING: g++.dg/other/ucnid-1.C compilation failed to produce executable
XPASS: g++.old-deja/g++.other/init19.C execution test

		=== g++ Summary ===

# of expected passes		14723
# of unexpected successes	1
# of expected failures		84
# of unsupported tests		173
/tmp/kg/basel/build/gcc/testsuite/g++/../../g++  version 4.3.0 20070520 (experimental)

		=== gcc tests ===


Running target unix
FAIL: gcc.c-torture/compile/limits-blockid.c  -O3 -g  (test for excess errors)
FAIL: gcc.c-torture/compile/limits-enumconst.c  -O3 -g  (test for excess errors)
FAIL: gcc.c-torture/compile/limits-exprparen.c  -O0  (test for excess errors)
FAIL: gcc.c-torture/compile/limits-exprparen.c  -O1  (test for excess errors)
FAIL: gcc.c-torture/compile/limits-exprparen.c  -O2  (test for excess errors)
FAIL: gcc.c-torture/compile/limits-exprparen.c  -O3 -fomit-frame-pointer  (test for excess errors)
FAIL: gcc.c-torture/compile/limits-exprparen.c  -O3 -g  (test for excess errors)
FAIL: gcc.c-torture/compile/limits-exprparen.c  -Os  (test for excess errors)
FAIL: gcc.c-torture/compile/limits-externalid.c  -O0  (test for excess errors)
FAIL: gcc.c-torture/compile/limits-externalid.c  -O1  (test for excess errors)
FAIL: gcc.c-torture/compile/limits-externalid.c  -O2  (test for excess errors)
FAIL: gcc.c-torture/compile/limits-externalid.c  -O3 -fomit-frame-pointer  (test for excess errors)
FAIL: gcc.c-torture/compile/limits-externalid.c  -O3 -g  (test for excess errors)
FAIL: gcc.c-torture/compile/limits-externalid.c  -Os  (test for excess errors)
FAIL: gcc.c-torture/compile/limits-fndefn.c  -O3 -g  (test for excess errors)
FAIL: gcc.c-torture/execute/mayalias-2.c compilation,  -O3 -g  (internal compiler error)
UNRESOLVED: gcc.c-torture/execute/mayalias-2.c execution,  -O3 -g
FAIL: gcc.c-torture/execute/mayalias-3.c compilation,  -O3 -g  (internal compiler error)
UNRESOLVED: gcc.c-torture/execute/mayalias-3.c execution,  -O3 -g
WARNING: gcc.dg/ucnid-2.c compilation failed to produce executable
WARNING: gcc.dg/ucnid-3.c compilation failed to produce executable
WARNING: gcc.dg/ucnid-4.c compilation failed to produce executable
FAIL: largefile.c -O0 -g (test for excess errors)
FAIL: largefile.c  -O0  (test for excess errors)
FAIL: largefile.c  -O1  (test for excess errors)
FAIL: largefile.c  -O2  (test for excess errors)
FAIL: largefile.c  -O3 -fomit-frame-pointer  (test for excess errors)
FAIL: largefile.c  -O3 -g  (test for excess errors)
FAIL: largefile.c  -Os  (test for excess errors)
XPASS: gcc.dg/tree-ssa/update-threading.c scan-tree-dump-times Invalid sum 0
FAIL: gcc.dg/vect/vect-multitypes-5.c scan-tree-dump-times vectorized 1 loops 1
FAIL: gcc.dg/vect/vect-multitypes-6.c scan-tree-dump-times vectorized 1 loops 1
FAIL: gcc.target/sparc/align.c (test for excess errors)
ERROR: gcc.target/sparc/align.c: error executing dg-final: couldn't open "align.s": no such file or directory
UNRESOLVED: gcc.target/sparc/align.c: error executing dg-final: couldn't open "align.s": no such file or directory
FAIL: gcc.target/sparc/combined-2.c (test for excess errors)
ERROR: gcc.target/sparc/combined-2.c: error executing dg-final: couldn't open "combined-2.s": no such file or directory
UNRESOLVED: gcc.target/sparc/combined-2.c: error executing dg-final: couldn't open "combined-2.s": no such file or directory
FAIL: gcc.target/sparc/fexpand.c (test for excess errors)
ERROR: gcc.target/sparc/fexpand.c: error executing dg-final: couldn't open "fexpand.s": no such file or directory
UNRESOLVED: gcc.target/sparc/fexpand.c: error executing dg-final: couldn't open "fexpand.s": no such file or directory
FAIL: gcc.target/sparc/fnot.c (test for excess errors)
ERROR: gcc.target/sparc/fnot.c: error executing dg-final: couldn't open "fnot.s": no such file or directory
UNRESOLVED: gcc.target/sparc/fnot.c: error executing dg-final: couldn't open "fnot.s": no such file or directory
FAIL: gcc.target/sparc/fpack16.c (test for excess errors)
ERROR: gcc.target/sparc/fpack16.c: error executing dg-final: couldn't open "fpack16.s": no such file or directory
UNRESOLVED: gcc.target/sparc/fpack16.c: error executing dg-final: couldn't open "fpack16.s": no such file or directory
FAIL: gcc.target/sparc/fpmerge.c (test for excess errors)
ERROR: gcc.target/sparc/fpmerge.c: error executing dg-final: couldn't open "fpmerge.s": no such file or directory
UNRESOLVED: gcc.target/sparc/fpmerge.c: error executing dg-final: couldn't open "fpmerge.s": no such file or directory
FAIL: gcc.target/sparc/fpmul.c (test for excess errors)
ERROR: gcc.target/sparc/fpmul.c: error executing dg-final: couldn't open "fpmul.s": no such file or directory
UNRESOLVED: gcc.target/sparc/fpmul.c: error executing dg-final: couldn't open "fpmul.s": no such file or directory
FAIL: gcc.target/sparc/noresult.c (internal compiler error)
FAIL: gcc.target/sparc/noresult.c (test for excess errors)
ERROR: gcc.target/sparc/noresult.c: error executing dg-final: couldn't open "noresult.s": no such file or directory
UNRESOLVED: gcc.target/sparc/noresult.c: error executing dg-final: couldn't open "noresult.s": no such file or directory
FAIL: gcc.target/sparc/pdist.c (test for excess errors)
ERROR: gcc.target/sparc/pdist.c: error executing dg-final: couldn't open "pdist.s": no such file or directory
UNRESOLVED: gcc.target/sparc/pdist.c: error executing dg-final: couldn't open "pdist.s": no such file or directory

		=== gcc Summary ===

# of expected passes		43289
# of unexpected failures	36
# of unexpected successes	1
# of expected failures		149
# of unresolved testcases	11
# of untested testcases		35
# of unsupported tests		490
/tmp/kg/basel/build/gcc/xgcc  version 4.3.0 20070520 (experimental)

		=== gfortran tests ===


Running target unix
FAIL: gfortran.dg/char_result_11.f90  -O  (internal compiler error)
FAIL: gfortran.dg/char_result_11.f90  -O  (test for excess errors)
FAIL: gfortran.dg/elemental_optional_args_1.f90  -O  (internal compiler error)
FAIL: gfortran.dg/elemental_optional_args_1.f90  -O   (test for warnings, line 25)
FAIL: gfortran.dg/elemental_optional_args_1.f90  -O   (test for warnings, line 29)
FAIL: gfortran.dg/elemental_optional_args_1.f90  -O   (test for warnings, line 33)
FAIL: gfortran.dg/elemental_optional_args_1.f90  -O   (test for warnings, line 37)
FAIL: gfortran.dg/elemental_optional_args_1.f90  -O  (test for excess errors)
FAIL: gfortran.dg/secnds-1.f  -O3 -g  execution test
FAIL: gfortran.dg/secnds.f  -O0  execution test
FAIL: gfortran.dg/g77/19990502-0.f  -O  (internal compiler error)
FAIL: gfortran.dg/g77/19990502-0.f  -O  (test for excess errors)
FAIL: gfortran.dg/gomp/omp_atomic1.f90  -O  (internal compiler error)
FAIL: gfortran.dg/gomp/omp_atomic1.f90  -O   (test for errors, line 33)
FAIL: gfortran.dg/gomp/omp_atomic1.f90  -O   (test for errors, line 35)
FAIL: gfortran.dg/gomp/omp_atomic1.f90  -O   (test for errors, line 37)
FAIL: gfortran.dg/gomp/omp_atomic1.f90  -O  (test for excess errors)
FAIL: gfortran.fortran-torture/execute/intrinsic_minmax.f90,  -O0  (internal compiler error)
FAIL: gfortran.fortran-torture/execute/intrinsic_minmax.f90,  -O1  (internal compiler error)
FAIL: gfortran.fortran-torture/execute/intrinsic_minmax.f90,  -O2  (internal compiler error)
FAIL: gfortran.fortran-torture/execute/intrinsic_minmax.f90,  -O3 -fomit-frame-pointer  (internal compiler error)
FAIL: gfortran.fortran-torture/execute/intrinsic_minmax.f90,  -O3 -fomit-frame-pointer -funroll-loops  (internal compiler error)
FAIL: gfortran.fortran-torture/execute/intrinsic_minmax.f90,  -O3 -fomit-frame-pointer -funroll-all-loops -finline-functions  (internal compiler error)
FAIL: gfortran.fortran-torture/execute/intrinsic_minmax.f90,  -O3 -g  (internal compiler error)
FAIL: gfortran.fortran-torture/execute/intrinsic_minmax.f90,  -Os  (internal compiler error)
FAIL: gfortran.fortran-torture/execute/st_function.f90,  -O1  (internal compiler error)
FAIL: gfortran.fortran-torture/execute/st_function.f90,  -O2  (internal compiler error)
FAIL: gfortran.fortran-torture/execute/st_function.f90,  -O3 -fomit-frame-pointer  (internal compiler error)
FAIL: gfortran.fortran-torture/execute/st_function.f90,  -O3 -fomit-frame-pointer -funroll-loops  (internal compiler error)
FAIL: gfortran.fortran-torture/execute/st_function.f90,  -O3 -fomit-frame-pointer -funroll-all-loops -finline-functions  (internal compiler error)
FAIL: gfortran.fortran-torture/execute/st_function.f90,  -O3 -g  (internal compiler error)
FAIL: gfortran.fortran-torture/execute/st_function.f90,  -Os  (internal compiler error)

		=== gfortran Summary ===

# of expected passes		17942
# of unexpected failures	32
# of expected failures		9
# of unsupported tests		49
/tmp/kg/basel/build/gcc/testsuite/gfortran/../../gfortran  version 4.3.0 20070520 (experimental)

		=== obj-c++ tests ===


Running target unix
FAIL: obj-c++.dg/bitfield-1.mm (internal compiler error)
FAIL: obj-c++.dg/bitfield-1.mm (test for excess errors)
WARNING: obj-c++.dg/bitfield-1.mm compilation failed to produce executable
FAIL: obj-c++.dg/comp-types-10.mm (internal compiler error)
FAIL: obj-c++.dg/comp-types-10.mm (test for excess errors)
FAIL: obj-c++.dg/cxx-class-1.mm (test for excess errors)
FAIL: obj-c++.dg/cxx-ivars-2.mm execution test
FAIL: obj-c++.dg/encode-2.mm scan-assembler {Vec<float>=ffi}
FAIL: obj-c++.dg/encode-2.mm scan-assembler {Vec<double>=ddi}
FAIL: obj-c++.dg/encode-3.mm execution test
FAIL: obj-c++.dg/encode-8.mm execution test
FAIL: obj-c++.dg/gnu-runtime-2.mm (test for excess errors)
FAIL: obj-c++.dg/isa-field-1.mm (test for excess errors)
FAIL: obj-c++.dg/lookup-2.mm (test for excess errors)
WARNING: obj-c++.dg/lookup-2.mm compilation failed to produce executable
FAIL: obj-c++.dg/try-catch-2.mm (test for excess errors)
WARNING: obj-c++.dg/try-catch-2.mm compilation failed to produce executable
FAIL: obj-c++.dg/try-catch-9.mm (internal compiler error)
FAIL: obj-c++.dg/try-catch-9.mm (test for excess errors)
WARNING: obj-c++.dg/try-catch-9.mm compilation failed to produce executable

		=== obj-c++ Summary ===

# of expected passes		421
# of unexpected failures	16
# of unsupported tests		13
/tmp/kg/basel/build/gcc/testsuite/obj-c++/../../g++  version 4.3.0 20070520 (experimental)

		=== objc tests ===


Running target unix

		=== objc Summary ===

# of expected passes		1812
# of expected failures		7
# of unsupported tests		24
/tmp/kg/basel/build/gcc/xgcc  version 4.3.0 20070520 (experimental)

		=== treelang tests ===


Running target unix

		=== treelang Summary ===

# of expected passes		52
		=== libffi tests ===


Running target unix

		=== libffi Summary ===

# of expected passes		1096
# of unsupported tests		8
		=== libgomp tests ===


Running target unix
FAIL: libgomp.c++/ctor-5.C  -O0  (test for excess errors)
WARNING: libgomp.c++/ctor-5.C  -O0  compilation failed to produce executable
FAIL: libgomp.c++/ctor-5.C  -O1  (test for excess errors)
WARNING: libgomp.c++/ctor-5.C  -O1  compilation failed to produce executable
FAIL: libgomp.c++/ctor-5.C  -O2  (test for excess errors)
WARNING: libgomp.c++/ctor-5.C  -O2  compilation failed to produce executable
FAIL: libgomp.c++/ctor-5.C  -O3 -fomit-frame-pointer  (test for excess errors)
WARNING: libgomp.c++/ctor-5.C  -O3 -fomit-frame-pointer  compilation failed to produce executable
FAIL: libgomp.c++/ctor-5.C  -O3 -fomit-frame-pointer -funroll-loops  (test for excess errors)
WARNING: libgomp.c++/ctor-5.C  -O3 -fomit-frame-pointer -funroll-loops  compilation failed to produce executable
FAIL: libgomp.c++/ctor-5.C  -O3 -fomit-frame-pointer -funroll-all-loops -finline-functions  (test for excess errors)
WARNING: libgomp.c++/ctor-5.C  -O3 -fomit-frame-pointer -funroll-all-loops -finline-functions  compilation failed to produce executable
FAIL: libgomp.c++/ctor-5.C  -O3 -g  (test for excess errors)
WARNING: libgomp.c++/ctor-5.C  -O3 -g  compilation failed to produce executable
FAIL: libgomp.c++/ctor-5.C  -Os  (test for excess errors)
WARNING: libgomp.c++/ctor-5.C  -Os  compilation failed to produce executable
FAIL: libgomp.c++/ctor-8.C  -O0  (test for excess errors)
WARNING: libgomp.c++/ctor-8.C  -O0  compilation failed to produce executable
FAIL: libgomp.c++/ctor-8.C  -O1  (test for excess errors)
WARNING: libgomp.c++/ctor-8.C  -O1  compilation failed to produce executable
FAIL: libgomp.c++/ctor-8.C  -O2  (test for excess errors)
WARNING: libgomp.c++/ctor-8.C  -O2  compilation failed to produce executable
FAIL: libgomp.c++/ctor-8.C  -O3 -fomit-frame-pointer  (test for excess errors)
WARNING: libgomp.c++/ctor-8.C  -O3 -fomit-frame-pointer  compilation failed to produce executable
FAIL: libgomp.c++/ctor-8.C  -O3 -fomit-frame-pointer -funroll-loops  (test for excess errors)
WARNING: libgomp.c++/ctor-8.C  -O3 -fomit-frame-pointer -funroll-loops  compilation failed to produce executable
FAIL: libgomp.c++/ctor-8.C  -O3 -fomit-frame-pointer -funroll-all-loops -finline-functions  (test for excess errors)
WARNING: libgomp.c++/ctor-8.C  -O3 -fomit-frame-pointer -funroll-all-loops -finline-functions  compilation failed to produce executable
FAIL: libgomp.c++/ctor-8.C  -O3 -g  (test for excess errors)
WARNING: libgomp.c++/ctor-8.C  -O3 -g  compilation failed to produce executable
FAIL: libgomp.c++/ctor-8.C  -Os  (test for excess errors)
WARNING: libgomp.c++/ctor-8.C  -Os  compilation failed to produce executable
FAIL: libgomp.c++/ctor-9.C  -O0  (test for excess errors)
WARNING: libgomp.c++/ctor-9.C  -O0  compilation failed to produce executable
FAIL: libgomp.c++/ctor-9.C  -O1  (test for excess errors)
WARNING: libgomp.c++/ctor-9.C  -O1  compilation failed to produce executable
FAIL: libgomp.c++/ctor-9.C  -O2  (test for excess errors)
WARNING: libgomp.c++/ctor-9.C  -O2  compilation failed to produce executable
FAIL: libgomp.c++/ctor-9.C  -O3 -fomit-frame-pointer  (test for excess errors)
WARNING: libgomp.c++/ctor-9.C  -O3 -fomit-frame-pointer  compilation failed to produce executable
FAIL: libgomp.c++/ctor-9.C  -O3 -fomit-frame-pointer -funroll-loops  (test for excess errors)
WARNING: libgomp.c++/ctor-9.C  -O3 -fomit-frame-pointer -funroll-loops  compilation failed to produce executable
FAIL: libgomp.c++/ctor-9.C  -O3 -fomit-frame-pointer -funroll-all-loops -finline-functions  (test for excess errors)
WARNING: libgomp.c++/ctor-9.C  -O3 -fomit-frame-pointer -funroll-all-loops -finline-functions  compilation failed to produce executable
FAIL: libgomp.c++/ctor-9.C  -O3 -g  (test for excess errors)
WARNING: libgomp.c++/ctor-9.C  -O3 -g  compilation failed to produce executable
FAIL: libgomp.c++/ctor-9.C  -Os  (test for excess errors)
WARNING: libgomp.c++/ctor-9.C  -Os  compilation failed to produce executable
FAIL: libgomp.fortran/appendix-a/a.22.7.f90  -O0  (test for excess errors)
WARNING: libgomp.fortran/appendix-a/a.22.7.f90  -O0  compilation failed to produce executable
FAIL: libgomp.fortran/appendix-a/a.22.7.f90  -O1  (test for excess errors)
WARNING: libgomp.fortran/appendix-a/a.22.7.f90  -O1  compilation failed to produce executable
FAIL: libgomp.fortran/appendix-a/a.22.7.f90  -O2  (test for excess errors)
WARNING: libgomp.fortran/appendix-a/a.22.7.f90  -O2  compilation failed to produce executable
FAIL: libgomp.fortran/appendix-a/a.22.7.f90  -O3 -fomit-frame-pointer  (test for excess errors)
WARNING: libgomp.fortran/appendix-a/a.22.7.f90  -O3 -fomit-frame-pointer  compilation failed to produce executable
FAIL: libgomp.fortran/appendix-a/a.22.7.f90  -O3 -fomit-frame-pointer -funroll-loops  (test for excess errors)
WARNING: libgomp.fortran/appendix-a/a.22.7.f90  -O3 -fomit-frame-pointer -funroll-loops  compilation failed to produce executable
FAIL: libgomp.fortran/appendix-a/a.22.7.f90  -O3 -fomit-frame-pointer -funroll-all-loops -finline-functions  (test for excess errors)
WARNING: libgomp.fortran/appendix-a/a.22.7.f90  -O3 -fomit-frame-pointer -funroll-all-loops -finline-functions  compilation failed to produce executable
FAIL: libgomp.fortran/appendix-a/a.22.7.f90  -O3 -g  (test for excess errors)
WARNING: libgomp.fortran/appendix-a/a.22.7.f90  -O3 -g  compilation failed to produce executable
FAIL: libgomp.fortran/appendix-a/a.22.7.f90  -Os  (test for excess errors)
WARNING: libgomp.fortran/appendix-a/a.22.7.f90  -Os  compilation failed to produce executable
FAIL: libgomp.fortran/omp_atomic2.f90  -O0  (internal compiler error)
FAIL: libgomp.fortran/omp_atomic2.f90  -O0  (test for excess errors)
WARNING: libgomp.fortran/omp_atomic2.f90  -O0  compilation failed to produce executable
FAIL: libgomp.fortran/omp_atomic2.f90  -O1  (internal compiler error)
FAIL: libgomp.fortran/omp_atomic2.f90  -O1  (test for excess errors)
WARNING: libgomp.fortran/omp_atomic2.f90  -O1  compilation failed to produce executable
FAIL: libgomp.fortran/omp_atomic2.f90  -O2  (internal compiler error)
FAIL: libgomp.fortran/omp_atomic2.f90  -O2  (test for excess errors)
WARNING: libgomp.fortran/omp_atomic2.f90  -O2  compilation failed to produce executable
FAIL: libgomp.fortran/omp_atomic2.f90  -O3 -fomit-frame-pointer  (internal compiler error)
FAIL: libgomp.fortran/omp_atomic2.f90  -O3 -fomit-frame-pointer  (test for excess errors)
WARNING: libgomp.fortran/omp_atomic2.f90  -O3 -fomit-frame-pointer  compilation failed to produce executable
FAIL: libgomp.fortran/omp_atomic2.f90  -O3 -fomit-frame-pointer -funroll-loops  (internal compiler error)
FAIL: libgomp.fortran/omp_atomic2.f90  -O3 -fomit-frame-pointer -funroll-loops  (test for excess errors)
WARNING: libgomp.fortran/omp_atomic2.f90  -O3 -fomit-frame-pointer -funroll-loops  compilation failed to produce executable
FAIL: libgomp.fortran/omp_atomic2.f90  -O3 -fomit-frame-pointer -funroll-all-loops -finline-functions  (internal compiler error)
FAIL: libgomp.fortran/omp_atomic2.f90  -O3 -fomit-frame-pointer -funroll-all-loops -finline-functions  (test for excess errors)
WARNING: libgomp.fortran/omp_atomic2.f90  -O3 -fomit-frame-pointer -funroll-all-loops -finline-functions  compilation failed to produce executable
FAIL: libgomp.fortran/omp_atomic2.f90  -O3 -g  (internal compiler error)
FAIL: libgomp.fortran/omp_atomic2.f90  -O3 -g  (test for excess errors)
WARNING: libgomp.fortran/omp_atomic2.f90  -O3 -g  compilation failed to produce executable
FAIL: libgomp.fortran/omp_atomic2.f90  -Os  (internal compiler error)
FAIL: libgomp.fortran/omp_atomic2.f90  -Os  (test for excess errors)
WARNING: libgomp.fortran/omp_atomic2.f90  -Os  compilation failed to produce executable
FAIL: libgomp.fortran/omp_parse3.f90  -O0  (test for excess errors)
WARNING: libgomp.fortran/omp_parse3.f90  -O0  compilation failed to produce executable
FAIL: libgomp.fortran/omp_parse3.f90  -O1  (test for excess errors)
WARNING: libgomp.fortran/omp_parse3.f90  -O1  compilation failed to produce executable
FAIL: libgomp.fortran/omp_parse3.f90  -O2  (test for excess errors)
WARNING: libgomp.fortran/omp_parse3.f90  -O2  compilation failed to produce executable
FAIL: libgomp.fortran/omp_parse3.f90  -O3 -fomit-frame-pointer  (test for excess errors)
WARNING: libgomp.fortran/omp_parse3.f90  -O3 -fomit-frame-pointer  compilation failed to produce executable
FAIL: libgomp.fortran/omp_parse3.f90  -O3 -fomit-frame-pointer -funroll-loops  (test for excess errors)
WARNING: libgomp.fortran/omp_parse3.f90  -O3 -fomit-frame-pointer -funroll-loops  compilation failed to produce executable
FAIL: libgomp.fortran/omp_parse3.f90  -O3 -fomit-frame-pointer -funroll-all-loops -finline-functions  (test for excess errors)
WARNING: libgomp.fortran/omp_parse3.f90  -O3 -fomit-frame-pointer -funroll-all-loops -finline-functions  compilation failed to produce executable
FAIL: libgomp.fortran/omp_parse3.f90  -O3 -g  (test for excess errors)
WARNING: libgomp.fortran/omp_parse3.f90  -O3 -g  compilation failed to produce executable
FAIL: libgomp.fortran/omp_parse3.f90  -Os  (test for excess errors)
WARNING: libgomp.fortran/omp_parse3.f90  -Os  compilation failed to produce executable
FAIL: libgomp.fortran/threadprivate2.f90  -O0  (test for excess errors)
WARNING: libgomp.fortran/threadprivate2.f90  -O0  compilation failed to produce executable
FAIL: libgomp.fortran/threadprivate2.f90  -O1  (test for excess errors)
WARNING: libgomp.fortran/threadprivate2.f90  -O1  compilation failed to produce executable
FAIL: libgomp.fortran/threadprivate2.f90  -O2  (test for excess errors)
WARNING: libgomp.fortran/threadprivate2.f90  -O2  compilation failed to produce executable
FAIL: libgomp.fortran/threadprivate2.f90  -O3 -fomit-frame-pointer  (test for excess errors)
WARNING: libgomp.fortran/threadprivate2.f90  -O3 -fomit-frame-pointer  compilation failed to produce executable
FAIL: libgomp.fortran/threadprivate2.f90  -O3 -fomit-frame-pointer -funroll-loops  (test for excess errors)
WARNING: libgomp.fortran/threadprivate2.f90  -O3 -fomit-frame-pointer -funroll-loops  compilation failed to produce executable
FAIL: libgomp.fortran/threadprivate2.f90  -O3 -fomit-frame-pointer -funroll-all-loops -finline-functions  (test for excess errors)
WARNING: libgomp.fortran/threadprivate2.f90  -O3 -fomit-frame-pointer -funroll-all-loops -finline-functions  compilation failed to produce executable
FAIL: libgomp.fortran/threadprivate2.f90  -O3 -g  (test for excess errors)
WARNING: libgomp.fortran/threadprivate2.f90  -O3 -g  compilation failed to produce executable
FAIL: libgomp.fortran/threadprivate2.f90  -Os  (test for excess errors)
WARNING: libgomp.fortran/threadprivate2.f90  -Os  compilation failed to produce executable
FAIL: libgomp.fortran/threadprivate3.f90  -O0  (test for excess errors)
WARNING: libgomp.fortran/threadprivate3.f90  -O0  compilation failed to produce executable
FAIL: libgomp.fortran/threadprivate3.f90  -O1  (test for excess errors)
WARNING: libgomp.fortran/threadprivate3.f90  -O1  compilation failed to produce executable
FAIL: libgomp.fortran/threadprivate3.f90  -O2  (test for excess errors)
WARNING: libgomp.fortran/threadprivate3.f90  -O2  compilation failed to produce executable
FAIL: libgomp.fortran/threadprivate3.f90  -O3 -fomit-frame-pointer  (test for excess errors)
WARNING: libgomp.fortran/threadprivate3.f90  -O3 -fomit-frame-pointer  compilation failed to produce executable
FAIL: libgomp.fortran/threadprivate3.f90  -O3 -fomit-frame-pointer -funroll-loops  (test for excess errors)
WARNING: libgomp.fortran/threadprivate3.f90  -O3 -fomit-frame-pointer -funroll-loops  compilation failed to produce executable
FAIL: libgomp.fortran/threadprivate3.f90  -O3 -fomit-frame-pointer -funroll-all-loops -finline-functions  (test for excess errors)
WARNING: libgomp.fortran/threadprivate3.f90  -O3 -fomit-frame-pointer -funroll-all-loops -finline-functions  compilation failed to produce executable
FAIL: libgomp.fortran/threadprivate3.f90  -O3 -g  (test for excess errors)
WARNING: libgomp.fortran/threadprivate3.f90  -O3 -g  compilation failed to produce executable
FAIL: libgomp.fortran/threadprivate3.f90  -Os  (test for excess errors)
WARNING: libgomp.fortran/threadprivate3.f90  -Os  compilation failed to produce executable

		=== libgomp Summary ===

# of expected passes		1424
# of unexpected failures	72
# of unsupported tests		7
		=== libjava tests ===


Running target unix
FAIL: getargssize run
FAIL: getlocalvartable run
FAIL: getstacktrace run
FAIL: FileHandleGcTest execution - source compiled test
FAIL: FileHandleGcTest -findirect-dispatch execution - source compiled test
FAIL: FileHandleGcTest -O3 execution - source compiled test
FAIL: FileHandleGcTest -O3 -findirect-dispatch execution - source compiled test
FAIL: InvokeInterface execution - source compiled test
FAIL: InvokeInterface -O3 execution - source compiled test
FAIL: PR27908 -findirect-dispatch execution - source compiled test
FAIL: PR27908 -O3 execution - source compiled test
FAIL: PR27908 -O3 -findirect-dispatch execution - source compiled test

		=== libjava Summary ===

# of expected passes		2515
# of unexpected failures	12
# of untested testcases		12
		=== libstdc++ tests ===


Running target unix
XPASS: 27_io/basic_istream/extractors_arithmetic/char/12.cc execution test
XPASS: 27_io/basic_istream/extractors_arithmetic/wchar_t/12.cc execution test
FAIL: ext/enc_filebuf/char/13598.cc execution test

		=== libstdc++ Summary ===

# of expected passes		4308
# of unexpected failures	1
# of unexpected successes	2
# of expected failures		46
# of unsupported tests		359

Compiler version: 4.3.0 20070520 (experimental)
Platform: sparc-sun-solaris2.10
configure flags: --verbose --enable-languages=c,c++,objc,f95,obj-c++,java,treelang --with-local-prefix=/usr/local/gnu --without-libiconv-prefix --with-mpfr=/caip/u12/kishgcc/gcc-testing/421-221/_gmp


Index Nav: [Date Index] [Subject Index] [Author Index] [Thread Index]
Message Nav: [Date Prev] [Date Next] [Thread Prev] [Thread Next]