This is the mail archive of the gcc-testresults@gcc.gnu.org mailing list for the GCC project.


Index Nav: [Date Index] [Subject Index] [Author Index] [Thread Index]
Message Nav: [Date Prev] [Date Next] [Thread Prev] [Thread Next]
Other format: [Raw text]

Results for 4.1.3 20070510 (prerelease) gcc testsuite on h8300-unknown-elf


Ubuntu 5 on pentium3-smp
cross tool versions:
GNU assembler (GNU Binutils) 2.17.50.20070506
GNU gdb 6.6.50.20070506-cvs
GNU ld (GNU Binutils) 2.17.50.20070506

GNU Make 3.80
expect version 5.42.1
host gcc version: gcc (GCC) 4.3.0 20070510 (experimental)
LAST_UPDATED: Thu May 10 22:08:03 UTC 2007 (revision 124603)

Target is h8300-unknown-elf
Host   is i686-pc-linux-gnu

		=== gcc tests ===


Running target h8300-sim
FAIL: gcc.c-torture/compile/20000804-1.c  -O0  (test for excess errors)
FAIL: gcc.c-torture/compile/20001226-1.c  -O3 -g  (test for excess errors)
FAIL: gcc.c-torture/compile/20010327-1.c  -O0  (test for excess errors)
FAIL: gcc.c-torture/compile/20010327-1.c  -O1  (test for excess errors)
FAIL: gcc.c-torture/compile/20010327-1.c  -O2  (test for excess errors)
FAIL: gcc.c-torture/compile/20010327-1.c  -O3 -fomit-frame-pointer  (test for excess errors)
FAIL: gcc.c-torture/compile/20010327-1.c  -O3 -g  (test for excess errors)
FAIL: gcc.c-torture/compile/20010327-1.c  -Os  (test for excess errors)
FAIL: gcc.c-torture/compile/20020604-1.c  -O0  (test for excess errors)
FAIL: gcc.c-torture/compile/20020604-1.c  -O1  (test for excess errors)
FAIL: gcc.c-torture/compile/20020604-1.c  -O2  (test for excess errors)
FAIL: gcc.c-torture/compile/20020604-1.c  -O3 -fomit-frame-pointer  (test for excess errors)
FAIL: gcc.c-torture/compile/20020604-1.c  -O3 -fomit-frame-pointer -funroll-loops  (test for excess errors)
FAIL: gcc.c-torture/compile/20020604-1.c  -O3 -fomit-frame-pointer -funroll-all-loops -finline-functions  (test for excess errors)
FAIL: gcc.c-torture/compile/20020604-1.c  -O3 -g  (test for excess errors)
FAIL: gcc.c-torture/compile/20020604-1.c  -Os  (test for excess errors)
FAIL: gcc.c-torture/compile/20050303-1.c  -O0  (test for excess errors)
FAIL: gcc.c-torture/compile/20050303-1.c  -O1  (test for excess errors)
FAIL: gcc.c-torture/compile/20050303-1.c  -O2  (test for excess errors)
FAIL: gcc.c-torture/compile/20050303-1.c  -O3 -fomit-frame-pointer  (test for excess errors)
FAIL: gcc.c-torture/compile/20050303-1.c  -O3 -fomit-frame-pointer -funroll-loops  (test for excess errors)
FAIL: gcc.c-torture/compile/20050303-1.c  -O3 -fomit-frame-pointer -funroll-all-loops -finline-functions  (test for excess errors)
FAIL: gcc.c-torture/compile/20050303-1.c  -O3 -g  (test for excess errors)
FAIL: gcc.c-torture/compile/20050303-1.c  -Os  (test for excess errors)
FAIL: gcc.c-torture/compile/930117-1.c  -O1  (test for excess errors)
FAIL: gcc.c-torture/compile/930117-1.c  -O2  (test for excess errors)
FAIL: gcc.c-torture/compile/930117-1.c  -O3 -fomit-frame-pointer  (test for excess errors)
FAIL: gcc.c-torture/compile/930117-1.c  -O3 -g  (test for excess errors)
FAIL: gcc.c-torture/compile/930117-1.c  -Os  (test for excess errors)
FAIL: gcc.c-torture/compile/980506-1.c  -O0  (test for excess errors)
FAIL: gcc.c-torture/compile/980506-1.c  -O1  (test for excess errors)
FAIL: gcc.c-torture/compile/980506-1.c  -O2  (test for excess errors)
FAIL: gcc.c-torture/compile/980506-1.c  -O3 -fomit-frame-pointer  (test for excess errors)
FAIL: gcc.c-torture/compile/980506-1.c  -O3 -fomit-frame-pointer -funroll-loops  (test for excess errors)
FAIL: gcc.c-torture/compile/980506-1.c  -O3 -fomit-frame-pointer -funroll-all-loops -finline-functions  (test for excess errors)
FAIL: gcc.c-torture/compile/980506-1.c  -O3 -g  (test for excess errors)
FAIL: gcc.c-torture/compile/980506-1.c  -Os  (test for excess errors)
FAIL: gcc.c-torture/execute/builtins/20010124-1.c execution,  -O0 
FAIL: gcc.c-torture/execute/builtins/20010124-1.c execution,  -O1 
FAIL: gcc.c-torture/execute/builtins/20010124-1.c execution,  -O2 
FAIL: gcc.c-torture/execute/builtins/20010124-1.c execution,  -O3 -fomit-frame-pointer 
FAIL: gcc.c-torture/execute/builtins/20010124-1.c execution,  -O3 -g 
FAIL: gcc.c-torture/execute/builtins/20010124-1.c execution,  -Os 
FAIL: gcc.c-torture/execute/builtins/fprintf.c execution,  -O0 
FAIL: gcc.c-torture/execute/builtins/fprintf.c execution,  -O1 
FAIL: gcc.c-torture/execute/builtins/fprintf.c execution,  -O2 
FAIL: gcc.c-torture/execute/builtins/fprintf.c execution,  -O3 -fomit-frame-pointer 
FAIL: gcc.c-torture/execute/builtins/fprintf.c execution,  -O3 -g 
FAIL: gcc.c-torture/execute/builtins/fprintf.c execution,  -Os 
FAIL: gcc.c-torture/execute/builtins/fputs.c execution,  -O0 
FAIL: gcc.c-torture/execute/builtins/fputs.c execution,  -O1 
FAIL: gcc.c-torture/execute/builtins/fputs.c execution,  -O2 
FAIL: gcc.c-torture/execute/builtins/fputs.c execution,  -O3 -fomit-frame-pointer 
FAIL: gcc.c-torture/execute/builtins/fputs.c execution,  -O3 -g 
FAIL: gcc.c-torture/execute/builtins/fputs.c execution,  -Os 
FAIL: gcc.c-torture/execute/builtins/memcmp.c execution,  -O0 
FAIL: gcc.c-torture/execute/builtins/memcmp.c execution,  -O1 
FAIL: gcc.c-torture/execute/builtins/memcmp.c execution,  -O2 
FAIL: gcc.c-torture/execute/builtins/memcmp.c execution,  -O3 -fomit-frame-pointer 
FAIL: gcc.c-torture/execute/builtins/memcmp.c execution,  -O3 -g 
FAIL: gcc.c-torture/execute/builtins/memcmp.c execution,  -Os 
FAIL: gcc.c-torture/execute/builtins/memmove-2.c execution,  -O0 
FAIL: gcc.c-torture/execute/builtins/memmove-2.c execution,  -O1 
FAIL: gcc.c-torture/execute/builtins/memmove-2.c execution,  -O2 
FAIL: gcc.c-torture/execute/builtins/memmove-2.c execution,  -O3 -fomit-frame-pointer 
FAIL: gcc.c-torture/execute/builtins/memmove-2.c execution,  -O3 -g 
FAIL: gcc.c-torture/execute/builtins/memmove-2.c execution,  -Os 
FAIL: gcc.c-torture/execute/builtins/memmove.c execution,  -O0 
FAIL: gcc.c-torture/execute/builtins/memmove.c execution,  -O1 
FAIL: gcc.c-torture/execute/builtins/memmove.c execution,  -O2 
FAIL: gcc.c-torture/execute/builtins/memmove.c execution,  -O3 -fomit-frame-pointer 
FAIL: gcc.c-torture/execute/builtins/memmove.c execution,  -O3 -g 
FAIL: gcc.c-torture/execute/builtins/memmove.c execution,  -Os 
FAIL: gcc.c-torture/execute/builtins/memops-asm.c execution,  -O0 
FAIL: gcc.c-torture/execute/builtins/memops-asm.c execution,  -O1 
FAIL: gcc.c-torture/execute/builtins/memops-asm.c execution,  -O2 
FAIL: gcc.c-torture/execute/builtins/memops-asm.c execution,  -O3 -fomit-frame-pointer 
FAIL: gcc.c-torture/execute/builtins/memops-asm.c execution,  -O3 -g 
FAIL: gcc.c-torture/execute/builtins/memops-asm.c execution,  -Os 
FAIL: gcc.c-torture/execute/builtins/mempcpy-2.c execution,  -O0 
WARNING: program timed out.
FAIL: gcc.c-torture/execute/builtins/mempcpy-2.c execution,  -O1 
WARNING: program timed out.
FAIL: gcc.c-torture/execute/builtins/mempcpy-2.c execution,  -O2 
WARNING: program timed out.
FAIL: gcc.c-torture/execute/builtins/mempcpy-2.c execution,  -O3 -fomit-frame-pointer 
WARNING: program timed out.
FAIL: gcc.c-torture/execute/builtins/mempcpy-2.c execution,  -O3 -g 
WARNING: program timed out.
FAIL: gcc.c-torture/execute/builtins/mempcpy-2.c execution,  -Os 
FAIL: gcc.c-torture/execute/builtins/mempcpy.c execution,  -O0 
FAIL: gcc.c-torture/execute/builtins/mempcpy.c execution,  -O1 
FAIL: gcc.c-torture/execute/builtins/mempcpy.c execution,  -O2 
FAIL: gcc.c-torture/execute/builtins/mempcpy.c execution,  -O3 -fomit-frame-pointer 
FAIL: gcc.c-torture/execute/builtins/mempcpy.c execution,  -O3 -g 
FAIL: gcc.c-torture/execute/builtins/mempcpy.c execution,  -Os 
FAIL: gcc.c-torture/execute/builtins/pr22237.c execution,  -O0 
FAIL: gcc.c-torture/execute/builtins/pr22237.c execution,  -O1 
FAIL: gcc.c-torture/execute/builtins/pr22237.c execution,  -O2 
FAIL: gcc.c-torture/execute/builtins/pr22237.c execution,  -O3 -fomit-frame-pointer 
FAIL: gcc.c-torture/execute/builtins/pr22237.c execution,  -O3 -g 
FAIL: gcc.c-torture/execute/builtins/pr22237.c execution,  -Os 
FAIL: gcc.c-torture/execute/builtins/pr23484-chk.c execution,  -O1 
FAIL: gcc.c-torture/execute/builtins/pr23484-chk.c execution,  -O2 
FAIL: gcc.c-torture/execute/builtins/pr23484-chk.c execution,  -O3 -fomit-frame-pointer 
FAIL: gcc.c-torture/execute/builtins/pr23484-chk.c execution,  -O3 -g 
FAIL: gcc.c-torture/execute/builtins/pr23484-chk.c execution,  -Os 
FAIL: gcc.c-torture/execute/builtins/snprintf-chk.c execution,  -O1 
FAIL: gcc.c-torture/execute/builtins/snprintf-chk.c execution,  -O2 
FAIL: gcc.c-torture/execute/builtins/snprintf-chk.c execution,  -O3 -fomit-frame-pointer 
FAIL: gcc.c-torture/execute/builtins/snprintf-chk.c execution,  -O3 -fomit-frame-pointer -funroll-loops 
FAIL: gcc.c-torture/execute/builtins/snprintf-chk.c execution,  -O3 -fomit-frame-pointer -funroll-all-loops -finline-functions 
FAIL: gcc.c-torture/execute/builtins/snprintf-chk.c execution,  -O3 -g 
FAIL: gcc.c-torture/execute/builtins/snprintf-chk.c execution,  -Os 
FAIL: gcc.c-torture/execute/builtins/sprintf-chk.c execution,  -O1 
FAIL: gcc.c-torture/execute/builtins/sprintf-chk.c execution,  -O2 
FAIL: gcc.c-torture/execute/builtins/sprintf-chk.c execution,  -O3 -fomit-frame-pointer 
FAIL: gcc.c-torture/execute/builtins/sprintf-chk.c execution,  -O3 -fomit-frame-pointer -funroll-loops 
FAIL: gcc.c-torture/execute/builtins/sprintf-chk.c execution,  -O3 -fomit-frame-pointer -funroll-all-loops -finline-functions 
FAIL: gcc.c-torture/execute/builtins/sprintf-chk.c execution,  -O3 -g 
FAIL: gcc.c-torture/execute/builtins/sprintf-chk.c execution,  -Os 
WARNING: program timed out.
FAIL: gcc.c-torture/execute/builtins/sprintf.c execution,  -O0 
WARNING: program timed out.
FAIL: gcc.c-torture/execute/builtins/sprintf.c execution,  -O1 
WARNING: program timed out.
FAIL: gcc.c-torture/execute/builtins/sprintf.c execution,  -O2 
FAIL: gcc.c-torture/execute/builtins/sprintf.c execution,  -O3 -fomit-frame-pointer 
FAIL: gcc.c-torture/execute/builtins/sprintf.c execution,  -O3 -g 
FAIL: gcc.c-torture/execute/builtins/sprintf.c execution,  -Os 
FAIL: gcc.c-torture/execute/builtins/strcat-chk.c execution,  -O1 
FAIL: gcc.c-torture/execute/builtins/strcat-chk.c execution,  -O2 
FAIL: gcc.c-torture/execute/builtins/strcat-chk.c execution,  -O3 -fomit-frame-pointer 
FAIL: gcc.c-torture/execute/builtins/strcat-chk.c execution,  -O3 -fomit-frame-pointer -funroll-loops 
FAIL: gcc.c-torture/execute/builtins/strcat-chk.c execution,  -O3 -fomit-frame-pointer -funroll-all-loops -finline-functions 
FAIL: gcc.c-torture/execute/builtins/strcat-chk.c execution,  -O3 -g 
FAIL: gcc.c-torture/execute/builtins/strcat-chk.c execution,  -Os 
FAIL: gcc.c-torture/execute/builtins/strcat.c execution,  -O0 
FAIL: gcc.c-torture/execute/builtins/strcat.c execution,  -O1 
FAIL: gcc.c-torture/execute/builtins/strcat.c execution,  -O2 
FAIL: gcc.c-torture/execute/builtins/strcat.c execution,  -O3 -fomit-frame-pointer 
FAIL: gcc.c-torture/execute/builtins/strcat.c execution,  -O3 -fomit-frame-pointer -funroll-loops 
FAIL: gcc.c-torture/execute/builtins/strcat.c execution,  -O3 -fomit-frame-pointer -funroll-all-loops -finline-functions 
FAIL: gcc.c-torture/execute/builtins/strcat.c execution,  -O3 -g 
FAIL: gcc.c-torture/execute/builtins/strcat.c execution,  -Os 
WARNING: program timed out.
FAIL: gcc.c-torture/execute/builtins/strcpy-2.c execution,  -O1 
WARNING: program timed out.
FAIL: gcc.c-torture/execute/builtins/strcpy-2.c execution,  -O2 
WARNING: program timed out.
FAIL: gcc.c-torture/execute/builtins/strcpy-2.c execution,  -O3 -fomit-frame-pointer 
FAIL: gcc.c-torture/execute/builtins/strcpy-2.c execution,  -O3 -fomit-frame-pointer -funroll-loops 
FAIL: gcc.c-torture/execute/builtins/strcpy-2.c execution,  -O3 -fomit-frame-pointer -funroll-all-loops -finline-functions 
WARNING: program timed out.
FAIL: gcc.c-torture/execute/builtins/strcpy-2.c execution,  -O3 -g 
FAIL: gcc.c-torture/execute/builtins/strcpy.c execution,  -O0 
FAIL: gcc.c-torture/execute/builtins/strcpy.c execution,  -O1 
FAIL: gcc.c-torture/execute/builtins/strcpy.c execution,  -O2 
FAIL: gcc.c-torture/execute/builtins/strcpy.c execution,  -O3 -fomit-frame-pointer 
FAIL: gcc.c-torture/execute/builtins/strcpy.c execution,  -O3 -g 
FAIL: gcc.c-torture/execute/builtins/strcpy.c execution,  -Os 
FAIL: gcc.c-torture/execute/builtins/strcspn.c execution,  -O0 
FAIL: gcc.c-torture/execute/builtins/strcspn.c execution,  -O1 
FAIL: gcc.c-torture/execute/builtins/strcspn.c execution,  -O2 
FAIL: gcc.c-torture/execute/builtins/strcspn.c execution,  -O3 -fomit-frame-pointer 
FAIL: gcc.c-torture/execute/builtins/strcspn.c execution,  -O3 -g 
FAIL: gcc.c-torture/execute/builtins/strcspn.c execution,  -Os 
FAIL: gcc.c-torture/execute/builtins/strlen.c execution,  -O0 
FAIL: gcc.c-torture/execute/builtins/strlen.c execution,  -Os 
FAIL: gcc.c-torture/execute/builtins/strncat-chk.c execution,  -O1 
FAIL: gcc.c-torture/execute/builtins/strncat-chk.c execution,  -O2 
FAIL: gcc.c-torture/execute/builtins/strncat-chk.c execution,  -O3 -fomit-frame-pointer 
FAIL: gcc.c-torture/execute/builtins/strncat-chk.c execution,  -O3 -fomit-frame-pointer -funroll-loops 
FAIL: gcc.c-torture/execute/builtins/strncat-chk.c execution,  -O3 -fomit-frame-pointer -funroll-all-loops -finline-functions 
FAIL: gcc.c-torture/execute/builtins/strncat-chk.c execution,  -O3 -g 
FAIL: gcc.c-torture/execute/builtins/strncat-chk.c execution,  -Os 
FAIL: gcc.c-torture/execute/builtins/strncat.c execution,  -O0 
FAIL: gcc.c-torture/execute/builtins/strncat.c execution,  -O1 
FAIL: gcc.c-torture/execute/builtins/strncat.c execution,  -O2 
FAIL: gcc.c-torture/execute/builtins/strncat.c execution,  -O3 -fomit-frame-pointer 
FAIL: gcc.c-torture/execute/builtins/strncat.c execution,  -O3 -fomit-frame-pointer -funroll-loops 
FAIL: gcc.c-torture/execute/builtins/strncat.c execution,  -O3 -fomit-frame-pointer -funroll-all-loops -finline-functions 
FAIL: gcc.c-torture/execute/builtins/strncat.c execution,  -O3 -g 
FAIL: gcc.c-torture/execute/builtins/strncat.c execution,  -Os 
FAIL: gcc.c-torture/execute/builtins/strncpy-chk.c execution,  -O1 
FAIL: gcc.c-torture/execute/builtins/strncpy-chk.c execution,  -O2 
FAIL: gcc.c-torture/execute/builtins/strncpy-chk.c execution,  -O3 -fomit-frame-pointer 
FAIL: gcc.c-torture/execute/builtins/strncpy-chk.c execution,  -O3 -fomit-frame-pointer -funroll-loops 
FAIL: gcc.c-torture/execute/builtins/strncpy-chk.c execution,  -O3 -fomit-frame-pointer -funroll-all-loops -finline-functions 
FAIL: gcc.c-torture/execute/builtins/strncpy-chk.c execution,  -O3 -g 
FAIL: gcc.c-torture/execute/builtins/strncpy-chk.c execution,  -Os 
FAIL: gcc.c-torture/execute/builtins/strncpy.c execution,  -O0 
FAIL: gcc.c-torture/execute/builtins/strncpy.c execution,  -O1 
FAIL: gcc.c-torture/execute/builtins/strncpy.c execution,  -O2 
FAIL: gcc.c-torture/execute/builtins/strncpy.c execution,  -O3 -fomit-frame-pointer 
FAIL: gcc.c-torture/execute/builtins/strncpy.c execution,  -O3 -g 
FAIL: gcc.c-torture/execute/builtins/strncpy.c execution,  -Os 
FAIL: gcc.c-torture/execute/builtins/strpbrk.c execution,  -O0 
FAIL: gcc.c-torture/execute/builtins/strpbrk.c execution,  -O1 
FAIL: gcc.c-torture/execute/builtins/strpbrk.c execution,  -O2 
FAIL: gcc.c-torture/execute/builtins/strpbrk.c execution,  -O3 -fomit-frame-pointer 
FAIL: gcc.c-torture/execute/builtins/strpbrk.c execution,  -O3 -g 
FAIL: gcc.c-torture/execute/builtins/strpbrk.c execution,  -Os 
FAIL: gcc.c-torture/execute/builtins/strpcpy-2.c execution,  -O0 
WARNING: program timed out.
FAIL: gcc.c-torture/execute/builtins/strpcpy-2.c execution,  -O1 
WARNING: program timed out.
FAIL: gcc.c-torture/execute/builtins/strpcpy-2.c execution,  -O2 
WARNING: program timed out.
FAIL: gcc.c-torture/execute/builtins/strpcpy-2.c execution,  -O3 -fomit-frame-pointer 
WARNING: program timed out.
FAIL: gcc.c-torture/execute/builtins/strpcpy-2.c execution,  -O3 -g 
WARNING: program timed out.
FAIL: gcc.c-torture/execute/builtins/strpcpy-2.c execution,  -Os 
FAIL: gcc.c-torture/execute/builtins/strpcpy.c execution,  -O0 
FAIL: gcc.c-torture/execute/builtins/strpcpy.c execution,  -O1 
FAIL: gcc.c-torture/execute/builtins/strpcpy.c execution,  -O2 
WARNING: program timed out.
FAIL: gcc.c-torture/execute/builtins/strpcpy.c execution,  -O3 -fomit-frame-pointer 
WARNING: program timed out.
FAIL: gcc.c-torture/execute/builtins/strpcpy.c execution,  -O3 -g 
FAIL: gcc.c-torture/execute/builtins/strpcpy.c execution,  -Os 
FAIL: gcc.c-torture/execute/builtins/strrchr.c execution,  -O0 
FAIL: gcc.c-torture/execute/builtins/strrchr.c execution,  -O1 
FAIL: gcc.c-torture/execute/builtins/strrchr.c execution,  -O2 
FAIL: gcc.c-torture/execute/builtins/strrchr.c execution,  -O3 -fomit-frame-pointer 
FAIL: gcc.c-torture/execute/builtins/strrchr.c execution,  -O3 -g 
FAIL: gcc.c-torture/execute/builtins/strrchr.c execution,  -Os 
FAIL: gcc.c-torture/execute/builtins/strspn.c execution,  -O0 
FAIL: gcc.c-torture/execute/builtins/strspn.c execution,  -O1 
WARNING: program timed out.
FAIL: gcc.c-torture/execute/builtins/strspn.c execution,  -O2 
FAIL: gcc.c-torture/execute/builtins/strspn.c execution,  -O3 -fomit-frame-pointer 
WARNING: program timed out.
FAIL: gcc.c-torture/execute/builtins/strspn.c execution,  -O3 -g 
FAIL: gcc.c-torture/execute/builtins/strstr-asm.c execution,  -O0 
FAIL: gcc.c-torture/execute/builtins/strstr-asm.c execution,  -O1 
FAIL: gcc.c-torture/execute/builtins/strstr-asm.c execution,  -O2 
FAIL: gcc.c-torture/execute/builtins/strstr-asm.c execution,  -O3 -fomit-frame-pointer 
FAIL: gcc.c-torture/execute/builtins/strstr-asm.c execution,  -O3 -g 
FAIL: gcc.c-torture/execute/builtins/strstr-asm.c execution,  -Os 
FAIL: gcc.c-torture/execute/builtins/strstr.c execution,  -O0 
FAIL: gcc.c-torture/execute/builtins/vsnprintf-chk.c execution,  -O1 
FAIL: gcc.c-torture/execute/builtins/vsnprintf-chk.c execution,  -O2 
FAIL: gcc.c-torture/execute/builtins/vsnprintf-chk.c execution,  -O3 -fomit-frame-pointer 
FAIL: gcc.c-torture/execute/builtins/vsnprintf-chk.c execution,  -O3 -fomit-frame-pointer -funroll-loops 
FAIL: gcc.c-torture/execute/builtins/vsnprintf-chk.c execution,  -O3 -fomit-frame-pointer -funroll-all-loops -finline-functions 
FAIL: gcc.c-torture/execute/builtins/vsnprintf-chk.c execution,  -O3 -g 
FAIL: gcc.c-torture/execute/builtins/vsnprintf-chk.c execution,  -Os 
FAIL: gcc.c-torture/execute/builtins/vsprintf-chk.c execution,  -O1 
FAIL: gcc.c-torture/execute/builtins/vsprintf-chk.c execution,  -O2 
FAIL: gcc.c-torture/execute/builtins/vsprintf-chk.c execution,  -O3 -fomit-frame-pointer 
WARNING: program timed out.
FAIL: gcc.c-torture/execute/builtins/vsprintf-chk.c execution,  -O3 -fomit-frame-pointer -funroll-loops 
WARNING: program timed out.
FAIL: gcc.c-torture/execute/builtins/vsprintf-chk.c execution,  -O3 -fomit-frame-pointer -funroll-all-loops -finline-functions 
FAIL: gcc.c-torture/execute/builtins/vsprintf-chk.c execution,  -O3 -g 
FAIL: gcc.c-torture/execute/builtins/vsprintf-chk.c execution,  -Os 
FAIL: gcc.c-torture/execute/20000112-1.c execution,  -O0 
FAIL: gcc.c-torture/execute/20000112-1.c execution,  -O1 
FAIL: gcc.c-torture/execute/20000112-1.c execution,  -O2 
FAIL: gcc.c-torture/execute/20000112-1.c execution,  -Os 
FAIL: gcc.c-torture/execute/20000113-1.c execution,  -O0 
FAIL: gcc.c-torture/execute/20000113-1.c execution,  -O1 
FAIL: gcc.c-torture/execute/20000113-1.c execution,  -O2 
FAIL: gcc.c-torture/execute/20000113-1.c execution,  -Os 
FAIL: gcc.c-torture/execute/20000224-1.c execution,  -O0 
FAIL: gcc.c-torture/execute/20000224-1.c execution,  -O1 
FAIL: gcc.c-torture/execute/20000224-1.c execution,  -O2 
FAIL: gcc.c-torture/execute/20000224-1.c execution,  -O3 -fomit-frame-pointer 
FAIL: gcc.c-torture/execute/20000224-1.c execution,  -O3 -fomit-frame-pointer -funroll-loops 
FAIL: gcc.c-torture/execute/20000224-1.c execution,  -O3 -fomit-frame-pointer -funroll-all-loops -finline-functions 
FAIL: gcc.c-torture/execute/20000224-1.c execution,  -O3 -g 
FAIL: gcc.c-torture/execute/20000224-1.c execution,  -Os 
FAIL: gcc.c-torture/execute/20000314-3.c execution,  -O0 
FAIL: gcc.c-torture/execute/20000314-3.c execution,  -O1 
FAIL: gcc.c-torture/execute/20000314-3.c execution,  -O2 
FAIL: gcc.c-torture/execute/20000403-1.c execution,  -O0 
FAIL: gcc.c-torture/execute/20000403-1.c execution,  -O1 
FAIL: gcc.c-torture/execute/20000403-1.c execution,  -O2 
FAIL: gcc.c-torture/execute/20000412-1.c execution,  -O0 
FAIL: gcc.c-torture/execute/20000412-1.c execution,  -O1 
FAIL: gcc.c-torture/execute/20000412-1.c execution,  -O2 
FAIL: gcc.c-torture/execute/20000412-2.c execution,  -O0 
FAIL: gcc.c-torture/execute/20000412-2.c execution,  -O1 
FAIL: gcc.c-torture/execute/20000412-2.c execution,  -O2 
FAIL: gcc.c-torture/execute/20000412-2.c execution,  -O3 -fomit-frame-pointer 
FAIL: gcc.c-torture/execute/20000412-2.c execution,  -O3 -g 
FAIL: gcc.c-torture/execute/20000412-2.c execution,  -Os 
FAIL: gcc.c-torture/execute/20000412-3.c execution,  -O0 
FAIL: gcc.c-torture/execute/20000412-3.c execution,  -O1 
FAIL: gcc.c-torture/execute/20000412-3.c execution,  -O2 
FAIL: gcc.c-torture/execute/20000412-3.c execution,  -O3 -fomit-frame-pointer 
FAIL: gcc.c-torture/execute/20000412-3.c execution,  -O3 -g 
FAIL: gcc.c-torture/execute/20000412-3.c execution,  -Os 
FAIL: gcc.c-torture/execute/20000412-4.c execution,  -O0 
FAIL: gcc.c-torture/execute/20000412-4.c execution,  -O1 
FAIL: gcc.c-torture/execute/20000412-4.c execution,  -O2 
FAIL: gcc.c-torture/execute/20000412-4.c execution,  -O3 -fomit-frame-pointer 
FAIL: gcc.c-torture/execute/20000412-4.c execution,  -O3 -fomit-frame-pointer -funroll-loops 
FAIL: gcc.c-torture/execute/20000412-4.c execution,  -O3 -fomit-frame-pointer -funroll-all-loops -finline-functions 
FAIL: gcc.c-torture/execute/20000412-4.c execution,  -O3 -g 
FAIL: gcc.c-torture/execute/20000412-4.c execution,  -Os 
FAIL: gcc.c-torture/execute/20000412-6.c execution,  -O0 
FAIL: gcc.c-torture/execute/20000412-6.c execution,  -O1 
FAIL: gcc.c-torture/execute/20000412-6.c execution,  -O2 
FAIL: gcc.c-torture/execute/20000412-6.c execution,  -O3 -fomit-frame-pointer 
FAIL: gcc.c-torture/execute/20000412-6.c execution,  -O3 -g 
FAIL: gcc.c-torture/execute/20000412-6.c execution,  -Os 
FAIL: gcc.c-torture/execute/20000419-1.c execution,  -O0 
FAIL: gcc.c-torture/execute/20000419-1.c execution,  -O1 
FAIL: gcc.c-torture/execute/20000419-1.c execution,  -O2 
FAIL: gcc.c-torture/execute/20000419-1.c execution,  -Os 
FAIL: gcc.c-torture/execute/20000422-1.c execution,  -O0 
FAIL: gcc.c-torture/execute/20000422-1.c execution,  -O1 
FAIL: gcc.c-torture/execute/20000422-1.c execution,  -O2 
FAIL: gcc.c-torture/execute/20000422-1.c execution,  -O3 -fomit-frame-pointer 
FAIL: gcc.c-torture/execute/20000422-1.c execution,  -O3 -fomit-frame-pointer -funroll-loops 
FAIL: gcc.c-torture/execute/20000422-1.c execution,  -O3 -fomit-frame-pointer -funroll-all-loops -finline-functions 
FAIL: gcc.c-torture/execute/20000422-1.c execution,  -O3 -g 
FAIL: gcc.c-torture/execute/20000422-1.c execution,  -Os 
FAIL: gcc.c-torture/execute/20000605-2.c execution,  -O1 
FAIL: gcc.c-torture/execute/20000605-2.c execution,  -O2 
FAIL: gcc.c-torture/execute/20000605-2.c execution,  -Os 
FAIL: gcc.c-torture/execute/20000703-1.c execution,  -O0 
FAIL: gcc.c-torture/execute/20000703-1.c execution,  -O1 
FAIL: gcc.c-torture/execute/20000703-1.c execution,  -O2 
FAIL: gcc.c-torture/execute/20000703-1.c execution,  -O3 -fomit-frame-pointer 
FAIL: gcc.c-torture/execute/20000703-1.c execution,  -O3 -g 
FAIL: gcc.c-torture/execute/20000703-1.c execution,  -Os 
FAIL: gcc.c-torture/execute/20000706-1.c execution,  -O0 
WARNING: program timed out.
FAIL: gcc.c-torture/execute/20000706-1.c execution,  -O1 
FAIL: gcc.c-torture/execute/20000706-1.c execution,  -O2 
FAIL: gcc.c-torture/execute/20000706-1.c execution,  -Os 
FAIL: gcc.c-torture/execute/20000706-2.c execution,  -O0 
FAIL: gcc.c-torture/execute/20000706-2.c execution,  -O1 
WARNING: program timed out.
FAIL: gcc.c-torture/execute/20000706-2.c execution,  -O2 
WARNING: program timed out.
FAIL: gcc.c-torture/execute/20000706-2.c execution,  -Os 
FAIL: gcc.c-torture/execute/20000706-5.c execution,  -O0 
FAIL: gcc.c-torture/execute/20000706-5.c execution,  -O1 
FAIL: gcc.c-torture/execute/20000706-5.c execution,  -O2 
FAIL: gcc.c-torture/execute/20000706-5.c execution,  -Os 
FAIL: gcc.c-torture/execute/20000707-1.c execution,  -O0 
FAIL: gcc.c-torture/execute/20000707-1.c execution,  -O1 
FAIL: gcc.c-torture/execute/20000707-1.c execution,  -O2 
FAIL: gcc.c-torture/execute/20000707-1.c execution,  -Os 
FAIL: gcc.c-torture/execute/20000715-1.c execution,  -O1 
FAIL: gcc.c-torture/execute/20000717-1.c execution,  -O0 
FAIL: gcc.c-torture/execute/20000717-1.c execution,  -O1 
FAIL: gcc.c-torture/execute/20000717-1.c execution,  -O2 
FAIL: gcc.c-torture/execute/20000717-1.c execution,  -Os 
FAIL: gcc.c-torture/execute/20000717-3.c execution,  -O0 
FAIL: gcc.c-torture/execute/20000717-3.c execution,  -O1 
FAIL: gcc.c-torture/execute/20000717-3.c execution,  -O2 
FAIL: gcc.c-torture/execute/20000717-5.c execution,  -O0 
FAIL: gcc.c-torture/execute/20000717-5.c execution,  -O1 
FAIL: gcc.c-torture/execute/20000717-5.c execution,  -O2 
FAIL: gcc.c-torture/execute/20000717-5.c execution,  -Os 
FAIL: gcc.c-torture/execute/20000722-1.c execution,  -O1 
FAIL: gcc.c-torture/execute/20000722-1.c execution,  -O2 
FAIL: gcc.c-torture/execute/20000722-1.c execution,  -Os 
FAIL: gcc.c-torture/execute/20000726-1.c execution,  -O1 
FAIL: gcc.c-torture/execute/20000731-1.c execution,  -O0 
FAIL: gcc.c-torture/execute/20000731-1.c execution,  -O1 
FAIL: gcc.c-torture/execute/20000731-1.c execution,  -O2 
FAIL: gcc.c-torture/execute/20000731-1.c execution,  -O3 -fomit-frame-pointer 
FAIL: gcc.c-torture/execute/20000731-1.c execution,  -O3 -g 
FAIL: gcc.c-torture/execute/20000731-1.c execution,  -Os 
FAIL: gcc.c-torture/execute/20000801-4.c execution,  -O0 
FAIL: gcc.c-torture/execute/20000801-4.c execution,  -O1 
FAIL: gcc.c-torture/execute/20000801-4.c execution,  -O2 
FAIL: gcc.c-torture/execute/20000808-1.c execution,  -O0 
FAIL: gcc.c-torture/execute/20000808-1.c execution,  -O1 
FAIL: gcc.c-torture/execute/20000808-1.c execution,  -O2 
FAIL: gcc.c-torture/execute/20000808-1.c execution,  -Os 
FAIL: gcc.c-torture/execute/20000819-1.c execution,  -O1 
FAIL: gcc.c-torture/execute/20000819-1.c execution,  -O2 
FAIL: gcc.c-torture/execute/20000819-1.c execution,  -O3 -fomit-frame-pointer -funroll-loops 
FAIL: gcc.c-torture/execute/20000819-1.c execution,  -O3 -fomit-frame-pointer -funroll-all-loops -finline-functions 
FAIL: gcc.c-torture/execute/20000819-1.c execution,  -Os 
FAIL: gcc.c-torture/execute/20000910-2.c execution,  -O0 
FAIL: gcc.c-torture/execute/20000910-2.c execution,  -O1 
FAIL: gcc.c-torture/execute/20000910-2.c execution,  -O2 
FAIL: gcc.c-torture/execute/20000910-2.c execution,  -O3 -fomit-frame-pointer 
FAIL: gcc.c-torture/execute/20000910-2.c execution,  -O3 -fomit-frame-pointer -funroll-loops 
FAIL: gcc.c-torture/execute/20000910-2.c execution,  -O3 -fomit-frame-pointer -funroll-all-loops -finline-functions 
FAIL: gcc.c-torture/execute/20000910-2.c execution,  -O3 -g 
FAIL: gcc.c-torture/execute/20000910-2.c execution,  -Os 
FAIL: gcc.c-torture/execute/20000914-1.c execution,  -O0 
FAIL: gcc.c-torture/execute/20000914-1.c execution,  -O1 
FAIL: gcc.c-torture/execute/20000914-1.c execution,  -O2 
FAIL: gcc.c-torture/execute/20000914-1.c execution,  -O3 -fomit-frame-pointer 
FAIL: gcc.c-torture/execute/20000914-1.c execution,  -O3 -g 
FAIL: gcc.c-torture/execute/20000914-1.c execution,  -Os 
FAIL: gcc.c-torture/execute/20000917-1.c execution,  -O0 
FAIL: gcc.c-torture/execute/20000917-1.c execution,  -O1 
FAIL: gcc.c-torture/execute/20000917-1.c execution,  -O2 
FAIL: gcc.c-torture/execute/20000917-1.c execution,  -Os 
FAIL: gcc.c-torture/execute/20001011-1.c execution,  -O0 
FAIL: gcc.c-torture/execute/20001011-1.c execution,  -O1 
FAIL: gcc.c-torture/execute/20001011-1.c execution,  -O2 
FAIL: gcc.c-torture/execute/20001011-1.c execution,  -Os 
FAIL: gcc.c-torture/execute/20001024-1.c execution,  -O0 
FAIL: gcc.c-torture/execute/20001024-1.c execution,  -O1 
WARNING: program timed out.
FAIL: gcc.c-torture/execute/20001024-1.c execution,  -O2 
WARNING: program timed out.
FAIL: gcc.c-torture/execute/20001024-1.c execution,  -Os 
FAIL: gcc.c-torture/execute/20001026-1.c execution,  -O1 
WARNING: program timed out.
FAIL: gcc.c-torture/execute/20001026-1.c execution,  -O2 
FAIL: gcc.c-torture/execute/20001026-1.c execution,  -O3 -fomit-frame-pointer 
FAIL: gcc.c-torture/execute/20001026-1.c execution,  -O3 -fomit-frame-pointer -funroll-loops 
FAIL: gcc.c-torture/execute/20001026-1.c execution,  -O3 -fomit-frame-pointer -funroll-all-loops -finline-functions 
FAIL: gcc.c-torture/execute/20001026-1.c execution,  -O3 -g 
FAIL: gcc.c-torture/execute/20001026-1.c execution,  -Os 
FAIL: gcc.c-torture/execute/20001101.c execution,  -O0 
FAIL: gcc.c-torture/execute/20001101.c execution,  -O1 
FAIL: gcc.c-torture/execute/20001101.c execution,  -O2 
FAIL: gcc.c-torture/execute/20001130-2.c execution,  -O0 
FAIL: gcc.c-torture/execute/20001203-1.c execution,  -O0 
FAIL: gcc.c-torture/execute/20001229-1.c execution,  -O0 
FAIL: gcc.c-torture/execute/20010116-1.c execution,  -O0 
FAIL: gcc.c-torture/execute/20010116-1.c execution,  -O1 
FAIL: gcc.c-torture/execute/20010116-1.c execution,  -O2 
FAIL: gcc.c-torture/execute/20010116-1.c execution,  -O3 -fomit-frame-pointer 
FAIL: gcc.c-torture/execute/20010116-1.c execution,  -O3 -g 
FAIL: gcc.c-torture/execute/20010116-1.c execution,  -Os 
FAIL: gcc.c-torture/execute/20010118-1.c execution,  -O1 
FAIL: gcc.c-torture/execute/20010118-1.c execution,  -O2 
FAIL: gcc.c-torture/execute/20010118-1.c execution,  -Os 
FAIL: gcc.c-torture/execute/20010122-1.c execution,  -O0 
FAIL: gcc.c-torture/execute/20010122-1.c execution,  -O1 
FAIL: gcc.c-torture/execute/20010122-1.c execution,  -O2 
FAIL: gcc.c-torture/execute/20010122-1.c execution,  -O3 -g 
FAIL: gcc.c-torture/execute/20010122-1.c execution,  -Os 
FAIL: gcc.c-torture/execute/20010206-1.c execution,  -O0 
FAIL: gcc.c-torture/execute/20010206-1.c execution,  -O1 
FAIL: gcc.c-torture/execute/20010206-1.c execution,  -O2 
FAIL: gcc.c-torture/execute/20010209-1.c execution,  -O0 
FAIL: gcc.c-torture/execute/20010209-1.c execution,  -O1 
FAIL: gcc.c-torture/execute/20010209-1.c execution,  -O2 
FAIL: gcc.c-torture/execute/20010209-1.c execution,  -O3 -fomit-frame-pointer 
FAIL: gcc.c-torture/execute/20010209-1.c execution,  -O3 -fomit-frame-pointer -funroll-loops 
FAIL: gcc.c-torture/execute/20010209-1.c execution,  -O3 -fomit-frame-pointer -funroll-all-loops -finline-functions 
FAIL: gcc.c-torture/execute/20010209-1.c execution,  -O3 -g 
FAIL: gcc.c-torture/execute/20010209-1.c execution,  -Os 
FAIL: gcc.c-torture/execute/20010221-1.c execution,  -O1 
FAIL: gcc.c-torture/execute/20010221-1.c execution,  -O2 
FAIL: gcc.c-torture/execute/20010221-1.c execution,  -O3 -fomit-frame-pointer 
FAIL: gcc.c-torture/execute/20010221-1.c execution,  -O3 -g 
FAIL: gcc.c-torture/execute/20010221-1.c execution,  -Os 
FAIL: gcc.c-torture/execute/20010222-1.c execution,  -O0 
FAIL: gcc.c-torture/execute/20010222-1.c execution,  -O1 
FAIL: gcc.c-torture/execute/20010222-1.c execution,  -O2 
FAIL: gcc.c-torture/execute/20010222-1.c execution,  -O3 -fomit-frame-pointer 
FAIL: gcc.c-torture/execute/20010222-1.c execution,  -O3 -g 
FAIL: gcc.c-torture/execute/20010222-1.c execution,  -Os 
FAIL: gcc.c-torture/execute/20010422-1.c execution,  -O0 
FAIL: gcc.c-torture/execute/20010422-1.c execution,  -O1 
FAIL: gcc.c-torture/execute/20010422-1.c execution,  -O2 
FAIL: gcc.c-torture/execute/20010518-1.c execution,  -O0 
FAIL: gcc.c-torture/execute/20010518-1.c execution,  -O1 
FAIL: gcc.c-torture/execute/20010518-1.c execution,  -O2 
FAIL: gcc.c-torture/execute/20010518-1.c execution,  -Os 
FAIL: gcc.c-torture/execute/20010518-2.c execution,  -O0 
FAIL: gcc.c-torture/execute/20010518-2.c execution,  -O1 
FAIL: gcc.c-torture/execute/20010518-2.c execution,  -O2 
FAIL: gcc.c-torture/execute/20010518-2.c execution,  -O3 -fomit-frame-pointer 
FAIL: gcc.c-torture/execute/20010518-2.c execution,  -O3 -g 
FAIL: gcc.c-torture/execute/20010518-2.c execution,  -Os 
FAIL: gcc.c-torture/execute/20010723-1.c execution,  -O0 
FAIL: gcc.c-torture/execute/20010723-1.c execution,  -O1 
FAIL: gcc.c-torture/execute/20010723-1.c execution,  -O2 
FAIL: gcc.c-torture/execute/20010915-1.c execution,  -O0 
FAIL: gcc.c-torture/execute/20010915-1.c execution,  -O1 
FAIL: gcc.c-torture/execute/20010915-1.c execution,  -O2 
FAIL: gcc.c-torture/execute/20010915-1.c execution,  -O3 -fomit-frame-pointer 
FAIL: gcc.c-torture/execute/20010915-1.c execution,  -O3 -fomit-frame-pointer -funroll-loops 
FAIL: gcc.c-torture/execute/20010915-1.c execution,  -O3 -fomit-frame-pointer -funroll-all-loops -finline-functions 
FAIL: gcc.c-torture/execute/20010915-1.c execution,  -O3 -g 
FAIL: gcc.c-torture/execute/20010915-1.c execution,  -Os 
FAIL: gcc.c-torture/execute/20010925-1.c execution,  -O1 
FAIL: gcc.c-torture/execute/20010925-1.c execution,  -O2 
FAIL: gcc.c-torture/execute/20010925-1.c execution,  -O3 -fomit-frame-pointer 
FAIL: gcc.c-torture/execute/20010925-1.c execution,  -O3 -g 
FAIL: gcc.c-torture/execute/20010925-1.c execution,  -Os 
FAIL: gcc.c-torture/execute/20011008-3.c execution,  -O0 
FAIL: gcc.c-torture/execute/20011008-3.c execution,  -O1 
FAIL: gcc.c-torture/execute/20011008-3.c execution,  -O2 
FAIL: gcc.c-torture/execute/20011008-3.c execution,  -Os 
FAIL: gcc.c-torture/execute/20011024-1.c execution,  -O1 
FAIL: gcc.c-torture/execute/20011024-1.c execution,  -O2 
FAIL: gcc.c-torture/execute/20011024-1.c execution,  -O3 -fomit-frame-pointer 
FAIL: gcc.c-torture/execute/20011024-1.c execution,  -O3 -g 
FAIL: gcc.c-torture/execute/20011024-1.c execution,  -Os 
FAIL: gcc.c-torture/execute/20011109-2.c execution,  -O0 
FAIL: gcc.c-torture/execute/20011113-1.c execution,  -O0 
FAIL: gcc.c-torture/execute/20011113-1.c execution,  -O1 
FAIL: gcc.c-torture/execute/20011113-1.c execution,  -O2 
FAIL: gcc.c-torture/execute/20011113-1.c execution,  -O3 -fomit-frame-pointer 
FAIL: gcc.c-torture/execute/20011113-1.c execution,  -O3 -g 
FAIL: gcc.c-torture/execute/20011113-1.c execution,  -Os 
FAIL: gcc.c-torture/execute/20011114-1.c execution,  -O0 
FAIL: gcc.c-torture/execute/20011114-1.c execution,  -O1 
FAIL: gcc.c-torture/execute/20011114-1.c execution,  -O2 
FAIL: gcc.c-torture/execute/20011121-1.c execution,  -O0 
FAIL: gcc.c-torture/execute/20011121-1.c execution,  -O1 
FAIL: gcc.c-torture/execute/20011121-1.c execution,  -O2 
FAIL: gcc.c-torture/execute/20011121-1.c execution,  -O3 -fomit-frame-pointer 
FAIL: gcc.c-torture/execute/20011121-1.c execution,  -O3 -g 
FAIL: gcc.c-torture/execute/20011121-1.c execution,  -Os 
FAIL: gcc.c-torture/execute/20011128-1.c execution,  -O0 
FAIL: gcc.c-torture/execute/20020103-1.c execution,  -O0 
FAIL: gcc.c-torture/execute/20020103-1.c execution,  -O1 
FAIL: gcc.c-torture/execute/20020103-1.c execution,  -O2 
FAIL: gcc.c-torture/execute/20020107-1.c execution,  -O0 
FAIL: gcc.c-torture/execute/20020129-1.c execution,  -O0 
FAIL: gcc.c-torture/execute/20020129-1.c execution,  -O1 
FAIL: gcc.c-torture/execute/20020129-1.c execution,  -O2 
FAIL: gcc.c-torture/execute/20020129-1.c execution,  -Os 
FAIL: gcc.c-torture/execute/20020206-1.c execution,  -O0 
FAIL: gcc.c-torture/execute/20020206-1.c execution,  -O1 
FAIL: gcc.c-torture/execute/20020206-1.c execution,  -O2 
FAIL: gcc.c-torture/execute/20020206-1.c execution,  -Os 
FAIL: gcc.c-torture/execute/20020215-1.c execution,  -O0 
FAIL: gcc.c-torture/execute/20020215-1.c execution,  -O1 
FAIL: gcc.c-torture/execute/20020215-1.c execution,  -O2 
FAIL: gcc.c-torture/execute/20020215-1.c execution,  -O3 -fomit-frame-pointer 
FAIL: gcc.c-torture/execute/20020215-1.c execution,  -O3 -fomit-frame-pointer -funroll-loops 
FAIL: gcc.c-torture/execute/20020215-1.c execution,  -O3 -fomit-frame-pointer -funroll-all-loops -finline-functions 
FAIL: gcc.c-torture/execute/20020215-1.c execution,  -O3 -g 
FAIL: gcc.c-torture/execute/20020215-1.c execution,  -Os 
FAIL: gcc.c-torture/execute/20020225-2.c execution,  -O0 
FAIL: gcc.c-torture/execute/20020320-1.c execution,  -O0 
FAIL: gcc.c-torture/execute/20020320-1.c execution,  -O1 
FAIL: gcc.c-torture/execute/20020320-1.c execution,  -O2 
FAIL: gcc.c-torture/execute/20020320-1.c execution,  -O3 -fomit-frame-pointer 
FAIL: gcc.c-torture/execute/20020320-1.c execution,  -O3 -g 
FAIL: gcc.c-torture/execute/20020320-1.c execution,  -Os 
FAIL: gcc.c-torture/execute/20020402-1.c execution,  -O0 
FAIL: gcc.c-torture/execute/20020402-1.c execution,  -O1 
WARNING: program timed out.
FAIL: gcc.c-torture/execute/20020402-1.c execution,  -O2 
FAIL: gcc.c-torture/execute/20020402-1.c execution,  -O3 -fomit-frame-pointer 
FAIL: gcc.c-torture/execute/20020402-1.c execution,  -O3 -fomit-frame-pointer -funroll-loops 
FAIL: gcc.c-torture/execute/20020402-1.c execution,  -O3 -fomit-frame-pointer -funroll-all-loops -finline-functions 
WARNING: program timed out.
FAIL: gcc.c-torture/execute/20020402-1.c execution,  -O3 -g 
WARNING: program timed out.
FAIL: gcc.c-torture/execute/20020402-1.c execution,  -Os 
FAIL: gcc.c-torture/execute/20020412-1.c execution,  -O0 
FAIL: gcc.c-torture/execute/20020412-1.c execution,  -O1 
FAIL: gcc.c-torture/execute/20020412-1.c execution,  -O2 
FAIL: gcc.c-torture/execute/20020412-1.c execution,  -O3 -fomit-frame-pointer 
FAIL: gcc.c-torture/execute/20020412-1.c execution,  -O3 -fomit-frame-pointer -funroll-loops 
FAIL: gcc.c-torture/execute/20020412-1.c execution,  -O3 -fomit-frame-pointer -funroll-all-loops -finline-functions 
FAIL: gcc.c-torture/execute/20020412-1.c execution,  -O3 -g 
FAIL: gcc.c-torture/execute/20020412-1.c execution,  -Os 
FAIL: gcc.c-torture/execute/20020413-1.c execution,  -O0 
FAIL: gcc.c-torture/execute/20020413-1.c execution,  -O1 
FAIL: gcc.c-torture/execute/20020413-1.c execution,  -O2 
FAIL: gcc.c-torture/execute/20020413-1.c execution,  -Os 
FAIL: gcc.c-torture/execute/20020418-1.c execution,  -O1 
FAIL: gcc.c-torture/execute/20020418-1.c execution,  -O2 
FAIL: gcc.c-torture/execute/20020418-1.c execution,  -Os 
FAIL: gcc.c-torture/execute/20020615-1.c execution,  -O0 
FAIL: gcc.c-torture/execute/20020615-1.c execution,  -O1 
FAIL: gcc.c-torture/execute/20020615-1.c execution,  -O2 
FAIL: gcc.c-torture/execute/20020615-1.c execution,  -Os 
FAIL: gcc.c-torture/execute/20020619-1.c execution,  -Os 
FAIL: gcc.c-torture/execute/20020805-1.c execution,  -O0 
FAIL: gcc.c-torture/execute/20020805-1.c execution,  -O1 
FAIL: gcc.c-torture/execute/20020805-1.c execution,  -O2 
FAIL: gcc.c-torture/execute/20020805-1.c execution,  -O3 -fomit-frame-pointer 
FAIL: gcc.c-torture/execute/20020805-1.c execution,  -O3 -g 
FAIL: gcc.c-torture/execute/20020805-1.c execution,  -Os 
FAIL: gcc.c-torture/execute/20020810-1.c execution,  -O0 
FAIL: gcc.c-torture/execute/20020810-1.c execution,  -O1 
FAIL: gcc.c-torture/execute/20020810-1.c execution,  -O2 
FAIL: gcc.c-torture/execute/20020810-1.c execution,  -Os 
FAIL: gcc.c-torture/execute/20020920-1.c execution,  -O0 
FAIL: gcc.c-torture/execute/20020920-1.c execution,  -O1 
FAIL: gcc.c-torture/execute/20021010-2.c execution,  -O0 
WARNING: program timed out.
FAIL: gcc.c-torture/execute/20021010-2.c execution,  -O1 
FAIL: gcc.c-torture/execute/20021010-2.c execution,  -O2 
FAIL: gcc.c-torture/execute/20021010-2.c execution,  -O3 -fomit-frame-pointer 
FAIL: gcc.c-torture/execute/20021010-2.c execution,  -O3 -g 
FAIL: gcc.c-torture/execute/20021010-2.c execution,  -Os 
FAIL: gcc.c-torture/execute/20021011-1.c execution,  -Os 
FAIL: gcc.c-torture/execute/20021118-1.c execution,  -O0 
FAIL: gcc.c-torture/execute/20021118-1.c execution,  -O1 
FAIL: gcc.c-torture/execute/20021118-1.c execution,  -O2 
FAIL: gcc.c-torture/execute/20021118-1.c execution,  -O3 -fomit-frame-pointer 
FAIL: gcc.c-torture/execute/20021118-1.c execution,  -O3 -g 
FAIL: gcc.c-torture/execute/20021118-1.c execution,  -Os 
FAIL: gcc.c-torture/execute/20021118-2.c execution,  -O0 
FAIL: gcc.c-torture/execute/20021118-2.c execution,  -O1 
FAIL: gcc.c-torture/execute/20021118-2.c execution,  -O2 
WARNING: program timed out.
FAIL: gcc.c-torture/execute/20021118-2.c execution,  -O3 -fomit-frame-pointer 
FAIL: gcc.c-torture/execute/20021118-2.c execution,  -O3 -g 
FAIL: gcc.c-torture/execute/20021118-2.c execution,  -Os 
FAIL: gcc.c-torture/execute/20021120-1.c execution,  -O3 -fomit-frame-pointer 
FAIL: gcc.c-torture/execute/20021120-2.c execution,  -O0 
FAIL: gcc.c-torture/execute/20021120-2.c execution,  -O1 
FAIL: gcc.c-torture/execute/20021120-2.c execution,  -O2 
FAIL: gcc.c-torture/execute/20021120-2.c execution,  -Os 
FAIL: gcc.c-torture/execute/20021120-3.c execution,  -O0 
FAIL: gcc.c-torture/execute/20021120-3.c execution,  -O1 
FAIL: gcc.c-torture/execute/20021120-3.c execution,  -O2 
FAIL: gcc.c-torture/execute/20021120-3.c execution,  -O3 -fomit-frame-pointer 
FAIL: gcc.c-torture/execute/20021120-3.c execution,  -Os 
FAIL: gcc.c-torture/execute/20021204-1.c execution,  -O0 
WARNING: program timed out.
FAIL: gcc.c-torture/execute/20021219-1.c execution,  -O1 
FAIL: gcc.c-torture/execute/20021219-1.c execution,  -O2 
FAIL: gcc.c-torture/execute/20021219-1.c execution,  -O3 -fomit-frame-pointer 
FAIL: gcc.c-torture/execute/20021219-1.c execution,  -O3 -fomit-frame-pointer -funroll-loops 
FAIL: gcc.c-torture/execute/20021219-1.c execution,  -O3 -fomit-frame-pointer -funroll-all-loops -finline-functions 
WARNING: program timed out.
FAIL: gcc.c-torture/execute/20021219-1.c execution,  -O3 -g 
FAIL: gcc.c-torture/execute/20021219-1.c execution,  -Os 
FAIL: gcc.c-torture/execute/20030105-1.c execution,  -O0 
FAIL: gcc.c-torture/execute/20030105-1.c execution,  -O1 
FAIL: gcc.c-torture/execute/20030105-1.c execution,  -O2 
FAIL: gcc.c-torture/execute/20030105-1.c execution,  -O3 -fomit-frame-pointer 
FAIL: gcc.c-torture/execute/20030105-1.c execution,  -O3 -g 
FAIL: gcc.c-torture/execute/20030105-1.c execution,  -Os 
FAIL: gcc.c-torture/execute/20030117-1.c execution,  -O0 
FAIL: gcc.c-torture/execute/20030117-1.c execution,  -O1 
FAIL: gcc.c-torture/execute/20030117-1.c execution,  -O2 
FAIL: gcc.c-torture/execute/20030117-1.c execution,  -Os 
FAIL: gcc.c-torture/execute/20030120-1.c execution,  -O0 
FAIL: gcc.c-torture/execute/20030120-1.c execution,  -O1 
FAIL: gcc.c-torture/execute/20030120-1.c execution,  -O2 
FAIL: gcc.c-torture/execute/20030128-1.c execution,  -O0 
FAIL: gcc.c-torture/execute/20030128-1.c execution,  -O1 
FAIL: gcc.c-torture/execute/20030128-1.c execution,  -O2 
FAIL: gcc.c-torture/execute/20030128-1.c execution,  -O3 -fomit-frame-pointer 
FAIL: gcc.c-torture/execute/20030128-1.c execution,  -O3 -g 
FAIL: gcc.c-torture/execute/20030128-1.c execution,  -Os 
FAIL: gcc.c-torture/execute/20030218-1.c execution,  -O0 
FAIL: gcc.c-torture/execute/20030218-1.c execution,  -O1 
FAIL: gcc.c-torture/execute/20030218-1.c execution,  -O2 
FAIL: gcc.c-torture/execute/20030221-1.c execution,  -O0 
FAIL: gcc.c-torture/execute/20030221-1.c execution,  -O1 
FAIL: gcc.c-torture/execute/20030221-1.c execution,  -O2 
FAIL: gcc.c-torture/execute/20030221-1.c execution,  -O3 -fomit-frame-pointer 
FAIL: gcc.c-torture/execute/20030221-1.c execution,  -O3 -g 
FAIL: gcc.c-torture/execute/20030221-1.c execution,  -Os 
FAIL: gcc.c-torture/execute/20030313-1.c execution,  -O1 
FAIL: gcc.c-torture/execute/20030313-1.c execution,  -O2 
FAIL: gcc.c-torture/execute/20030313-1.c execution,  -O3 -fomit-frame-pointer 
FAIL: gcc.c-torture/execute/20030313-1.c execution,  -O3 -g 
FAIL: gcc.c-torture/execute/20030313-1.c execution,  -Os 
FAIL: gcc.c-torture/execute/20030408-1.c execution,  -O0 
FAIL: gcc.c-torture/execute/20030408-1.c execution,  -O1 
FAIL: gcc.c-torture/execute/20030408-1.c execution,  -O2 
FAIL: gcc.c-torture/execute/20030408-1.c execution,  -O3 -fomit-frame-pointer 
FAIL: gcc.c-torture/execute/20030408-1.c execution,  -O3 -g 
FAIL: gcc.c-torture/execute/20030408-1.c execution,  -Os 
FAIL: gcc.c-torture/execute/20030501-1.c execution,  -O0 
FAIL: gcc.c-torture/execute/20030606-1.c execution,  -O0 
FAIL: gcc.c-torture/execute/20030613-1.c execution,  -O0 
FAIL: gcc.c-torture/execute/20030613-1.c execution,  -O1 
FAIL: gcc.c-torture/execute/20030613-1.c execution,  -O2 
FAIL: gcc.c-torture/execute/20030613-1.c execution,  -O3 -fomit-frame-pointer 
FAIL: gcc.c-torture/execute/20030613-1.c execution,  -O3 -fomit-frame-pointer -funroll-loops 
FAIL: gcc.c-torture/execute/20030613-1.c execution,  -O3 -fomit-frame-pointer -funroll-all-loops -finline-functions 
FAIL: gcc.c-torture/execute/20030613-1.c execution,  -O3 -g 
WARNING: program timed out.
FAIL: gcc.c-torture/execute/20030613-1.c execution,  -Os 
FAIL: gcc.c-torture/execute/20030626-1.c execution,  -O1 
FAIL: gcc.c-torture/execute/20030626-1.c execution,  -O2 
FAIL: gcc.c-torture/execute/20030626-1.c execution,  -O3 -fomit-frame-pointer 
FAIL: gcc.c-torture/execute/20030626-1.c execution,  -O3 -g 
FAIL: gcc.c-torture/execute/20030626-2.c execution,  -O0 
FAIL: gcc.c-torture/execute/20030626-2.c execution,  -O1 
FAIL: gcc.c-torture/execute/20030626-2.c execution,  -O2 
FAIL: gcc.c-torture/execute/20030626-2.c execution,  -O3 -fomit-frame-pointer 
FAIL: gcc.c-torture/execute/20030626-2.c execution,  -O3 -g 
FAIL: gcc.c-torture/execute/20030714-1.c execution,  -O0 
FAIL: gcc.c-torture/execute/20030828-1.c execution,  -O0 
FAIL: gcc.c-torture/execute/20030828-1.c execution,  -O1 
FAIL: gcc.c-torture/execute/20030828-1.c execution,  -O2 
FAIL: gcc.c-torture/execute/20030914-1.c execution,  -O0 
FAIL: gcc.c-torture/execute/20030914-1.c execution,  -O1 
FAIL: gcc.c-torture/execute/20030914-1.c execution,  -O2 
WARNING: program timed out.
FAIL: gcc.c-torture/execute/20030914-1.c execution,  -O3 -fomit-frame-pointer 
FAIL: gcc.c-torture/execute/20030914-1.c execution,  -O3 -fomit-frame-pointer -funroll-loops 
FAIL: gcc.c-torture/execute/20030914-1.c execution,  -O3 -fomit-frame-pointer -funroll-all-loops -finline-functions 
FAIL: gcc.c-torture/execute/20030914-1.c execution,  -O3 -g 
FAIL: gcc.c-torture/execute/20030914-1.c execution,  -Os 
FAIL: gcc.c-torture/execute/20030914-2.c execution,  -O0 
FAIL: gcc.c-torture/execute/20030914-2.c execution,  -O1 
FAIL: gcc.c-torture/execute/20030914-2.c execution,  -O2 
FAIL: gcc.c-torture/execute/20030916-1.c execution,  -O1 
FAIL: gcc.c-torture/execute/20030916-1.c execution,  -O2 
FAIL: gcc.c-torture/execute/20030916-1.c execution,  -O3 -fomit-frame-pointer 
FAIL: gcc.c-torture/execute/20030916-1.c execution,  -O3 -g 
FAIL: gcc.c-torture/execute/20030916-1.c execution,  -Os 
FAIL: gcc.c-torture/execute/20031012-1.c execution,  -O0 
FAIL: gcc.c-torture/execute/20031012-1.c execution,  -O1 
FAIL: gcc.c-torture/execute/20031012-1.c execution,  -O2 
FAIL: gcc.c-torture/execute/20031012-1.c execution,  -O3 -fomit-frame-pointer 
FAIL: gcc.c-torture/execute/20031012-1.c execution,  -O3 -g 
FAIL: gcc.c-torture/execute/20031012-1.c execution,  -Os 
FAIL: gcc.c-torture/execute/20031201-1.c execution,  -O0 
FAIL: gcc.c-torture/execute/20031201-1.c execution,  -O1 
FAIL: gcc.c-torture/execute/20031201-1.c execution,  -O2 
FAIL: gcc.c-torture/execute/20031201-1.c execution,  -O3 -fomit-frame-pointer 
FAIL: gcc.c-torture/execute/20031201-1.c execution,  -O3 -g 
FAIL: gcc.c-torture/execute/20031201-1.c execution,  -Os 
FAIL: gcc.c-torture/execute/20040218-1.c execution,  -O0 
FAIL: gcc.c-torture/execute/20040218-1.c execution,  -O1 
FAIL: gcc.c-torture/execute/20040218-1.c execution,  -O2 
FAIL: gcc.c-torture/execute/20040218-1.c execution,  -O3 -fomit-frame-pointer 
FAIL: gcc.c-torture/execute/20040218-1.c execution,  -O3 -g 
FAIL: gcc.c-torture/execute/20040218-1.c execution,  -Os 
FAIL: gcc.c-torture/execute/20040223-1.c execution,  -O1 
FAIL: gcc.c-torture/execute/20040223-1.c execution,  -O2 
FAIL: gcc.c-torture/execute/20040223-1.c execution,  -O3 -fomit-frame-pointer 
FAIL: gcc.c-torture/execute/20040223-1.c execution,  -O3 -g 
FAIL: gcc.c-torture/execute/20040319-1.c execution,  -O0 
FAIL: gcc.c-torture/execute/20040319-1.c execution,  -O1 
FAIL: gcc.c-torture/execute/20040319-1.c execution,  -O2 
FAIL: gcc.c-torture/execute/20040625-1.c execution,  -O0 
FAIL: gcc.c-torture/execute/20040625-1.c execution,  -O1 
FAIL: gcc.c-torture/execute/20040625-1.c execution,  -O2 
FAIL: gcc.c-torture/execute/20040625-1.c execution,  -O3 -fomit-frame-pointer 
FAIL: gcc.c-torture/execute/20040625-1.c execution,  -O3 -g 
FAIL: gcc.c-torture/execute/20040625-1.c execution,  -Os 
FAIL: gcc.c-torture/execute/20040629-1.c compilation,  -O0 
UNRESOLVED: gcc.c-torture/execute/20040629-1.c execution,  -O0 
FAIL: gcc.c-torture/execute/20040629-1.c compilation,  -O1 
UNRESOLVED: gcc.c-torture/execute/20040629-1.c execution,  -O1 
FAIL: gcc.c-torture/execute/20040629-1.c compilation,  -O2 
UNRESOLVED: gcc.c-torture/execute/20040629-1.c execution,  -O2 
FAIL: gcc.c-torture/execute/20040629-1.c compilation,  -O3 -fomit-frame-pointer 
UNRESOLVED: gcc.c-torture/execute/20040629-1.c execution,  -O3 -fomit-frame-pointer 
FAIL: gcc.c-torture/execute/20040629-1.c compilation,  -O3 -g 
UNRESOLVED: gcc.c-torture/execute/20040629-1.c execution,  -O3 -g 
FAIL: gcc.c-torture/execute/20040629-1.c compilation,  -Os 
UNRESOLVED: gcc.c-torture/execute/20040629-1.c execution,  -Os 
FAIL: gcc.c-torture/execute/20040703-1.c execution,  -O0 
FAIL: gcc.c-torture/execute/20040703-1.c execution,  -O1 
FAIL: gcc.c-torture/execute/20040703-1.c execution,  -O2 
FAIL: gcc.c-torture/execute/20040703-1.c execution,  -O3 -fomit-frame-pointer 
FAIL: gcc.c-torture/execute/20040703-1.c execution,  -O3 -g 
FAIL: gcc.c-torture/execute/20040703-1.c execution,  -Os 
FAIL: gcc.c-torture/execute/20040705-1.c compilation,  -O0 
UNRESOLVED: gcc.c-torture/execute/20040705-1.c execution,  -O0 
FAIL: gcc.c-torture/execute/20040705-1.c compilation,  -O1 
UNRESOLVED: gcc.c-torture/execute/20040705-1.c execution,  -O1 
FAIL: gcc.c-torture/execute/20040705-1.c compilation,  -O2 
UNRESOLVED: gcc.c-torture/execute/20040705-1.c execution,  -O2 
FAIL: gcc.c-torture/execute/20040705-1.c compilation,  -O3 -fomit-frame-pointer 
UNRESOLVED: gcc.c-torture/execute/20040705-1.c execution,  -O3 -fomit-frame-pointer 
FAIL: gcc.c-torture/execute/20040705-1.c compilation,  -O3 -g 
UNRESOLVED: gcc.c-torture/execute/20040705-1.c execution,  -O3 -g 
FAIL: gcc.c-torture/execute/20040705-1.c compilation,  -Os 
UNRESOLVED: gcc.c-torture/execute/20040705-1.c execution,  -Os 
FAIL: gcc.c-torture/execute/20040705-2.c compilation,  -O0 
UNRESOLVED: gcc.c-torture/execute/20040705-2.c execution,  -O0 
FAIL: gcc.c-torture/execute/20040705-2.c compilation,  -O1 
UNRESOLVED: gcc.c-torture/execute/20040705-2.c execution,  -O1 
FAIL: gcc.c-torture/execute/20040705-2.c compilation,  -O2 
UNRESOLVED: gcc.c-torture/execute/20040705-2.c execution,  -O2 
FAIL: gcc.c-torture/execute/20040705-2.c compilation,  -O3 -fomit-frame-pointer 
UNRESOLVED: gcc.c-torture/execute/20040705-2.c execution,  -O3 -fomit-frame-pointer 
FAIL: gcc.c-torture/execute/20040705-2.c compilation,  -O3 -g 
UNRESOLVED: gcc.c-torture/execute/20040705-2.c execution,  -O3 -g 
FAIL: gcc.c-torture/execute/20040705-2.c compilation,  -Os 
UNRESOLVED: gcc.c-torture/execute/20040705-2.c execution,  -Os 
WARNING: program timed out.
FAIL: gcc.c-torture/execute/20040811-1.c execution,  -O0 
WARNING: program timed out.
FAIL: gcc.c-torture/execute/20040811-1.c execution,  -O1 
WARNING: program timed out.
FAIL: gcc.c-torture/execute/20040811-1.c execution,  -O2 
FAIL: gcc.c-torture/execute/20040811-1.c execution,  -O3 -fomit-frame-pointer 
WARNING: program timed out.
FAIL: gcc.c-torture/execute/20040811-1.c execution,  -O3 -g 
WARNING: program timed out.
FAIL: gcc.c-torture/execute/20040811-1.c execution,  -Os 
FAIL: gcc.c-torture/execute/20040820-1.c execution,  -O2 
FAIL: gcc.c-torture/execute/20040831-1.c execution,  -O0 
FAIL: gcc.c-torture/execute/20041113-1.c execution,  -O1 
FAIL: gcc.c-torture/execute/20041113-1.c execution,  -O2 
FAIL: gcc.c-torture/execute/20041113-1.c execution,  -O3 -fomit-frame-pointer 
FAIL: gcc.c-torture/execute/20041113-1.c execution,  -O3 -g 
FAIL: gcc.c-torture/execute/20041113-1.c execution,  -Os 
FAIL: gcc.c-torture/execute/20041124-1.c execution,  -O0 
FAIL: gcc.c-torture/execute/20041124-1.c execution,  -O1 
FAIL: gcc.c-torture/execute/20041124-1.c execution,  -O2 
FAIL: gcc.c-torture/execute/20041124-1.c execution,  -O3 -fomit-frame-pointer 
FAIL: gcc.c-torture/execute/20041124-1.c execution,  -O3 -g 
FAIL: gcc.c-torture/execute/20041124-1.c execution,  -Os 
FAIL: gcc.c-torture/execute/20041126-1.c execution,  -O0 
FAIL: gcc.c-torture/execute/20041126-1.c execution,  -O1 
FAIL: gcc.c-torture/execute/20041126-1.c execution,  -O2 
FAIL: gcc.c-torture/execute/20041126-1.c execution,  -O3 -fomit-frame-pointer 
FAIL: gcc.c-torture/execute/20041126-1.c execution,  -O3 -fomit-frame-pointer -funroll-loops 
FAIL: gcc.c-torture/execute/20041126-1.c execution,  -O3 -fomit-frame-pointer -funroll-all-loops -finline-functions 
FAIL: gcc.c-torture/execute/20041126-1.c execution,  -O3 -g 
FAIL: gcc.c-torture/execute/20041126-1.c execution,  -Os 
FAIL: gcc.c-torture/execute/20041201-1.c execution,  -O0 
FAIL: gcc.c-torture/execute/20041201-1.c execution,  -O1 
FAIL: gcc.c-torture/execute/20041201-1.c execution,  -O2 
FAIL: gcc.c-torture/execute/20041212-1.c execution,  -O0 
FAIL: gcc.c-torture/execute/20041212-1.c execution,  -O1 
FAIL: gcc.c-torture/execute/20041212-1.c execution,  -O2 
FAIL: gcc.c-torture/execute/20041212-1.c execution,  -O3 -fomit-frame-pointer 
FAIL: gcc.c-torture/execute/20041212-1.c execution,  -O3 -g 
FAIL: gcc.c-torture/execute/20041212-1.c execution,  -Os 
FAIL: gcc.c-torture/execute/20041213-2.c execution,  -O1 
FAIL: gcc.c-torture/execute/20041213-2.c execution,  -O2 
FAIL: gcc.c-torture/execute/20041213-2.c execution,  -O3 -fomit-frame-pointer 
FAIL: gcc.c-torture/execute/20041213-2.c execution,  -O3 -fomit-frame-pointer -funroll-loops 
FAIL: gcc.c-torture/execute/20041213-2.c execution,  -O3 -fomit-frame-pointer -funroll-all-loops -finline-functions 
FAIL: gcc.c-torture/execute/20041213-2.c execution,  -O3 -g 
FAIL: gcc.c-torture/execute/20041214-1.c execution,  -O0 
FAIL: gcc.c-torture/execute/20041214-1.c execution,  -O1 
FAIL: gcc.c-torture/execute/20041214-1.c execution,  -O2 
FAIL: gcc.c-torture/execute/20041214-1.c execution,  -O3 -fomit-frame-pointer 
FAIL: gcc.c-torture/execute/20041214-1.c execution,  -O3 -fomit-frame-pointer -funroll-loops 
FAIL: gcc.c-torture/execute/20041214-1.c execution,  -O3 -fomit-frame-pointer -funroll-all-loops -finline-functions 
FAIL: gcc.c-torture/execute/20041214-1.c execution,  -O3 -g 
FAIL: gcc.c-torture/execute/20041214-1.c execution,  -Os 
FAIL: gcc.c-torture/execute/20041218-1.c execution,  -O0 
FAIL: gcc.c-torture/execute/20041218-1.c execution,  -O1 
FAIL: gcc.c-torture/execute/20041218-1.c execution,  -O2 
FAIL: gcc.c-torture/execute/20041218-1.c execution,  -O3 -fomit-frame-pointer 
FAIL: gcc.c-torture/execute/20041218-1.c execution,  -O3 -fomit-frame-pointer -funroll-loops 
FAIL: gcc.c-torture/execute/20041218-1.c execution,  -O3 -fomit-frame-pointer -funroll-all-loops -finline-functions 
FAIL: gcc.c-torture/execute/20041218-1.c execution,  -O3 -g 
FAIL: gcc.c-torture/execute/20041218-1.c execution,  -Os 
FAIL: gcc.c-torture/execute/20050119-1.c execution,  -O1 
FAIL: gcc.c-torture/execute/20050119-1.c execution,  -O2 
FAIL: gcc.c-torture/execute/20050119-1.c execution,  -Os 
FAIL: gcc.c-torture/execute/20050119-2.c execution,  -O0 
FAIL: gcc.c-torture/execute/20050119-2.c execution,  -O1 
FAIL: gcc.c-torture/execute/20050119-2.c execution,  -O2 
FAIL: gcc.c-torture/execute/20050119-2.c execution,  -Os 
FAIL: gcc.c-torture/execute/20050131-1.c execution,  -O0 
FAIL: gcc.c-torture/execute/20050131-1.c execution,  -O1 
FAIL: gcc.c-torture/execute/20050131-1.c execution,  -O2 
FAIL: gcc.c-torture/execute/20050218-1.c execution,  -O0 
FAIL: gcc.c-torture/execute/20050218-1.c execution,  -O3 -fomit-frame-pointer -funroll-loops 
FAIL: gcc.c-torture/execute/20050218-1.c execution,  -O3 -fomit-frame-pointer -funroll-all-loops -finline-functions 
FAIL: gcc.c-torture/execute/20050316-1.c compilation,  -O0 
UNRESOLVED: gcc.c-torture/execute/20050316-1.c execution,  -O0 
FAIL: gcc.c-torture/execute/20050316-1.c compilation,  -O1 
UNRESOLVED: gcc.c-torture/execute/20050316-1.c execution,  -O1 
FAIL: gcc.c-torture/execute/20050316-1.c compilation,  -O2 
UNRESOLVED: gcc.c-torture/execute/20050316-1.c execution,  -O2 
FAIL: gcc.c-torture/execute/20050316-1.c compilation,  -O3 -fomit-frame-pointer 
UNRESOLVED: gcc.c-torture/execute/20050316-1.c execution,  -O3 -fomit-frame-pointer 
FAIL: gcc.c-torture/execute/20050316-1.c compilation,  -O3 -g 
UNRESOLVED: gcc.c-torture/execute/20050316-1.c execution,  -O3 -g 
FAIL: gcc.c-torture/execute/20050316-1.c compilation,  -Os 
UNRESOLVED: gcc.c-torture/execute/20050316-1.c execution,  -Os 
FAIL: gcc.c-torture/execute/20050410-1.c execution,  -O0 
FAIL: gcc.c-torture/execute/20050410-1.c execution,  -O1 
FAIL: gcc.c-torture/execute/20050410-1.c execution,  -O2 
FAIL: gcc.c-torture/execute/20050410-1.c execution,  -O3 -fomit-frame-pointer 
FAIL: gcc.c-torture/execute/20050410-1.c execution,  -O3 -g 
FAIL: gcc.c-torture/execute/20050410-1.c execution,  -Os 
FAIL: gcc.c-torture/execute/20050502-1.c execution,  -O0 
FAIL: gcc.c-torture/execute/20050502-1.c execution,  -O1 
FAIL: gcc.c-torture/execute/20050502-1.c execution,  -O2 
FAIL: gcc.c-torture/execute/20050502-1.c execution,  -O3 -fomit-frame-pointer 
FAIL: gcc.c-torture/execute/20050502-1.c execution,  -O3 -fomit-frame-pointer -funroll-loops 
FAIL: gcc.c-torture/execute/20050502-1.c execution,  -O3 -fomit-frame-pointer -funroll-all-loops -finline-functions 
FAIL: gcc.c-torture/execute/20050502-1.c execution,  -O3 -g 
FAIL: gcc.c-torture/execute/20050502-1.c execution,  -Os 
FAIL: gcc.c-torture/execute/20050502-2.c execution,  -O0 
FAIL: gcc.c-torture/execute/20050502-2.c execution,  -O1 
FAIL: gcc.c-torture/execute/20050502-2.c execution,  -O2 
FAIL: gcc.c-torture/execute/20050502-2.c execution,  -O3 -fomit-frame-pointer 
WARNING: program timed out.
FAIL: gcc.c-torture/execute/20050502-2.c execution,  -O3 -fomit-frame-pointer -funroll-loops 
FAIL: gcc.c-torture/execute/20050502-2.c execution,  -O3 -fomit-frame-pointer -funroll-all-loops -finline-functions 
FAIL: gcc.c-torture/execute/20050502-2.c execution,  -O3 -g 
FAIL: gcc.c-torture/execute/20050502-2.c execution,  -Os 
FAIL: gcc.c-torture/execute/20050604-1.c execution,  -O0 
FAIL: gcc.c-torture/execute/20050604-1.c execution,  -O1 
FAIL: gcc.c-torture/execute/20050604-1.c execution,  -O2 
FAIL: gcc.c-torture/execute/20050604-1.c execution,  -O3 -fomit-frame-pointer 
FAIL: gcc.c-torture/execute/20050604-1.c execution,  -O3 -g 
FAIL: gcc.c-torture/execute/20050604-1.c execution,  -Os 
FAIL: gcc.c-torture/execute/20050613-1.c execution,  -Os 
FAIL: gcc.c-torture/execute/20050713-1.c execution,  -O0 
WARNING: program timed out.
FAIL: gcc.c-torture/execute/20050713-1.c execution,  -O1 
FAIL: gcc.c-torture/execute/20050713-1.c execution,  -O2 
FAIL: gcc.c-torture/execute/20050713-1.c execution,  -Os 
FAIL: gcc.c-torture/execute/20050826-1.c execution,  -O0 
WARNING: program timed out.
FAIL: gcc.c-torture/execute/20050826-1.c execution,  -O1 
WARNING: program timed out.
FAIL: gcc.c-torture/execute/20050826-1.c execution,  -O2 
FAIL: gcc.c-torture/execute/20050826-1.c execution,  -O3 -fomit-frame-pointer 
FAIL: gcc.c-torture/execute/20050826-1.c execution,  -O3 -fomit-frame-pointer -funroll-loops 
FAIL: gcc.c-torture/execute/20050826-1.c execution,  -O3 -fomit-frame-pointer -funroll-all-loops -finline-functions 
FAIL: gcc.c-torture/execute/20050826-1.c execution,  -O3 -g 
WARNING: program timed out.
FAIL: gcc.c-torture/execute/20050826-1.c execution,  -Os 
FAIL: gcc.c-torture/execute/20051012-1.c execution,  -O1 
FAIL: gcc.c-torture/execute/20051012-1.c execution,  -O2 
FAIL: gcc.c-torture/execute/20060910-1.c execution,  -O3 -fomit-frame-pointer 
FAIL: gcc.c-torture/execute/20060910-1.c execution,  -O3 -fomit-frame-pointer -funroll-loops 
FAIL: gcc.c-torture/execute/20060910-1.c execution,  -O3 -fomit-frame-pointer -funroll-all-loops -finline-functions 
FAIL: gcc.c-torture/execute/20060910-1.c execution,  -O3 -g 
FAIL: gcc.c-torture/execute/20060910-1.c execution,  -Os 
FAIL: gcc.c-torture/execute/20061101-1.c execution,  -O0 
FAIL: gcc.c-torture/execute/20061101-1.c execution,  -O1 
FAIL: gcc.c-torture/execute/20061101-1.c execution,  -O2 
FAIL: gcc.c-torture/execute/20061101-1.c execution,  -O3 -fomit-frame-pointer 
FAIL: gcc.c-torture/execute/20061101-1.c execution,  -O3 -fomit-frame-pointer -funroll-loops 
FAIL: gcc.c-torture/execute/20061101-1.c execution,  -O3 -fomit-frame-pointer -funroll-all-loops -finline-functions 
FAIL: gcc.c-torture/execute/20061101-1.c execution,  -O3 -g 
FAIL: gcc.c-torture/execute/20061101-1.c execution,  -Os 
FAIL: gcc.c-torture/execute/900409-1.c execution,  -O0 
FAIL: gcc.c-torture/execute/900409-1.c execution,  -O1 
FAIL: gcc.c-torture/execute/900409-1.c execution,  -O2 
FAIL: gcc.c-torture/execute/920302-1.c execution,  -O0 
FAIL: gcc.c-torture/execute/920302-1.c execution,  -O1 
FAIL: gcc.c-torture/execute/920302-1.c execution,  -O2 
FAIL: gcc.c-torture/execute/920302-1.c execution,  -O3 -fomit-frame-pointer 
FAIL: gcc.c-torture/execute/920302-1.c execution,  -O3 -g 
FAIL: gcc.c-torture/execute/920302-1.c execution,  -Os 
FAIL: gcc.c-torture/execute/920409-1.c execution,  -O0 
FAIL: gcc.c-torture/execute/920409-1.c execution,  -O1 
FAIL: gcc.c-torture/execute/920409-1.c execution,  -O2 
FAIL: gcc.c-torture/execute/920411-1.c execution,  -O0 
FAIL: gcc.c-torture/execute/920411-1.c execution,  -O1 
FAIL: gcc.c-torture/execute/920411-1.c execution,  -O2 
FAIL: gcc.c-torture/execute/920411-1.c execution,  -Os 
FAIL: gcc.c-torture/execute/920415-1.c execution,  -O0 
FAIL: gcc.c-torture/execute/920428-1.c execution,  -O0 
FAIL: gcc.c-torture/execute/920428-1.c execution,  -O1 
FAIL: gcc.c-torture/execute/920428-1.c execution,  -O2 
FAIL: gcc.c-torture/execute/920428-1.c execution,  -Os 
FAIL: gcc.c-torture/execute/920428-2.c execution,  -O0 
FAIL: gcc.c-torture/execute/920428-2.c execution,  -O1 
FAIL: gcc.c-torture/execute/920428-2.c execution,  -O2 
FAIL: gcc.c-torture/execute/920428-2.c execution,  -O3 -fomit-frame-pointer 
FAIL: gcc.c-torture/execute/920428-2.c execution,  -O3 -g 
FAIL: gcc.c-torture/execute/920428-2.c execution,  -Os 
FAIL: gcc.c-torture/execute/920429-1.c execution,  -O0 
FAIL: gcc.c-torture/execute/920429-1.c execution,  -O1 
FAIL: gcc.c-torture/execute/920429-1.c execution,  -O2 
FAIL: gcc.c-torture/execute/920429-1.c execution,  -Os 
FAIL: gcc.c-torture/execute/920501-1.c execution,  -O0 
FAIL: gcc.c-torture/execute/920501-1.c execution,  -O1 
FAIL: gcc.c-torture/execute/920501-1.c execution,  -O2 
FAIL: gcc.c-torture/execute/920501-3.c execution,  -O1 
FAIL: gcc.c-torture/execute/920501-3.c execution,  -O2 
FAIL: gcc.c-torture/execute/920501-3.c execution,  -O3 -fomit-frame-pointer 
FAIL: gcc.c-torture/execute/920501-3.c execution,  -O3 -fomit-frame-pointer -funroll-loops 
FAIL: gcc.c-torture/execute/920501-3.c execution,  -O3 -fomit-frame-pointer -funroll-all-loops -finline-functions 
FAIL: gcc.c-torture/execute/920501-3.c execution,  -O3 -g 
FAIL: gcc.c-torture/execute/920501-3.c execution,  -Os 
FAIL: gcc.c-torture/execute/920501-4.c execution,  -O0 
FAIL: gcc.c-torture/execute/920501-4.c execution,  -O1 
FAIL: gcc.c-torture/execute/920501-4.c execution,  -O2 
FAIL: gcc.c-torture/execute/920501-4.c execution,  -O3 -fomit-frame-pointer 
FAIL: gcc.c-torture/execute/920501-4.c execution,  -O3 -g 
FAIL: gcc.c-torture/execute/920501-4.c execution,  -Os 
FAIL: gcc.c-torture/execute/920501-5.c execution,  -O0 
FAIL: gcc.c-torture/execute/920501-5.c execution,  -O1 
FAIL: gcc.c-torture/execute/920501-5.c execution,  -O2 
FAIL: gcc.c-torture/execute/920501-5.c execution,  -O3 -fomit-frame-pointer 
FAIL: gcc.c-torture/execute/920501-5.c execution,  -O3 -g 
FAIL: gcc.c-torture/execute/920501-5.c execution,  -Os 
FAIL: gcc.c-torture/execute/920501-7.c execution,  -O0 
FAIL: gcc.c-torture/execute/920501-7.c execution,  -O1 
FAIL: gcc.c-torture/execute/920501-7.c execution,  -O2 
FAIL: gcc.c-torture/execute/920501-7.c execution,  -O3 -fomit-frame-pointer 
FAIL: gcc.c-torture/execute/920501-7.c execution,  -O3 -g 
FAIL: gcc.c-torture/execute/920501-7.c execution,  -Os 
FAIL: gcc.c-torture/execute/920625-1.c execution,  -O0 
FAIL: gcc.c-torture/execute/920625-1.c execution,  -O1 
FAIL: gcc.c-torture/execute/920625-1.c execution,  -O2 
FAIL: gcc.c-torture/execute/920625-1.c execution,  -O3 -fomit-frame-pointer 
FAIL: gcc.c-torture/execute/920625-1.c execution,  -O3 -fomit-frame-pointer -funroll-loops 
FAIL: gcc.c-torture/execute/920625-1.c execution,  -O3 -fomit-frame-pointer -funroll-all-loops -finline-functions 
FAIL: gcc.c-torture/execute/920625-1.c execution,  -O3 -g 
WARNING: program timed out.
FAIL: gcc.c-torture/execute/920625-1.c execution,  -Os 
FAIL: gcc.c-torture/execute/920711-1.c execution,  -O0 
FAIL: gcc.c-torture/execute/920711-1.c execution,  -O1 
FAIL: gcc.c-torture/execute/920711-1.c execution,  -O2 
FAIL: gcc.c-torture/execute/920721-3.c execution,  -O0 
FAIL: gcc.c-torture/execute/920721-4.c execution,  -O0 
FAIL: gcc.c-torture/execute/920721-4.c execution,  -O1 
FAIL: gcc.c-torture/execute/920721-4.c execution,  -O2 
FAIL: gcc.c-torture/execute/920721-4.c execution,  -O3 -fomit-frame-pointer 
FAIL: gcc.c-torture/execute/920721-4.c execution,  -O3 -fomit-frame-pointer -funroll-loops 
FAIL: gcc.c-torture/execute/920721-4.c execution,  -O3 -fomit-frame-pointer -funroll-all-loops -finline-functions 
FAIL: gcc.c-torture/execute/920721-4.c execution,  -O3 -g 
FAIL: gcc.c-torture/execute/920721-4.c execution,  -Os 
FAIL: gcc.c-torture/execute/920726-1.c execution,  -O0 
FAIL: gcc.c-torture/execute/920726-1.c execution,  -O1 
FAIL: gcc.c-torture/execute/920726-1.c execution,  -O2 
FAIL: gcc.c-torture/execute/920726-1.c execution,  -O3 -fomit-frame-pointer 
FAIL: gcc.c-torture/execute/920726-1.c execution,  -O3 -fomit-frame-pointer -funroll-loops 
FAIL: gcc.c-torture/execute/920726-1.c execution,  -O3 -fomit-frame-pointer -funroll-all-loops -finline-functions 
FAIL: gcc.c-torture/execute/920726-1.c execution,  -O3 -g 
FAIL: gcc.c-torture/execute/920726-1.c execution,  -Os 
FAIL: gcc.c-torture/execute/920730-1.c execution,  -O0 
FAIL: gcc.c-torture/execute/920730-1.c execution,  -O1 
FAIL: gcc.c-torture/execute/920730-1.c execution,  -O2 
FAIL: gcc.c-torture/execute/920731-1.c execution,  -O0 
FAIL: gcc.c-torture/execute/920731-1.c execution,  -O1 
FAIL: gcc.c-torture/execute/920731-1.c execution,  -O2 
FAIL: gcc.c-torture/execute/920731-1.c execution,  -Os 
FAIL: gcc.c-torture/execute/920810-1.c execution,  -O0 
FAIL: gcc.c-torture/execute/920810-1.c execution,  -O1 
FAIL: gcc.c-torture/execute/920810-1.c execution,  -O2 
FAIL: gcc.c-torture/execute/920810-1.c execution,  -O3 -fomit-frame-pointer 
FAIL: gcc.c-torture/execute/920810-1.c execution,  -O3 -g 
FAIL: gcc.c-torture/execute/920810-1.c execution,  -Os 
FAIL: gcc.c-torture/execute/920812-1.c execution,  -O0 
FAIL: gcc.c-torture/execute/920812-1.c execution,  -O1 
FAIL: gcc.c-torture/execute/920812-1.c execution,  -O2 
FAIL: gcc.c-torture/execute/920908-1.c execution,  -O0 
FAIL: gcc.c-torture/execute/920908-1.c execution,  -O1 
FAIL: gcc.c-torture/execute/920908-1.c execution,  -O2 
FAIL: gcc.c-torture/execute/920908-1.c execution,  -O3 -fomit-frame-pointer 
FAIL: gcc.c-torture/execute/920908-1.c execution,  -O3 -g 
FAIL: gcc.c-torture/execute/920908-1.c execution,  -Os 
FAIL: gcc.c-torture/execute/920922-1.c execution,  -O0 
FAIL: gcc.c-torture/execute/920922-1.c execution,  -O1 
FAIL: gcc.c-torture/execute/920922-1.c execution,  -O2 
FAIL: gcc.c-torture/execute/920922-1.c execution,  -Os 
FAIL: gcc.c-torture/execute/920929-1.c execution,  -O0 
FAIL: gcc.c-torture/execute/920929-1.c execution,  -Os 
FAIL: gcc.c-torture/execute/921013-1.c execution,  -O1 
FAIL: gcc.c-torture/execute/921013-1.c execution,  -O2 
FAIL: gcc.c-torture/execute/921013-1.c execution,  -O3 -fomit-frame-pointer 
FAIL: gcc.c-torture/execute/921013-1.c execution,  -O3 -fomit-frame-pointer -funroll-loops 
FAIL: gcc.c-torture/execute/921013-1.c execution,  -O3 -fomit-frame-pointer -funroll-all-loops -finline-functions 
FAIL: gcc.c-torture/execute/921013-1.c execution,  -O3 -g 
FAIL: gcc.c-torture/execute/921013-1.c execution,  -Os 
FAIL: gcc.c-torture/execute/921017-1.c execution,  -O0 
FAIL: gcc.c-torture/execute/921017-1.c execution,  -O1 
FAIL: gcc.c-torture/execute/921017-1.c execution,  -O2 
FAIL: gcc.c-torture/execute/921017-1.c execution,  -O3 -fomit-frame-pointer 
FAIL: gcc.c-torture/execute/921017-1.c execution,  -O3 -g 
FAIL: gcc.c-torture/execute/921017-1.c execution,  -Os 
FAIL: gcc.c-torture/execute/921112-1.c execution,  -O0 
FAIL: gcc.c-torture/execute/921112-1.c execution,  -O1 
FAIL: gcc.c-torture/execute/921112-1.c execution,  -O2 
FAIL: gcc.c-torture/execute/921112-1.c execution,  -O3 -fomit-frame-pointer 
FAIL: gcc.c-torture/execute/921112-1.c execution,  -O3 -g 
FAIL: gcc.c-torture/execute/921112-1.c execution,  -Os 
FAIL: gcc.c-torture/execute/921117-1.c execution,  -O0 
FAIL: gcc.c-torture/execute/921117-1.c execution,  -O1 
FAIL: gcc.c-torture/execute/921117-1.c execution,  -O2 
FAIL: gcc.c-torture/execute/921117-1.c execution,  -O3 -fomit-frame-pointer 
FAIL: gcc.c-torture/execute/921117-1.c execution,  -O3 -g 
FAIL: gcc.c-torture/execute/921117-1.c execution,  -Os 
FAIL: gcc.c-torture/execute/921123-1.c execution,  -O0 
FAIL: gcc.c-torture/execute/921123-1.c execution,  -O1 
FAIL: gcc.c-torture/execute/921123-1.c execution,  -O2 
FAIL: gcc.c-torture/execute/921123-2.c execution,  -O0 
WARNING: program timed out.
FAIL: gcc.c-torture/execute/921123-2.c execution,  -O1 
FAIL: gcc.c-torture/execute/921123-2.c execution,  -O2 
FAIL: gcc.c-torture/execute/921123-2.c execution,  -O3 -fomit-frame-pointer 
FAIL: gcc.c-torture/execute/921123-2.c execution,  -O3 -g 
FAIL: gcc.c-torture/execute/921123-2.c execution,  -Os 
FAIL: gcc.c-torture/execute/921202-1.c execution,  -O0 
FAIL: gcc.c-torture/execute/921218-1.c execution,  -O0 
FAIL: gcc.c-torture/execute/921218-1.c execution,  -O1 
FAIL: gcc.c-torture/execute/921218-1.c execution,  -O2 
FAIL: gcc.c-torture/execute/921218-2.c execution,  -O0 
FAIL: gcc.c-torture/execute/921218-2.c execution,  -O1 
FAIL: gcc.c-torture/execute/921218-2.c execution,  -O2 
FAIL: gcc.c-torture/execute/930208-1.c execution,  -O3 -fomit-frame-pointer 
FAIL: gcc.c-torture/execute/930208-1.c execution,  -O3 -g 
FAIL: gcc.c-torture/execute/930429-1.c execution,  -O0 
FAIL: gcc.c-torture/execute/930429-1.c execution,  -O1 
FAIL: gcc.c-torture/execute/930429-1.c execution,  -O2 
FAIL: gcc.c-torture/execute/930513-1.c execution,  -O0 
FAIL: gcc.c-torture/execute/930513-1.c execution,  -O1 
FAIL: gcc.c-torture/execute/930513-1.c execution,  -O2 
FAIL: gcc.c-torture/execute/930513-1.c execution,  -O3 -fomit-frame-pointer 
FAIL: gcc.c-torture/execute/930513-1.c execution,  -O3 -g 
FAIL: gcc.c-torture/execute/930513-1.c execution,  -Os 
FAIL: gcc.c-torture/execute/930518-1.c execution,  -O1 
FAIL: gcc.c-torture/execute/930518-1.c execution,  -O2 
FAIL: gcc.c-torture/execute/930518-1.c execution,  -O3 -fomit-frame-pointer 
FAIL: gcc.c-torture/execute/930518-1.c execution,  -O3 -g 
FAIL: gcc.c-torture/execute/930518-1.c execution,  -Os 
FAIL: gcc.c-torture/execute/930526-1.c execution,  -O0 
FAIL: gcc.c-torture/execute/930526-1.c execution,  -O3 -fomit-frame-pointer 
FAIL: gcc.c-torture/execute/930526-1.c execution,  -Os 
FAIL: gcc.c-torture/execute/930527-1.c execution,  -O0 
FAIL: gcc.c-torture/execute/930527-1.c execution,  -O1 
FAIL: gcc.c-torture/execute/930527-1.c execution,  -O2 
FAIL: gcc.c-torture/execute/930529-1.c execution,  -O0 
FAIL: gcc.c-torture/execute/930529-1.c execution,  -O1 
FAIL: gcc.c-torture/execute/930529-1.c execution,  -O2 
FAIL: gcc.c-torture/execute/930529-1.c execution,  -Os 
FAIL: gcc.c-torture/execute/930603-1.c execution,  -Os 
FAIL: gcc.c-torture/execute/930603-2.c execution,  -O1 
FAIL: gcc.c-torture/execute/930603-2.c execution,  -O2 
FAIL: gcc.c-torture/execute/930603-2.c execution,  -O3 -fomit-frame-pointer 
FAIL: gcc.c-torture/execute/930603-2.c execution,  -O3 -fomit-frame-pointer -funroll-loops 
FAIL: gcc.c-torture/execute/930603-2.c execution,  -O3 -fomit-frame-pointer -funroll-all-loops -finline-functions 
FAIL: gcc.c-torture/execute/930603-2.c execution,  -O3 -g 
FAIL: gcc.c-torture/execute/930603-2.c execution,  -Os 
FAIL: gcc.c-torture/execute/930603-3.c execution,  -O0 
FAIL: gcc.c-torture/execute/930603-3.c execution,  -O1 
FAIL: gcc.c-torture/execute/930603-3.c execution,  -O2 
FAIL: gcc.c-torture/execute/930603-3.c execution,  -O3 -fomit-frame-pointer 
FAIL: gcc.c-torture/execute/930603-3.c execution,  -O3 -g 
FAIL: gcc.c-torture/execute/930603-3.c execution,  -Os 
FAIL: gcc.c-torture/execute/930614-2.c execution,  -O0 
FAIL: gcc.c-torture/execute/930628-1.c execution,  -O0 
FAIL: gcc.c-torture/execute/930628-1.c execution,  -O1 
FAIL: gcc.c-torture/execute/930628-1.c execution,  -O2 
FAIL: gcc.c-torture/execute/930628-1.c execution,  -O3 -fomit-frame-pointer 
FAIL: gcc.c-torture/execute/930628-1.c execution,  -O3 -fomit-frame-pointer -funroll-loops 
FAIL: gcc.c-torture/execute/930628-1.c execution,  -O3 -fomit-frame-pointer -funroll-all-loops -finline-functions 
FAIL: gcc.c-torture/execute/930628-1.c execution,  -O3 -g 
FAIL: gcc.c-torture/execute/930628-1.c execution,  -Os 
FAIL: gcc.c-torture/execute/930713-1.c execution,  -O0 
FAIL: gcc.c-torture/execute/930713-1.c execution,  -O1 
FAIL: gcc.c-torture/execute/930713-1.c execution,  -O2 
FAIL: gcc.c-torture/execute/930718-1.c execution,  -O0 
FAIL: gcc.c-torture/execute/930718-1.c execution,  -O2 
FAIL: gcc.c-torture/execute/930718-1.c execution,  -O3 -fomit-frame-pointer 
FAIL: gcc.c-torture/execute/930718-1.c execution,  -O3 -g 
FAIL: gcc.c-torture/execute/930725-1.c execution,  -O0 
FAIL: gcc.c-torture/execute/930725-1.c execution,  -O1 
FAIL: gcc.c-torture/execute/930725-1.c execution,  -O2 
FAIL: gcc.c-torture/execute/930929-1.c execution,  -O0 
FAIL: gcc.c-torture/execute/930929-1.c execution,  -O1 
FAIL: gcc.c-torture/execute/930929-1.c execution,  -O2 
FAIL: gcc.c-torture/execute/930930-1.c execution,  -O0 
FAIL: gcc.c-torture/execute/930930-1.c execution,  -Os 
FAIL: gcc.c-torture/execute/930930-2.c execution,  -O0 
FAIL: gcc.c-torture/execute/930930-2.c execution,  -O1 
FAIL: gcc.c-torture/execute/930930-2.c execution,  -O2 
FAIL: gcc.c-torture/execute/930930-2.c execution,  -O3 -fomit-frame-pointer 
FAIL: gcc.c-torture/execute/930930-2.c execution,  -O3 -g 
FAIL: gcc.c-torture/execute/930930-2.c execution,  -Os 
FAIL: gcc.c-torture/execute/931004-1.c execution,  -O1 
FAIL: gcc.c-torture/execute/931004-10.c execution,  -O1 
FAIL: gcc.c-torture/execute/931004-10.c execution,  -O2 
FAIL: gcc.c-torture/execute/931004-10.c execution,  -O3 -fomit-frame-pointer 
FAIL: gcc.c-torture/execute/931004-10.c execution,  -O3 -fomit-frame-pointer -funroll-loops 
FAIL: gcc.c-torture/execute/931004-10.c execution,  -O3 -fomit-frame-pointer -funroll-all-loops -finline-functions 
FAIL: gcc.c-torture/execute/931004-10.c execution,  -O3 -g 
FAIL: gcc.c-torture/execute/931004-10.c execution,  -Os 
FAIL: gcc.c-torture/execute/931004-11.c execution,  -O0 
WARNING: program timed out.
FAIL: gcc.c-torture/execute/931004-11.c execution,  -O1 
FAIL: gcc.c-torture/execute/931004-11.c execution,  -O2 
FAIL: gcc.c-torture/execute/931004-11.c execution,  -O3 -fomit-frame-pointer 
FAIL: gcc.c-torture/execute/931004-11.c execution,  -O3 -g 
FAIL: gcc.c-torture/execute/931004-11.c execution,  -Os 
FAIL: gcc.c-torture/execute/931004-12.c execution,  -O0 
FAIL: gcc.c-torture/execute/931004-12.c execution,  -O1 
FAIL: gcc.c-torture/execute/931004-12.c execution,  -O2 
FAIL: gcc.c-torture/execute/931004-12.c execution,  -O3 -fomit-frame-pointer 
FAIL: gcc.c-torture/execute/931004-12.c execution,  -O3 -fomit-frame-pointer -funroll-loops 
FAIL: gcc.c-torture/execute/931004-12.c execution,  -O3 -fomit-frame-pointer -funroll-all-loops -finline-functions 
FAIL: gcc.c-torture/execute/931004-12.c execution,  -O3 -g 
FAIL: gcc.c-torture/execute/931004-12.c execution,  -Os 
FAIL: gcc.c-torture/execute/931004-13.c execution,  -O1 
FAIL: gcc.c-torture/execute/931004-13.c execution,  -O2 
FAIL: gcc.c-torture/execute/931004-13.c execution,  -O3 -fomit-frame-pointer 
FAIL: gcc.c-torture/execute/931004-13.c execution,  -O3 -g 
FAIL: gcc.c-torture/execute/931004-13.c execution,  -Os 
FAIL: gcc.c-torture/execute/931004-14.c execution,  -O0 
FAIL: gcc.c-torture/execute/931004-14.c execution,  -O1 
FAIL: gcc.c-torture/execute/931004-14.c execution,  -O2 
FAIL: gcc.c-torture/execute/931004-14.c execution,  -O3 -fomit-frame-pointer 
FAIL: gcc.c-torture/execute/931004-14.c execution,  -O3 -fomit-frame-pointer -funroll-loops 
FAIL: gcc.c-torture/execute/931004-14.c execution,  -O3 -fomit-frame-pointer -funroll-all-loops -finline-functions 
FAIL: gcc.c-torture/execute/931004-14.c execution,  -O3 -g 
FAIL: gcc.c-torture/execute/931004-14.c execution,  -Os 
FAIL: gcc.c-torture/execute/931004-2.c execution,  -O1 
FAIL: gcc.c-torture/execute/931004-2.c execution,  -O2 
FAIL: gcc.c-torture/execute/931004-2.c execution,  -O3 -fomit-frame-pointer 
FAIL: gcc.c-torture/execute/931004-2.c execution,  -O3 -fomit-frame-pointer -funroll-loops 
FAIL: gcc.c-torture/execute/931004-2.c execution,  -O3 -fomit-frame-pointer -funroll-all-loops -finline-functions 
FAIL: gcc.c-torture/execute/931004-2.c execution,  -O3 -g 
FAIL: gcc.c-torture/execute/931004-2.c execution,  -Os 
FAIL: gcc.c-torture/execute/931004-3.c execution,  -O1 
FAIL: gcc.c-torture/execute/931004-4.c execution,  -O1 
FAIL: gcc.c-torture/execute/931004-4.c execution,  -O2 
FAIL: gcc.c-torture/execute/931004-4.c execution,  -O3 -fomit-frame-pointer 
FAIL: gcc.c-torture/execute/931004-4.c execution,  -O3 -fomit-frame-pointer -funroll-loops 
FAIL: gcc.c-torture/execute/931004-4.c execution,  -O3 -fomit-frame-pointer -funroll-all-loops -finline-functions 
FAIL: gcc.c-torture/execute/931004-4.c execution,  -O3 -g 
FAIL: gcc.c-torture/execute/931004-4.c execution,  -Os 
FAIL: gcc.c-torture/execute/931004-5.c execution,  -O1 
FAIL: gcc.c-torture/execute/931004-5.c execution,  -O2 
FAIL: gcc.c-torture/execute/931004-5.c execution,  -O3 -fomit-frame-pointer 
FAIL: gcc.c-torture/execute/931004-5.c execution,  -O3 -g 
FAIL: gcc.c-torture/execute/931004-5.c execution,  -Os 
FAIL: gcc.c-torture/execute/931004-6.c execution,  -O1 
FAIL: gcc.c-torture/execute/931004-6.c execution,  -O2 
FAIL: gcc.c-torture/execute/931004-6.c execution,  -O3 -fomit-frame-pointer 
FAIL: gcc.c-torture/execute/931004-6.c execution,  -O3 -fomit-frame-pointer -funroll-loops 
FAIL: gcc.c-torture/execute/931004-6.c execution,  -O3 -fomit-frame-pointer -funroll-all-loops -finline-functions 
FAIL: gcc.c-torture/execute/931004-6.c execution,  -O3 -g 
FAIL: gcc.c-torture/execute/931004-6.c execution,  -Os 
FAIL: gcc.c-torture/execute/931004-7.c execution,  -O1 
FAIL: gcc.c-torture/execute/931004-8.c execution,  -O1 
FAIL: gcc.c-torture/execute/931004-8.c execution,  -O2 
FAIL: gcc.c-torture/execute/931004-8.c execution,  -O3 -fomit-frame-pointer 
FAIL: gcc.c-torture/execute/931004-8.c execution,  -O3 -fomit-frame-pointer -funroll-loops 
FAIL: gcc.c-torture/execute/931004-8.c execution,  -O3 -fomit-frame-pointer -funroll-all-loops -finline-functions 
FAIL: gcc.c-torture/execute/931004-8.c execution,  -O3 -g 
FAIL: gcc.c-torture/execute/931004-8.c execution,  -Os 
FAIL: gcc.c-torture/execute/931004-9.c execution,  -O1 
FAIL: gcc.c-torture/execute/931004-9.c execution,  -O2 
FAIL: gcc.c-torture/execute/931004-9.c execution,  -O3 -fomit-frame-pointer 
FAIL: gcc.c-torture/execute/931004-9.c execution,  -O3 -g 
FAIL: gcc.c-torture/execute/931004-9.c execution,  -Os 
FAIL: gcc.c-torture/execute/931005-1.c execution,  -O0 
FAIL: gcc.c-torture/execute/931005-1.c execution,  -O1 
FAIL: gcc.c-torture/execute/931005-1.c execution,  -O2 
FAIL: gcc.c-torture/execute/931009-1.c execution,  -O0 
FAIL: gcc.c-torture/execute/931012-1.c execution,  -O0 
FAIL: gcc.c-torture/execute/931012-1.c execution,  -O1 
FAIL: gcc.c-torture/execute/931012-1.c execution,  -O2 
FAIL: gcc.c-torture/execute/931018-1.c execution,  -O1 
FAIL: gcc.c-torture/execute/931018-1.c execution,  -O2 
FAIL: gcc.c-torture/execute/931018-1.c execution,  -Os 
FAIL: gcc.c-torture/execute/931102-1.c execution,  -O0 
FAIL: gcc.c-torture/execute/931102-1.c execution,  -O1 
FAIL: gcc.c-torture/execute/931102-1.c execution,  -O2 
FAIL: gcc.c-torture/execute/931102-1.c execution,  -Os 
FAIL: gcc.c-torture/execute/931102-2.c execution,  -O0 
FAIL: gcc.c-torture/execute/931102-2.c execution,  -O1 
FAIL: gcc.c-torture/execute/931102-2.c execution,  -O2 
FAIL: gcc.c-torture/execute/931102-2.c execution,  -Os 
FAIL: gcc.c-torture/execute/931110-1.c execution,  -O1 
FAIL: gcc.c-torture/execute/931110-1.c execution,  -O2 
FAIL: gcc.c-torture/execute/931110-1.c execution,  -Os 
FAIL: gcc.c-torture/execute/931208-1.c execution,  -O0 
FAIL: gcc.c-torture/execute/931208-1.c execution,  -O1 
FAIL: gcc.c-torture/execute/931208-1.c execution,  -O2 
FAIL: gcc.c-torture/execute/931208-1.c execution,  -Os 
FAIL: gcc.c-torture/execute/931228-1.c execution,  -O0 
FAIL: gcc.c-torture/execute/931228-1.c execution,  -O1 
FAIL: gcc.c-torture/execute/931228-1.c execution,  -O2 
FAIL: gcc.c-torture/execute/940115-1.c execution,  -O0 
FAIL: gcc.c-torture/execute/940115-1.c execution,  -O1 
FAIL: gcc.c-torture/execute/940115-1.c execution,  -O2 
FAIL: gcc.c-torture/execute/940122-1.c execution,  -O0 
FAIL: gcc.c-torture/execute/941014-2.c execution,  -O0 
FAIL: gcc.c-torture/execute/941014-2.c execution,  -O1 
FAIL: gcc.c-torture/execute/941014-2.c execution,  -O2 
FAIL: gcc.c-torture/execute/941014-2.c execution,  -O3 -fomit-frame-pointer 
FAIL: gcc.c-torture/execute/941014-2.c execution,  -Os 
FAIL: gcc.c-torture/execute/941025-1.c execution,  -O0 
FAIL: gcc.c-torture/execute/941025-1.c execution,  -O1 
FAIL: gcc.c-torture/execute/941025-1.c execution,  -O2 
FAIL: gcc.c-torture/execute/941031-1.c execution,  -O0 
FAIL: gcc.c-torture/execute/941031-1.c execution,  -O1 
FAIL: gcc.c-torture/execute/941031-1.c execution,  -O2 
FAIL: gcc.c-torture/execute/941031-1.c execution,  -Os 
FAIL: gcc.c-torture/execute/941101-1.c execution,  -O0 
FAIL: gcc.c-torture/execute/941101-1.c execution,  -O1 
FAIL: gcc.c-torture/execute/941101-1.c execution,  -O2 
FAIL: gcc.c-torture/execute/941101-1.c execution,  -Os 
FAIL: gcc.c-torture/execute/950221-1.c execution,  -O0 
FAIL: gcc.c-torture/execute/950221-1.c execution,  -O1 
FAIL: gcc.c-torture/execute/950221-1.c execution,  -O2 
FAIL: gcc.c-torture/execute/950221-1.c execution,  -O3 -fomit-frame-pointer 
FAIL: gcc.c-torture/execute/950221-1.c execution,  -O3 -g 
FAIL: gcc.c-torture/execute/950221-1.c execution,  -Os 
FAIL: gcc.c-torture/execute/950322-1.c execution,  -O0 
FAIL: gcc.c-torture/execute/950322-1.c execution,  -O1 
FAIL: gcc.c-torture/execute/950322-1.c execution,  -O2 
FAIL: gcc.c-torture/execute/950322-1.c execution,  -Os 
FAIL: gcc.c-torture/execute/950426-1.c execution,  -O0 
FAIL: gcc.c-torture/execute/950426-1.c execution,  -O1 
FAIL: gcc.c-torture/execute/950426-1.c execution,  -O2 
FAIL: gcc.c-torture/execute/950426-2.c execution,  -O0 
FAIL: gcc.c-torture/execute/950621-1.c execution,  -O0 
FAIL: gcc.c-torture/execute/950621-1.c execution,  -O1 
FAIL: gcc.c-torture/execute/950621-1.c execution,  -O2 
FAIL: gcc.c-torture/execute/950621-1.c execution,  -Os 
FAIL: gcc.c-torture/execute/950628-1.c execution,  -O0 
FAIL: gcc.c-torture/execute/950628-1.c execution,  -O1 
FAIL: gcc.c-torture/execute/950628-1.c execution,  -O2 
FAIL: gcc.c-torture/execute/950628-1.c execution,  -Os 
FAIL: gcc.c-torture/execute/950710-1.c execution,  -O3 -fomit-frame-pointer -funroll-loops 
FAIL: gcc.c-torture/execute/950710-1.c execution,  -O3 -fomit-frame-pointer -funroll-all-loops -finline-functions 
FAIL: gcc.c-torture/execute/950714-1.c execution,  -O1 
FAIL: gcc.c-torture/execute/950714-1.c execution,  -O2 
FAIL: gcc.c-torture/execute/950714-1.c execution,  -O3 -fomit-frame-pointer 
FAIL: gcc.c-torture/execute/950714-1.c execution,  -O3 -g 
FAIL: gcc.c-torture/execute/950714-1.c execution,  -Os 
FAIL: gcc.c-torture/execute/950809-1.c execution,  -O1 
FAIL: gcc.c-torture/execute/950809-1.c execution,  -O2 
FAIL: gcc.c-torture/execute/950809-1.c execution,  -Os 
FAIL: gcc.c-torture/execute/951003-1.c execution,  -O1 
FAIL: gcc.c-torture/execute/951003-1.c execution,  -O2 
FAIL: gcc.c-torture/execute/951003-1.c execution,  -O3 -fomit-frame-pointer -funroll-loops 
FAIL: gcc.c-torture/execute/951003-1.c execution,  -O3 -fomit-frame-pointer -funroll-all-loops -finline-functions 
FAIL: gcc.c-torture/execute/960117-1.c execution,  -O1 
FAIL: gcc.c-torture/execute/960117-1.c execution,  -O3 -fomit-frame-pointer 
FAIL: gcc.c-torture/execute/960117-1.c execution,  -O3 -g 
FAIL: gcc.c-torture/execute/960117-1.c execution,  -Os 
FAIL: gcc.c-torture/execute/960218-1.c execution,  -O3 -fomit-frame-pointer -funroll-loops 
FAIL: gcc.c-torture/execute/960218-1.c execution,  -O3 -fomit-frame-pointer -funroll-all-loops -finline-functions 
FAIL: gcc.c-torture/execute/960301-1.c execution,  -O0 
FAIL: gcc.c-torture/execute/960301-1.c execution,  -O1 
FAIL: gcc.c-torture/execute/960301-1.c execution,  -O2 
FAIL: gcc.c-torture/execute/960301-1.c execution,  -O3 -fomit-frame-pointer 
FAIL: gcc.c-torture/execute/960301-1.c execution,  -O3 -g 
FAIL: gcc.c-torture/execute/960301-1.c execution,  -Os 
FAIL: gcc.c-torture/execute/960302-1.c execution,  -O0 
FAIL: gcc.c-torture/execute/960302-1.c execution,  -O1 
FAIL: gcc.c-torture/execute/960302-1.c execution,  -O2 
FAIL: gcc.c-torture/execute/960302-1.c execution,  -O3 -fomit-frame-pointer 
FAIL: gcc.c-torture/execute/960302-1.c execution,  -O3 -g 
FAIL: gcc.c-torture/execute/960302-1.c execution,  -Os 
FAIL: gcc.c-torture/execute/960312-1.c execution,  -O1 
FAIL: gcc.c-torture/execute/960312-1.c execution,  -O2 
FAIL: gcc.c-torture/execute/960312-1.c execution,  -Os 
FAIL: gcc.c-torture/execute/960321-1.c execution,  -O0 
FAIL: gcc.c-torture/execute/960321-1.c execution,  -O1 
FAIL: gcc.c-torture/execute/960321-1.c execution,  -O2 
FAIL: gcc.c-torture/execute/960327-1.c execution,  -O0 
FAIL: gcc.c-torture/execute/960327-1.c execution,  -O1 
FAIL: gcc.c-torture/execute/960327-1.c execution,  -O2 
FAIL: gcc.c-torture/execute/960327-1.c execution,  -O3 -fomit-frame-pointer 
FAIL: gcc.c-torture/execute/960327-1.c execution,  -O3 -fomit-frame-pointer -funroll-loops 
FAIL: gcc.c-torture/execute/960327-1.c execution,  -O3 -fomit-frame-pointer -funroll-all-loops -finline-functions 
FAIL: gcc.c-torture/execute/960327-1.c execution,  -O3 -g 
FAIL: gcc.c-torture/execute/960327-1.c execution,  -Os 
FAIL: gcc.c-torture/execute/960419-2.c execution,  -Os 
FAIL: gcc.c-torture/execute/960513-1.c execution,  -O0 
FAIL: gcc.c-torture/execute/960513-1.c execution,  -O1 
FAIL: gcc.c-torture/execute/960513-1.c execution,  -O2 
FAIL: gcc.c-torture/execute/960513-1.c execution,  -Os 
FAIL: gcc.c-torture/execute/960521-1.c execution,  -O0 
FAIL: gcc.c-torture/execute/960521-1.c execution,  -O1 
FAIL: gcc.c-torture/execute/960521-1.c execution,  -O2 
FAIL: gcc.c-torture/execute/960521-1.c execution,  -O3 -fomit-frame-pointer 
FAIL: gcc.c-torture/execute/960521-1.c execution,  -O3 -fomit-frame-pointer -funroll-loops 
FAIL: gcc.c-torture/execute/960521-1.c execution,  -O3 -fomit-frame-pointer -funroll-all-loops -finline-functions 
FAIL: gcc.c-torture/execute/960521-1.c execution,  -O3 -g 
FAIL: gcc.c-torture/execute/960521-1.c execution,  -Os 
FAIL: gcc.c-torture/execute/960909-1.c execution,  -O0 
FAIL: gcc.c-torture/execute/961026-1.c execution,  -O0 
FAIL: gcc.c-torture/execute/961026-1.c execution,  -O1 
FAIL: gcc.c-torture/execute/961026-1.c execution,  -O2 
FAIL: gcc.c-torture/execute/961125-1.c execution,  -O0 
FAIL: gcc.c-torture/execute/961125-1.c execution,  -O1 
FAIL: gcc.c-torture/execute/961125-1.c execution,  -O2 
FAIL: gcc.c-torture/execute/961125-1.c execution,  -O3 -fomit-frame-pointer 
FAIL: gcc.c-torture/execute/961125-1.c execution,  -O3 -g 
FAIL: gcc.c-torture/execute/961125-1.c execution,  -Os 
FAIL: gcc.c-torture/execute/970217-1.c execution,  -O0 
FAIL: gcc.c-torture/execute/970217-1.c execution,  -O1 
FAIL: gcc.c-torture/execute/970217-1.c execution,  -O2 
WARNING: program timed out.
FAIL: gcc.c-torture/execute/980223.c execution,  -O1 
FAIL: gcc.c-torture/execute/980223.c execution,  -O2 
FAIL: gcc.c-torture/execute/980223.c execution,  -Os 
FAIL: gcc.c-torture/execute/980505-1.c execution,  -O0 
FAIL: gcc.c-torture/execute/980505-1.c execution,  -O1 
FAIL: gcc.c-torture/execute/980505-1.c execution,  -O2 
FAIL: gcc.c-torture/execute/980505-2.c execution,  -O0 
FAIL: gcc.c-torture/execute/980505-2.c execution,  -O1 
FAIL: gcc.c-torture/execute/980505-2.c execution,  -O2 
FAIL: gcc.c-torture/execute/980506-2.c execution,  -O0 
FAIL: gcc.c-torture/execute/980506-2.c execution,  -O1 
FAIL: gcc.c-torture/execute/980506-2.c execution,  -O2 
FAIL: gcc.c-torture/execute/980506-3.c execution,  -O0 
FAIL: gcc.c-torture/execute/980506-3.c execution,  -O1 
FAIL: gcc.c-torture/execute/980506-3.c execution,  -O2 
FAIL: gcc.c-torture/execute/980506-3.c execution,  -O3 -fomit-frame-pointer 
FAIL: gcc.c-torture/execute/980506-3.c execution,  -O3 -g 
FAIL: gcc.c-torture/execute/980506-3.c execution,  -Os 
FAIL: gcc.c-torture/execute/980526-1.c execution,  -O0 
FAIL: gcc.c-torture/execute/980526-1.c execution,  -O1 
FAIL: gcc.c-torture/execute/980526-1.c execution,  -O2 
FAIL: gcc.c-torture/execute/980526-1.c execution,  -O3 -fomit-frame-pointer 
FAIL: gcc.c-torture/execute/980526-1.c execution,  -O3 -g 
FAIL: gcc.c-torture/execute/980526-1.c execution,  -Os 
FAIL: gcc.c-torture/execute/980608-1.c execution,  -O1 
FAIL: gcc.c-torture/execute/980608-1.c execution,  -O2 
FAIL: gcc.c-torture/execute/980608-1.c execution,  -O3 -fomit-frame-pointer 
FAIL: gcc.c-torture/execute/980608-1.c execution,  -O3 -g 
FAIL: gcc.c-torture/execute/980608-1.c execution,  -Os 
FAIL: gcc.c-torture/execute/980612-1.c execution,  -O0 
FAIL: gcc.c-torture/execute/980612-1.c execution,  -O1 
FAIL: gcc.c-torture/execute/980612-1.c execution,  -O2 
FAIL: gcc.c-torture/execute/980701-1.c execution,  -O0 
FAIL: gcc.c-torture/execute/980701-1.c execution,  -O1 
FAIL: gcc.c-torture/execute/980701-1.c execution,  -O2 
FAIL: gcc.c-torture/execute/980701-1.c execution,  -Os 
FAIL: gcc.c-torture/execute/980707-1.c execution,  -O0 
FAIL: gcc.c-torture/execute/980707-1.c execution,  -O1 
FAIL: gcc.c-torture/execute/980707-1.c execution,  -O2 
FAIL: gcc.c-torture/execute/980707-1.c execution,  -O3 -fomit-frame-pointer 
FAIL: gcc.c-torture/execute/980707-1.c execution,  -O3 -fomit-frame-pointer -funroll-loops 
FAIL: gcc.c-torture/execute/980707-1.c execution,  -O3 -fomit-frame-pointer -funroll-all-loops -finline-functions 
FAIL: gcc.c-torture/execute/980707-1.c execution,  -O3 -g 
FAIL: gcc.c-torture/execute/980707-1.c execution,  -Os 
FAIL: gcc.c-torture/execute/980709-1.c execution,  -O0 
FAIL: gcc.c-torture/execute/980709-1.c execution,  -O1 
FAIL: gcc.c-torture/execute/980709-1.c execution,  -O2 
FAIL: gcc.c-torture/execute/980709-1.c execution,  -O3 -fomit-frame-pointer 
FAIL: gcc.c-torture/execute/980709-1.c execution,  -O3 -g 
FAIL: gcc.c-torture/execute/980709-1.c execution,  -Os 
FAIL: gcc.c-torture/execute/980716-1.c execution,  -O1 
FAIL: gcc.c-torture/execute/980716-1.c execution,  -O2 
FAIL: gcc.c-torture/execute/980716-1.c execution,  -O3 -fomit-frame-pointer 
FAIL: gcc.c-torture/execute/980716-1.c execution,  -O3 -fomit-frame-pointer -funroll-loops 
FAIL: gcc.c-torture/execute/980716-1.c execution,  -O3 -fomit-frame-pointer -funroll-all-loops -finline-functions 
FAIL: gcc.c-torture/execute/980716-1.c execution,  -O3 -g 
FAIL: gcc.c-torture/execute/980716-1.c execution,  -Os 
FAIL: gcc.c-torture/execute/981001-1.c execution,  -O1 
FAIL: gcc.c-torture/execute/981001-1.c execution,  -O2 
FAIL: gcc.c-torture/execute/981001-1.c execution,  -O3 -fomit-frame-pointer 
FAIL: gcc.c-torture/execute/981001-1.c execution,  -O3 -g 
FAIL: gcc.c-torture/execute/981001-1.c execution,  -Os 
FAIL: gcc.c-torture/execute/990106-1.c execution,  -O0 
FAIL: gcc.c-torture/execute/990106-1.c execution,  -O1 
FAIL: gcc.c-torture/execute/990106-1.c execution,  -O2 
FAIL: gcc.c-torture/execute/990106-2.c execution,  -O0 
FAIL: gcc.c-torture/execute/990106-2.c execution,  -O1 
FAIL: gcc.c-torture/execute/990106-2.c execution,  -O2 
FAIL: gcc.c-torture/execute/990106-2.c execution,  -Os 
FAIL: gcc.c-torture/execute/990127-1.c execution,  -O1 
FAIL: gcc.c-torture/execute/990127-1.c execution,  -O2 
FAIL: gcc.c-torture/execute/990127-1.c execution,  -O3 -fomit-frame-pointer 
FAIL: gcc.c-torture/execute/990127-1.c execution,  -O3 -fomit-frame-pointer -funroll-loops 
FAIL: gcc.c-torture/execute/990127-1.c execution,  -O3 -fomit-frame-pointer -funroll-all-loops -finline-functions 
FAIL: gcc.c-torture/execute/990127-1.c execution,  -O3 -g 
FAIL: gcc.c-torture/execute/990127-1.c execution,  -Os 
FAIL: gcc.c-torture/execute/990128-1.c execution,  -O0 
FAIL: gcc.c-torture/execute/990128-1.c execution,  -O1 
FAIL: gcc.c-torture/execute/990128-1.c execution,  -O2 
FAIL: gcc.c-torture/execute/990128-1.c execution,  -Os 
FAIL: gcc.c-torture/execute/990130-1.c execution,  -O0 
FAIL: gcc.c-torture/execute/990326-1.c execution,  -O0 
FAIL: gcc.c-torture/execute/990326-1.c execution,  -O1 
FAIL: gcc.c-torture/execute/990326-1.c execution,  -O2 
FAIL: gcc.c-torture/execute/990326-1.c execution,  -Os 
FAIL: gcc.c-torture/execute/990404-1.c execution,  -O3 -fomit-frame-pointer 
FAIL: gcc.c-torture/execute/990404-1.c execution,  -O3 -fomit-frame-pointer -funroll-loops 
FAIL: gcc.c-torture/execute/990404-1.c execution,  -O3 -fomit-frame-pointer -funroll-all-loops -finline-functions 
FAIL: gcc.c-torture/execute/990404-1.c execution,  -O3 -g 
FAIL: gcc.c-torture/execute/990524-1.c execution,  -O0 
FAIL: gcc.c-torture/execute/990524-1.c execution,  -O1 
FAIL: gcc.c-torture/execute/990524-1.c execution,  -O2 
FAIL: gcc.c-torture/execute/990524-1.c execution,  -O3 -fomit-frame-pointer 
FAIL: gcc.c-torture/execute/990524-1.c execution,  -O3 -g 
FAIL: gcc.c-torture/execute/990524-1.c execution,  -Os 
FAIL: gcc.c-torture/execute/990525-1.c execution,  -O0 
FAIL: gcc.c-torture/execute/990525-1.c execution,  -O1 
FAIL: gcc.c-torture/execute/990525-1.c execution,  -O2 
FAIL: gcc.c-torture/execute/990525-1.c execution,  -Os 
FAIL: gcc.c-torture/execute/990525-2.c execution,  -O0 
FAIL: gcc.c-torture/execute/990525-2.c execution,  -O1 
FAIL: gcc.c-torture/execute/990525-2.c execution,  -O2 
FAIL: gcc.c-torture/execute/990525-2.c execution,  -Os 
FAIL: gcc.c-torture/execute/990527-1.c execution,  -Os 
FAIL: gcc.c-torture/execute/990531-1.c execution,  -O0 
FAIL: gcc.c-torture/execute/990531-1.c execution,  -O1 
FAIL: gcc.c-torture/execute/990531-1.c execution,  -O2 
FAIL: gcc.c-torture/execute/990628-1.c execution,  -O0 
FAIL: gcc.c-torture/execute/990628-1.c execution,  -O1 
FAIL: gcc.c-torture/execute/990628-1.c execution,  -O2 
FAIL: gcc.c-torture/execute/990628-1.c execution,  -O3 -fomit-frame-pointer 
FAIL: gcc.c-torture/execute/990628-1.c execution,  -O3 -fomit-frame-pointer -funroll-loops 
FAIL: gcc.c-torture/execute/990628-1.c execution,  -O3 -fomit-frame-pointer -funroll-all-loops -finline-functions 
FAIL: gcc.c-torture/execute/990628-1.c execution,  -O3 -g 
FAIL: gcc.c-torture/execute/990628-1.c execution,  -Os 
FAIL: gcc.c-torture/execute/990811-1.c execution,  -O0 
FAIL: gcc.c-torture/execute/990811-1.c execution,  -O1 
FAIL: gcc.c-torture/execute/990811-1.c execution,  -O2 
FAIL: gcc.c-torture/execute/990811-1.c execution,  -O3 -fomit-frame-pointer -funroll-loops 
FAIL: gcc.c-torture/execute/990811-1.c execution,  -O3 -fomit-frame-pointer -funroll-all-loops -finline-functions 
FAIL: gcc.c-torture/execute/990811-1.c execution,  -Os 
FAIL: gcc.c-torture/execute/990827-1.c execution,  -O0 
FAIL: gcc.c-torture/execute/990827-1.c execution,  -O1 
FAIL: gcc.c-torture/execute/990827-1.c execution,  -O2 
FAIL: gcc.c-torture/execute/990827-1.c execution,  -Os 
FAIL: gcc.c-torture/execute/990829-1.c execution,  -O0 
FAIL: gcc.c-torture/execute/990829-1.c execution,  -O1 
FAIL: gcc.c-torture/execute/990829-1.c execution,  -O2 
FAIL: gcc.c-torture/execute/990829-1.c execution,  -Os 
FAIL: gcc.c-torture/execute/991023-1.c execution,  -O0 
FAIL: gcc.c-torture/execute/991023-1.c execution,  -O1 
FAIL: gcc.c-torture/execute/991023-1.c execution,  -O2 
FAIL: gcc.c-torture/execute/991023-1.c execution,  -O3 -fomit-frame-pointer -funroll-loops 
FAIL: gcc.c-torture/execute/991023-1.c execution,  -O3 -fomit-frame-pointer -funroll-all-loops -finline-functions 
FAIL: gcc.c-torture/execute/991023-1.c execution,  -Os 
FAIL: gcc.c-torture/execute/991112-1.c execution,  -O0 
FAIL: gcc.c-torture/execute/991112-1.c execution,  -O1 
FAIL: gcc.c-torture/execute/991112-1.c execution,  -O2 
FAIL: gcc.c-torture/execute/991112-1.c execution,  -O3 -fomit-frame-pointer 
FAIL: gcc.c-torture/execute/991112-1.c execution,  -O3 -g 
FAIL: gcc.c-torture/execute/991112-1.c execution,  -Os 
FAIL: gcc.c-torture/execute/991201-1.c execution,  -O0 
FAIL: gcc.c-torture/execute/991201-1.c execution,  -O1 
FAIL: gcc.c-torture/execute/991201-1.c execution,  -O2 
FAIL: gcc.c-torture/execute/991201-1.c execution,  -O3 -fomit-frame-pointer -funroll-loops 
FAIL: gcc.c-torture/execute/991201-1.c execution,  -O3 -fomit-frame-pointer -funroll-all-loops -finline-functions 
FAIL: gcc.c-torture/execute/991201-1.c execution,  -Os 
FAIL: gcc.c-torture/execute/991202-1.c execution,  -O1 
FAIL: gcc.c-torture/execute/991202-1.c execution,  -O2 
FAIL: gcc.c-torture/execute/991202-1.c execution,  -O3 -fomit-frame-pointer 
FAIL: gcc.c-torture/execute/991202-1.c execution,  -O3 -fomit-frame-pointer -funroll-loops 
FAIL: gcc.c-torture/execute/991202-1.c execution,  -O3 -g 
FAIL: gcc.c-torture/execute/991202-1.c execution,  -Os 
FAIL: gcc.c-torture/execute/991202-2.c execution,  -O0 
FAIL: gcc.c-torture/execute/991202-2.c execution,  -O1 
FAIL: gcc.c-torture/execute/991202-2.c execution,  -O2 
FAIL: gcc.c-torture/execute/991227-1.c execution,  -O0 
FAIL: gcc.c-torture/execute/991227-1.c execution,  -O1 
FAIL: gcc.c-torture/execute/991227-1.c execution,  -O2 
FAIL: gcc.c-torture/execute/arith-1.c execution,  -O0 
FAIL: gcc.c-torture/execute/arith-1.c execution,  -O1 
FAIL: gcc.c-torture/execute/arith-1.c execution,  -O2 
FAIL: gcc.c-torture/execute/arith-rand.c execution,  -O2 
FAIL: gcc.c-torture/execute/arith-rand.c execution,  -O3 -fomit-frame-pointer 
FAIL: gcc.c-torture/execute/arith-rand.c execution,  -O3 -fomit-frame-pointer -funroll-loops 
FAIL: gcc.c-torture/execute/arith-rand.c execution,  -O3 -fomit-frame-pointer -funroll-all-loops -finline-functions 
FAIL: gcc.c-torture/execute/arith-rand.c execution,  -O3 -g 
FAIL: gcc.c-torture/execute/arith-rand.c execution,  -Os 
FAIL: gcc.c-torture/execute/bcp-1.c execution,  -O0 
FAIL: gcc.c-torture/execute/bcp-1.c execution,  -O1 
FAIL: gcc.c-torture/execute/bcp-1.c execution,  -O2 
FAIL: gcc.c-torture/execute/bcp-1.c execution,  -O3 -fomit-frame-pointer 
FAIL: gcc.c-torture/execute/bcp-1.c execution,  -O3 -fomit-frame-pointer -funroll-loops 
FAIL: gcc.c-torture/execute/bcp-1.c execution,  -O3 -fomit-frame-pointer -funroll-all-loops -finline-functions 
FAIL: gcc.c-torture/execute/bcp-1.c execution,  -O3 -g 
FAIL: gcc.c-torture/execute/bcp-1.c execution,  -Os 
FAIL: gcc.c-torture/execute/bf-pack-1.c execution,  -O0 
FAIL: gcc.c-torture/execute/bf-pack-1.c execution,  -O1 
FAIL: gcc.c-torture/execute/bf-pack-1.c execution,  -O2 
FAIL: gcc.c-torture/execute/bf-pack-1.c execution,  -Os 
FAIL: gcc.c-torture/execute/bf-sign-1.c execution,  -O1 
FAIL: gcc.c-torture/execute/bf-sign-1.c execution,  -O2 
FAIL: gcc.c-torture/execute/bf-sign-1.c execution,  -O3 -fomit-frame-pointer 
FAIL: gcc.c-torture/execute/bf-sign-1.c execution,  -O3 -g 
FAIL: gcc.c-torture/execute/bf-sign-1.c execution,  -Os 
FAIL: gcc.c-torture/execute/bitfld-4.c compilation,  -O0 
UNRESOLVED: gcc.c-torture/execute/bitfld-4.c execution,  -O0 
FAIL: gcc.c-torture/execute/bitfld-4.c compilation,  -O1 
UNRESOLVED: gcc.c-torture/execute/bitfld-4.c execution,  -O1 
FAIL: gcc.c-torture/execute/bitfld-4.c compilation,  -O2 
UNRESOLVED: gcc.c-torture/execute/bitfld-4.c execution,  -O2 
FAIL: gcc.c-torture/execute/bitfld-4.c compilation,  -O3 -fomit-frame-pointer 
UNRESOLVED: gcc.c-torture/execute/bitfld-4.c execution,  -O3 -fomit-frame-pointer 
FAIL: gcc.c-torture/execute/bitfld-4.c compilation,  -O3 -g 
UNRESOLVED: gcc.c-torture/execute/bitfld-4.c execution,  -O3 -g 
FAIL: gcc.c-torture/execute/bitfld-4.c compilation,  -Os 
UNRESOLVED: gcc.c-torture/execute/bitfld-4.c execution,  -Os 
FAIL: gcc.c-torture/execute/built-in-setjmp.c execution,  -O1 
FAIL: gcc.c-torture/execute/built-in-setjmp.c execution,  -O2 
FAIL: gcc.c-torture/execute/built-in-setjmp.c execution,  -O3 -fomit-frame-pointer 
FAIL: gcc.c-torture/execute/built-in-setjmp.c execution,  -O3 -fomit-frame-pointer -funroll-loops 
FAIL: gcc.c-torture/execute/built-in-setjmp.c execution,  -O3 -fomit-frame-pointer -funroll-all-loops -finline-functions 
FAIL: gcc.c-torture/execute/built-in-setjmp.c execution,  -O3 -g 
FAIL: gcc.c-torture/execute/built-in-setjmp.c execution,  -Os 
FAIL: gcc.c-torture/execute/builtin-prefetch-3.c execution,  -O1 
FAIL: gcc.c-torture/execute/builtin-prefetch-3.c execution,  -O2 
FAIL: gcc.c-torture/execute/builtin-prefetch-3.c execution,  -O3 -fomit-frame-pointer 
FAIL: gcc.c-torture/execute/builtin-prefetch-3.c execution,  -O3 -g 
FAIL: gcc.c-torture/execute/builtin-prefetch-3.c execution,  -Os 
FAIL: gcc.c-torture/execute/builtin-prefetch-4.c execution,  -O0 
FAIL: gcc.c-torture/execute/builtin-prefetch-4.c execution,  -O1 
FAIL: gcc.c-torture/execute/builtin-prefetch-4.c execution,  -O2 
FAIL: gcc.c-torture/execute/builtin-prefetch-4.c execution,  -Os 
FAIL: gcc.c-torture/execute/builtin-prefetch-6.c execution,  -O0 
FAIL: gcc.c-torture/execute/builtin-prefetch-6.c execution,  -O1 
FAIL: gcc.c-torture/execute/builtin-prefetch-6.c execution,  -O2 
FAIL: gcc.c-torture/execute/builtin-prefetch-6.c execution,  -Os 
FAIL: gcc.c-torture/execute/cmpsi-1.c execution,  -O0 
FAIL: gcc.c-torture/execute/cmpsi-1.c execution,  -O1 
FAIL: gcc.c-torture/execute/cmpsi-1.c execution,  -O2 
FAIL: gcc.c-torture/execute/cmpsi-1.c execution,  -Os 
FAIL: gcc.c-torture/execute/comp-goto-2.c execution,  -O0 
FAIL: gcc.c-torture/execute/comp-goto-2.c execution,  -O1 
FAIL: gcc.c-torture/execute/comp-goto-2.c execution,  -O2 
FAIL: gcc.c-torture/execute/comp-goto-2.c execution,  -O3 -fomit-frame-pointer 
FAIL: gcc.c-torture/execute/comp-goto-2.c execution,  -O3 -g 
FAIL: gcc.c-torture/execute/comp-goto-2.c execution,  -Os 
FAIL: gcc.c-torture/execute/complex-3.c execution,  -O0 
FAIL: gcc.c-torture/execute/divconst-1.c execution,  -O0 
FAIL: gcc.c-torture/execute/divconst-1.c execution,  -O1 
FAIL: gcc.c-torture/execute/divconst-1.c execution,  -O2 
FAIL: gcc.c-torture/execute/divconst-1.c execution,  -Os 
FAIL: gcc.c-torture/execute/enum-1.c execution,  -O0 
FAIL: gcc.c-torture/execute/ffs-2.c execution,  -O0 
FAIL: gcc.c-torture/execute/ffs-2.c execution,  -O1 
FAIL: gcc.c-torture/execute/ffs-2.c execution,  -O2 
FAIL: gcc.c-torture/execute/ffs-2.c execution,  -O3 -fomit-frame-pointer 
FAIL: gcc.c-torture/execute/ffs-2.c execution,  -O3 -fomit-frame-pointer -funroll-loops 
FAIL: gcc.c-torture/execute/ffs-2.c execution,  -O3 -fomit-frame-pointer -funroll-all-loops -finline-functions 
FAIL: gcc.c-torture/execute/ffs-2.c execution,  -O3 -g 
FAIL: gcc.c-torture/execute/ffs-2.c execution,  -Os 
FAIL: gcc.c-torture/execute/float-floor.c execution,  -O0 
FAIL: gcc.c-torture/execute/float-floor.c execution,  -O1 
FAIL: gcc.c-torture/execute/float-floor.c execution,  -O2 
FAIL: gcc.c-torture/execute/float-floor.c execution,  -O3 -fomit-frame-pointer 
FAIL: gcc.c-torture/execute/float-floor.c execution,  -O3 -g 
FAIL: gcc.c-torture/execute/float-floor.c execution,  -Os 
FAIL: gcc.c-torture/execute/fprintf-1.c execution,  -O0 
FAIL: gcc.c-torture/execute/fprintf-1.c execution,  -O1 
FAIL: gcc.c-torture/execute/fprintf-1.c execution,  -O2 
FAIL: gcc.c-torture/execute/fprintf-1.c execution,  -O3 -fomit-frame-pointer 
FAIL: gcc.c-torture/execute/fprintf-1.c execution,  -O3 -g 
FAIL: gcc.c-torture/execute/fprintf-1.c execution,  -Os 
FAIL: gcc.c-torture/execute/fprintf-chk-1.c execution,  -O0 
FAIL: gcc.c-torture/execute/fprintf-chk-1.c execution,  -O1 
FAIL: gcc.c-torture/execute/fprintf-chk-1.c execution,  -O2 
FAIL: gcc.c-torture/execute/fprintf-chk-1.c execution,  -O3 -fomit-frame-pointer 
FAIL: gcc.c-torture/execute/fprintf-chk-1.c execution,  -O3 -g 
FAIL: gcc.c-torture/execute/fprintf-chk-1.c execution,  -Os 
FAIL: gcc.c-torture/execute/index-1.c execution,  -O0 
FAIL: gcc.c-torture/execute/index-1.c execution,  -O1 
FAIL: gcc.c-torture/execute/index-1.c execution,  -O2 
FAIL: gcc.c-torture/execute/int-compare.c execution,  -O0 
FAIL: gcc.c-torture/execute/int-compare.c execution,  -O1 
FAIL: gcc.c-torture/execute/int-compare.c execution,  -O2 
FAIL: gcc.c-torture/execute/int-compare.c execution,  -Os 
FAIL: gcc.c-torture/execute/loop-1.c execution,  -O3 -fomit-frame-pointer 
FAIL: gcc.c-torture/execute/loop-1.c execution,  -O3 -fomit-frame-pointer -funroll-loops 
FAIL: gcc.c-torture/execute/loop-1.c execution,  -O3 -fomit-frame-pointer -funroll-all-loops -finline-functions 
FAIL: gcc.c-torture/execute/loop-14.c execution,  -O0 
FAIL: gcc.c-torture/execute/loop-14.c execution,  -O1 
FAIL: gcc.c-torture/execute/loop-14.c execution,  -O2 
FAIL: gcc.c-torture/execute/loop-14.c execution,  -Os 
FAIL: gcc.c-torture/execute/loop-2.c execution,  -O0 
FAIL: gcc.c-torture/execute/loop-2.c execution,  -O1 
FAIL: gcc.c-torture/execute/loop-2.c execution,  -O2 
FAIL: gcc.c-torture/execute/loop-2.c execution,  -O3 -fomit-frame-pointer -funroll-loops 
FAIL: gcc.c-torture/execute/loop-2.c execution,  -O3 -fomit-frame-pointer -funroll-all-loops -finline-functions 
FAIL: gcc.c-torture/execute/loop-2.c execution,  -Os 
FAIL: gcc.c-torture/execute/loop-2b.c execution,  -O1 
FAIL: gcc.c-torture/execute/loop-2b.c execution,  -O2 
FAIL: gcc.c-torture/execute/loop-2b.c execution,  -O3 -fomit-frame-pointer -funroll-loops 
FAIL: gcc.c-torture/execute/loop-2b.c execution,  -O3 -fomit-frame-pointer -funroll-all-loops -finline-functions 
FAIL: gcc.c-torture/execute/loop-2b.c execution,  -Os 
FAIL: gcc.c-torture/execute/loop-2c.c execution,  -O1 
FAIL: gcc.c-torture/execute/loop-2c.c execution,  -O2 
FAIL: gcc.c-torture/execute/loop-2c.c execution,  -O3 -fomit-frame-pointer -funroll-loops 
FAIL: gcc.c-torture/execute/loop-2c.c execution,  -O3 -fomit-frame-pointer -funroll-all-loops -finline-functions 
FAIL: gcc.c-torture/execute/loop-2c.c execution,  -Os 
FAIL: gcc.c-torture/execute/loop-2d.c execution,  -O1 
FAIL: gcc.c-torture/execute/loop-2d.c execution,  -O2 
FAIL: gcc.c-torture/execute/loop-2d.c execution,  -O3 -fomit-frame-pointer -funroll-loops 
FAIL: gcc.c-torture/execute/loop-2d.c execution,  -O3 -fomit-frame-pointer -funroll-all-loops -finline-functions 
FAIL: gcc.c-torture/execute/loop-2d.c execution,  -Os 
FAIL: gcc.c-torture/execute/loop-3.c execution,  -O0 
FAIL: gcc.c-torture/execute/loop-3.c execution,  -O1 
FAIL: gcc.c-torture/execute/loop-3.c execution,  -O2 
FAIL: gcc.c-torture/execute/loop-3c.c execution,  -O1 
FAIL: gcc.c-torture/execute/loop-3c.c execution,  -O2 
FAIL: gcc.c-torture/execute/loop-3c.c execution,  -Os 
FAIL: gcc.c-torture/execute/loop-4b.c execution,  -O0 
FAIL: gcc.c-torture/execute/loop-4b.c execution,  -O1 
FAIL: gcc.c-torture/execute/loop-4b.c execution,  -O2 
FAIL: gcc.c-torture/execute/loop-5.c execution,  -O0 
FAIL: gcc.c-torture/execute/loop-5.c execution,  -O1 
FAIL: gcc.c-torture/execute/loop-5.c execution,  -O2 
FAIL: gcc.c-torture/execute/loop-5.c execution,  -O3 -fomit-frame-pointer 
FAIL: gcc.c-torture/execute/loop-5.c execution,  -O3 -fomit-frame-pointer -funroll-loops 
FAIL: gcc.c-torture/execute/loop-5.c execution,  -O3 -fomit-frame-pointer -funroll-all-loops -finline-functions 
FAIL: gcc.c-torture/execute/loop-5.c execution,  -O3 -g 
FAIL: gcc.c-torture/execute/loop-5.c execution,  -Os 
FAIL: gcc.c-torture/execute/loop-6.c execution,  -O1 
FAIL: gcc.c-torture/execute/loop-6.c execution,  -O2 
FAIL: gcc.c-torture/execute/loop-6.c execution,  -O3 -fomit-frame-pointer 
FAIL: gcc.c-torture/execute/loop-6.c execution,  -O3 -g 
FAIL: gcc.c-torture/execute/loop-7.c execution,  -O1 
FAIL: gcc.c-torture/execute/loop-ivopts-3.c execution,  -O1 
FAIL: gcc.c-torture/execute/loop-ivopts-3.c execution,  -O2 
FAIL: gcc.c-torture/execute/loop-ivopts-3.c execution,  -O3 -fomit-frame-pointer 
FAIL: gcc.c-torture/execute/loop-ivopts-3.c execution,  -O3 -fomit-frame-pointer -funroll-loops 
FAIL: gcc.c-torture/execute/loop-ivopts-3.c execution,  -O3 -fomit-frame-pointer -funroll-all-loops -finline-functions 
FAIL: gcc.c-torture/execute/loop-ivopts-3.c execution,  -O3 -g 
FAIL: gcc.c-torture/execute/loop-ivopts-3.c execution,  -Os 
FAIL: gcc.c-torture/execute/memcpy-1.c execution,  -O0 
FAIL: gcc.c-torture/execute/memcpy-1.c execution,  -O1 
FAIL: gcc.c-torture/execute/memcpy-1.c execution,  -O2 
FAIL: gcc.c-torture/execute/memcpy-1.c execution,  -O3 -fomit-frame-pointer 
FAIL: gcc.c-torture/execute/memcpy-1.c execution,  -O3 -fomit-frame-pointer -funroll-loops 
FAIL: gcc.c-torture/execute/memcpy-1.c execution,  -O3 -fomit-frame-pointer -funroll-all-loops -finline-functions 
FAIL: gcc.c-torture/execute/memcpy-1.c execution,  -O3 -g 
FAIL: gcc.c-torture/execute/memcpy-1.c execution,  -Os 
FAIL: gcc.c-torture/execute/memcpy-bi.c execution,  -O0 
FAIL: gcc.c-torture/execute/memcpy-bi.c execution,  -O1 
FAIL: gcc.c-torture/execute/memcpy-bi.c execution,  -O2 
FAIL: gcc.c-torture/execute/memcpy-bi.c execution,  -O3 -fomit-frame-pointer 
FAIL: gcc.c-torture/execute/memcpy-bi.c execution,  -O3 -fomit-frame-pointer -funroll-loops 
FAIL: gcc.c-torture/execute/memcpy-bi.c execution,  -O3 -fomit-frame-pointer -funroll-all-loops -finline-functions 
FAIL: gcc.c-torture/execute/memcpy-bi.c execution,  -O3 -g 
FAIL: gcc.c-torture/execute/memcpy-bi.c execution,  -Os 
FAIL: gcc.c-torture/execute/multi-ix.c execution,  -O1 
FAIL: gcc.c-torture/execute/multi-ix.c execution,  -O2 
FAIL: gcc.c-torture/execute/multi-ix.c execution,  -O3 -fomit-frame-pointer 
FAIL: gcc.c-torture/execute/multi-ix.c execution,  -O3 -fomit-frame-pointer -funroll-loops 
FAIL: gcc.c-torture/execute/multi-ix.c execution,  -O3 -fomit-frame-pointer -funroll-all-loops -finline-functions 
FAIL: gcc.c-torture/execute/multi-ix.c execution,  -O3 -g 
FAIL: gcc.c-torture/execute/multi-ix.c execution,  -Os 
FAIL: gcc.c-torture/execute/nestfunc-1.c execution,  -O0 
FAIL: gcc.c-torture/execute/nestfunc-1.c execution,  -O1 
FAIL: gcc.c-torture/execute/nestfunc-1.c execution,  -O2 
FAIL: gcc.c-torture/execute/nestfunc-1.c execution,  -Os 
FAIL: gcc.c-torture/execute/nestfunc-2.c execution,  -O0 
FAIL: gcc.c-torture/execute/nestfunc-2.c execution,  -O1 
FAIL: gcc.c-torture/execute/nestfunc-2.c execution,  -O2 
FAIL: gcc.c-torture/execute/nestfunc-2.c execution,  -O3 -fomit-frame-pointer 
FAIL: gcc.c-torture/execute/nestfunc-2.c execution,  -O3 -fomit-frame-pointer -funroll-loops 
FAIL: gcc.c-torture/execute/nestfunc-2.c execution,  -O3 -fomit-frame-pointer -funroll-all-loops -finline-functions 
FAIL: gcc.c-torture/execute/nestfunc-2.c execution,  -O3 -g 
FAIL: gcc.c-torture/execute/nestfunc-2.c execution,  -Os 
FAIL: gcc.c-torture/execute/nestfunc-3.c execution,  -O0 
FAIL: gcc.c-torture/execute/nestfunc-3.c execution,  -O1 
FAIL: gcc.c-torture/execute/nestfunc-3.c execution,  -O2 
FAIL: gcc.c-torture/execute/nestfunc-3.c execution,  -O3 -fomit-frame-pointer 
FAIL: gcc.c-torture/execute/nestfunc-3.c execution,  -O3 -fomit-frame-pointer -funroll-loops 
FAIL: gcc.c-torture/execute/nestfunc-3.c execution,  -O3 -fomit-frame-pointer -funroll-all-loops -finline-functions 
FAIL: gcc.c-torture/execute/nestfunc-3.c compilation,  -O3 -g 
UNRESOLVED: gcc.c-torture/execute/nestfunc-3.c execution,  -O3 -g 
FAIL: gcc.c-torture/execute/nestfunc-3.c execution,  -Os 
FAIL: gcc.c-torture/execute/nestfunc-4.c execution,  -O0 
FAIL: gcc.c-torture/execute/nestfunc-4.c execution,  -O1 
FAIL: gcc.c-torture/execute/nestfunc-4.c execution,  -O2 
FAIL: gcc.c-torture/execute/nestfunc-4.c execution,  -O3 -fomit-frame-pointer 
FAIL: gcc.c-torture/execute/nestfunc-4.c execution,  -O3 -g 
FAIL: gcc.c-torture/execute/nestfunc-4.c execution,  -Os 
FAIL: gcc.c-torture/execute/nestfunc-5.c execution,  -O0 
FAIL: gcc.c-torture/execute/nestfunc-5.c execution,  -O1 
FAIL: gcc.c-torture/execute/nestfunc-5.c execution,  -O2 
FAIL: gcc.c-torture/execute/nestfunc-5.c execution,  -O3 -fomit-frame-pointer 
FAIL: gcc.c-torture/execute/nestfunc-5.c execution,  -O3 -g 
FAIL: gcc.c-torture/execute/nestfunc-5.c execution,  -Os 
FAIL: gcc.c-torture/execute/nestfunc-6.c execution,  -O0 
FAIL: gcc.c-torture/execute/nestfunc-6.c execution,  -O1 
FAIL: gcc.c-torture/execute/nestfunc-6.c execution,  -O2 
FAIL: gcc.c-torture/execute/nestfunc-6.c execution,  -O3 -fomit-frame-pointer 
FAIL: gcc.c-torture/execute/nestfunc-6.c execution,  -O3 -g 
FAIL: gcc.c-torture/execute/nestfunc-6.c execution,  -Os 
FAIL: gcc.c-torture/execute/packed-1.c execution,  -O0 
FAIL: gcc.c-torture/execute/pending-4.c execution,  -O1 
FAIL: gcc.c-torture/execute/pending-4.c execution,  -O2 
FAIL: gcc.c-torture/execute/pr15262-2.c execution,  -O0 
FAIL: gcc.c-torture/execute/pr15262-2.c execution,  -O1 
FAIL: gcc.c-torture/execute/pr15262-2.c execution,  -O2 
FAIL: gcc.c-torture/execute/pr15262-2.c execution,  -Os 
FAIL: gcc.c-torture/execute/pr15296.c execution,  -O0 
FAIL: gcc.c-torture/execute/pr15296.c execution,  -O1 
FAIL: gcc.c-torture/execute/pr15296.c execution,  -O2 
FAIL: gcc.c-torture/execute/pr15296.c execution,  -O3 -fomit-frame-pointer 
FAIL: gcc.c-torture/execute/pr15296.c execution,  -O3 -g 
FAIL: gcc.c-torture/execute/pr15296.c execution,  -Os 
FAIL: gcc.c-torture/execute/pr19515.c execution,  -Os 
FAIL: gcc.c-torture/execute/pr19689.c compilation,  -O0 
UNRESOLVED: gcc.c-torture/execute/pr19689.c execution,  -O0 
FAIL: gcc.c-torture/execute/pr19689.c compilation,  -O1 
UNRESOLVED: gcc.c-torture/execute/pr19689.c execution,  -O1 
FAIL: gcc.c-torture/execute/pr19689.c compilation,  -O2 
UNRESOLVED: gcc.c-torture/execute/pr19689.c execution,  -O2 
FAIL: gcc.c-torture/execute/pr19689.c compilation,  -O3 -fomit-frame-pointer 
UNRESOLVED: gcc.c-torture/execute/pr19689.c execution,  -O3 -fomit-frame-pointer 
FAIL: gcc.c-torture/execute/pr19689.c compilation,  -O3 -g 
UNRESOLVED: gcc.c-torture/execute/pr19689.c execution,  -O3 -g 
FAIL: gcc.c-torture/execute/pr19689.c compilation,  -Os 
UNRESOLVED: gcc.c-torture/execute/pr19689.c execution,  -Os 
FAIL: gcc.c-torture/execute/pr20100-1.c execution,  -O0 
FAIL: gcc.c-torture/execute/pr20100-1.c execution,  -O1 
FAIL: gcc.c-torture/execute/pr20100-1.c execution,  -O2 
FAIL: gcc.c-torture/execute/pr20100-1.c execution,  -O3 -fomit-frame-pointer -funroll-loops 
FAIL: gcc.c-torture/execute/pr20100-1.c execution,  -O3 -fomit-frame-pointer -funroll-all-loops -finline-functions 
FAIL: gcc.c-torture/execute/pr20100-1.c execution,  -Os 
FAIL: gcc.c-torture/execute/pr20466-1.c execution,  -O0 
FAIL: gcc.c-torture/execute/pr20466-1.c execution,  -O1 
FAIL: gcc.c-torture/execute/pr20466-1.c execution,  -O2 
FAIL: gcc.c-torture/execute/pr20466-1.c execution,  -O3 -fomit-frame-pointer 
FAIL: gcc.c-torture/execute/pr20466-1.c execution,  -O3 -g 
FAIL: gcc.c-torture/execute/pr20466-1.c execution,  -Os 
FAIL: gcc.c-torture/execute/pr20527-1.c execution,  -O0 
FAIL: gcc.c-torture/execute/pr20601-1.c execution,  -O0 
FAIL: gcc.c-torture/execute/pr20601-1.c execution,  -O1 
FAIL: gcc.c-torture/execute/pr20601-1.c execution,  -O2 
FAIL: gcc.c-torture/execute/pr20601-1.c execution,  -O3 -fomit-frame-pointer 
FAIL: gcc.c-torture/execute/pr20601-1.c execution,  -O3 -fomit-frame-pointer -funroll-all-loops -finline-functions 
FAIL: gcc.c-torture/execute/pr20601-1.c execution,  -O3 -g 
FAIL: gcc.c-torture/execute/pr20621-1.c execution,  -O0 
FAIL: gcc.c-torture/execute/pr20621-1.c execution,  -O1 
FAIL: gcc.c-torture/execute/pr20621-1.c execution,  -O2 
FAIL: gcc.c-torture/execute/pr20621-1.c execution,  -O3 -fomit-frame-pointer 
FAIL: gcc.c-torture/execute/pr20621-1.c execution,  -O3 -g 
FAIL: gcc.c-torture/execute/pr20621-1.c execution,  -Os 
FAIL: gcc.c-torture/execute/pr22061-1.c execution,  -O0 
FAIL: gcc.c-torture/execute/pr22061-1.c execution,  -O2 
FAIL: gcc.c-torture/execute/pr22061-1.c execution,  -Os 
FAIL: gcc.c-torture/execute/pr22061-3.c execution,  -O0 
FAIL: gcc.c-torture/execute/pr22061-3.c execution,  -O1 
FAIL: gcc.c-torture/execute/pr22061-3.c execution,  -O2 
FAIL: gcc.c-torture/execute/pr22061-3.c execution,  -Os 
FAIL: gcc.c-torture/execute/pr22061-4.c execution,  -O2 
FAIL: gcc.c-torture/execute/pr22061-4.c execution,  -O3 -fomit-frame-pointer 
FAIL: gcc.c-torture/execute/pr22061-4.c execution,  -O3 -g 
FAIL: gcc.c-torture/execute/pr22061-4.c execution,  -Os 
FAIL: gcc.c-torture/execute/pr22098-1.c execution,  -O0 
FAIL: gcc.c-torture/execute/pr22098-1.c execution,  -O1 
FAIL: gcc.c-torture/execute/pr22098-1.c execution,  -O2 
FAIL: gcc.c-torture/execute/pr22098-1.c execution,  -O3 -fomit-frame-pointer 
FAIL: gcc.c-torture/execute/pr22098-1.c execution,  -O3 -g 
FAIL: gcc.c-torture/execute/pr22098-1.c execution,  -Os 
FAIL: gcc.c-torture/execute/pr22098-2.c execution,  -O0 
FAIL: gcc.c-torture/execute/pr22098-2.c execution,  -O1 
FAIL: gcc.c-torture/execute/pr22098-2.c execution,  -O2 
FAIL: gcc.c-torture/execute/pr22098-2.c execution,  -O3 -fomit-frame-pointer 
FAIL: gcc.c-torture/execute/pr22098-2.c execution,  -O3 -g 
FAIL: gcc.c-torture/execute/pr22098-2.c execution,  -Os 
FAIL: gcc.c-torture/execute/pr22098-3.c execution,  -O0 
FAIL: gcc.c-torture/execute/pr22098-3.c execution,  -O1 
FAIL: gcc.c-torture/execute/pr22098-3.c execution,  -O2 
FAIL: gcc.c-torture/execute/pr23135.c execution,  -O0 
FAIL: gcc.c-torture/execute/pr23135.c execution,  -O1 
FAIL: gcc.c-torture/execute/pr23135.c execution,  -O2 
FAIL: gcc.c-torture/execute/pr23135.c execution,  -O3 -fomit-frame-pointer 
FAIL: gcc.c-torture/execute/pr23135.c execution,  -O3 -g 
FAIL: gcc.c-torture/execute/pr23135.c execution,  -Os 
FAIL: gcc.c-torture/execute/pr27285.c execution,  -O3 -fomit-frame-pointer -funroll-loops 
FAIL: gcc.c-torture/execute/pr27285.c execution,  -O3 -fomit-frame-pointer -funroll-all-loops -finline-functions 
FAIL: gcc.c-torture/execute/pr27285.c execution,  -Os 
FAIL: gcc.c-torture/execute/pr27364.c execution,  -O0 
FAIL: gcc.c-torture/execute/pr27364.c execution,  -O1 
FAIL: gcc.c-torture/execute/pr27364.c execution,  -O2 
FAIL: gcc.c-torture/execute/pr27364.c execution,  -Os 
FAIL: gcc.c-torture/execute/pr28651.c execution,  -O0 
FAIL: gcc.c-torture/execute/pr28651.c execution,  -O1 
FAIL: gcc.c-torture/execute/pr28651.c execution,  -O2 
FAIL: gcc.c-torture/execute/pr28651.c execution,  -O3 -fomit-frame-pointer 
FAIL: gcc.c-torture/execute/pr28651.c execution,  -O3 -g 
FAIL: gcc.c-torture/execute/pr28651.c execution,  -Os 
FAIL: gcc.c-torture/execute/pr29797-1.c execution,  -O0 
FAIL: gcc.c-torture/execute/pr29797-1.c execution,  -O1 
FAIL: gcc.c-torture/execute/pr29797-1.c execution,  -O2 
FAIL: gcc.c-torture/execute/pr29797-1.c execution,  -O3 -fomit-frame-pointer 
FAIL: gcc.c-torture/execute/pr29797-1.c execution,  -O3 -g 
FAIL: gcc.c-torture/execute/pr29797-1.c execution,  -Os 
FAIL: gcc.c-torture/execute/pr31448.c compilation,  -O0 
UNRESOLVED: gcc.c-torture/execute/pr31448.c execution,  -O0 
FAIL: gcc.c-torture/execute/pr31448.c compilation,  -O1 
UNRESOLVED: gcc.c-torture/execute/pr31448.c execution,  -O1 
FAIL: gcc.c-torture/execute/pr31448.c compilation,  -O2 
UNRESOLVED: gcc.c-torture/execute/pr31448.c execution,  -O2 
FAIL: gcc.c-torture/execute/pr31448.c compilation,  -O3 -fomit-frame-pointer 
UNRESOLVED: gcc.c-torture/execute/pr31448.c execution,  -O3 -fomit-frame-pointer 
FAIL: gcc.c-torture/execute/pr31448.c compilation,  -O3 -g 
UNRESOLVED: gcc.c-torture/execute/pr31448.c execution,  -O3 -g 
FAIL: gcc.c-torture/execute/pr31448.c compilation,  -Os 
UNRESOLVED: gcc.c-torture/execute/pr31448.c execution,  -Os 
FAIL: gcc.c-torture/execute/pr7284-1.c execution,  -O0 
FAIL: gcc.c-torture/execute/pr7284-1.c execution,  -O1 
FAIL: gcc.c-torture/execute/pr7284-1.c execution,  -O2 
FAIL: gcc.c-torture/execute/pr7284-1.c execution,  -O3 -fomit-frame-pointer 
FAIL: gcc.c-torture/execute/pr7284-1.c execution,  -O3 -g 
FAIL: gcc.c-torture/execute/pr7284-1.c execution,  -Os 
FAIL: gcc.c-torture/execute/printf-chk-1.c execution,  -O0 
FAIL: gcc.c-torture/execute/printf-chk-1.c execution,  -O1 
FAIL: gcc.c-torture/execute/printf-chk-1.c execution,  -O2 
FAIL: gcc.c-torture/execute/printf-chk-1.c execution,  -O3 -fomit-frame-pointer 
FAIL: gcc.c-torture/execute/printf-chk-1.c execution,  -O3 -g 
FAIL: gcc.c-torture/execute/printf-chk-1.c execution,  -Os 
FAIL: gcc.c-torture/execute/ptr-arith-1.c execution,  -O0 
FAIL: gcc.c-torture/execute/ptr-arith-1.c execution,  -O1 
FAIL: gcc.c-torture/execute/ptr-arith-1.c execution,  -O2 
FAIL: gcc.c-torture/execute/simd-1.c execution,  -O0 
FAIL: gcc.c-torture/execute/simd-1.c execution,  -O1 
FAIL: gcc.c-torture/execute/simd-1.c execution,  -O2 
FAIL: gcc.c-torture/execute/simd-1.c execution,  -O3 -fomit-frame-pointer 
FAIL: gcc.c-torture/execute/simd-1.c execution,  -O3 -g 
FAIL: gcc.c-torture/execute/simd-1.c execution,  -Os 
FAIL: gcc.c-torture/execute/simd-2.c execution,  -O0 
FAIL: gcc.c-torture/execute/simd-2.c execution,  -O2 
FAIL: gcc.c-torture/execute/simd-2.c execution,  -O3 -fomit-frame-pointer 
FAIL: gcc.c-torture/execute/simd-2.c execution,  -O3 -g 
FAIL: gcc.c-torture/execute/simd-2.c execution,  -Os 
FAIL: gcc.c-torture/execute/simd-5.c execution,  -O0 
FAIL: gcc.c-torture/execute/simd-5.c execution,  -O1 
FAIL: gcc.c-torture/execute/simd-5.c execution,  -O2 
FAIL: gcc.c-torture/execute/simd-5.c execution,  -O3 -fomit-frame-pointer 
FAIL: gcc.c-torture/execute/simd-5.c execution,  -O3 -g 
FAIL: gcc.c-torture/execute/simd-5.c execution,  -Os 
FAIL: gcc.c-torture/execute/simd-6.c execution,  -O0 
FAIL: gcc.c-torture/execute/simd-6.c execution,  -O1 
FAIL: gcc.c-torture/execute/simd-6.c execution,  -O2 
FAIL: gcc.c-torture/execute/simd-6.c execution,  -O3 -fomit-frame-pointer 
FAIL: gcc.c-torture/execute/simd-6.c execution,  -O3 -g 
FAIL: gcc.c-torture/execute/simd-6.c execution,  -Os 
FAIL: gcc.c-torture/execute/stdarg-3.c execution,  -O0 
FAIL: gcc.c-torture/execute/stdarg-3.c execution,  -O1 
FAIL: gcc.c-torture/execute/stdarg-3.c execution,  -O2 
FAIL: gcc.c-torture/execute/stdarg-3.c execution,  -O3 -fomit-frame-pointer 
FAIL: gcc.c-torture/execute/stdarg-3.c execution,  -O3 -fomit-frame-pointer -funroll-loops 
FAIL: gcc.c-torture/execute/stdarg-3.c execution,  -O3 -fomit-frame-pointer -funroll-all-loops -finline-functions 
FAIL: gcc.c-torture/execute/stdarg-3.c execution,  -O3 -g 
FAIL: gcc.c-torture/execute/stdarg-3.c execution,  -Os 
FAIL: gcc.c-torture/execute/strct-pack-3.c execution,  -O0 
FAIL: gcc.c-torture/execute/strct-pack-3.c execution,  -O1 
FAIL: gcc.c-torture/execute/strct-pack-3.c execution,  -O2 
FAIL: gcc.c-torture/execute/strct-pack-3.c execution,  -Os 
FAIL: gcc.c-torture/execute/strct-pack-4.c execution,  -O0 
FAIL: gcc.c-torture/execute/strct-pack-4.c execution,  -O1 
FAIL: gcc.c-torture/execute/strct-pack-4.c execution,  -O2 
FAIL: gcc.c-torture/execute/strct-stdarg-1.c execution,  -O0 
FAIL: gcc.c-torture/execute/strct-stdarg-1.c execution,  -O1 
FAIL: gcc.c-torture/execute/strct-stdarg-1.c execution,  -O2 
FAIL: gcc.c-torture/execute/strct-stdarg-1.c execution,  -O3 -fomit-frame-pointer 
FAIL: gcc.c-torture/execute/strct-stdarg-1.c execution,  -O3 -fomit-frame-pointer -funroll-loops 
FAIL: gcc.c-torture/execute/strct-stdarg-1.c execution,  -O3 -fomit-frame-pointer -funroll-all-loops -finline-functions 
FAIL: gcc.c-torture/execute/strct-stdarg-1.c execution,  -O3 -g 
FAIL: gcc.c-torture/execute/strct-stdarg-1.c execution,  -Os 
FAIL: gcc.c-torture/execute/strct-varg-1.c execution,  -O1 
FAIL: gcc.c-torture/execute/strct-varg-1.c execution,  -O2 
FAIL: gcc.c-torture/execute/strct-varg-1.c execution,  -O3 -fomit-frame-pointer 
FAIL: gcc.c-torture/execute/strct-varg-1.c execution,  -O3 -g 
FAIL: gcc.c-torture/execute/strct-varg-1.c execution,  -Os 
FAIL: gcc.c-torture/execute/string-opt-17.c execution,  -O0 
FAIL: gcc.c-torture/execute/string-opt-17.c execution,  -O1 
FAIL: gcc.c-torture/execute/string-opt-17.c execution,  -O2 
FAIL: gcc.c-torture/execute/string-opt-17.c execution,  -O3 -fomit-frame-pointer 
FAIL: gcc.c-torture/execute/string-opt-17.c execution,  -O3 -g 
FAIL: gcc.c-torture/execute/string-opt-17.c execution,  -Os 
FAIL: gcc.c-torture/execute/string-opt-5.c execution,  -O0 
FAIL: gcc.c-torture/execute/string-opt-5.c execution,  -O1 
FAIL: gcc.c-torture/execute/string-opt-5.c execution,  -O2 
FAIL: gcc.c-torture/execute/string-opt-5.c execution,  -O3 -fomit-frame-pointer 
FAIL: gcc.c-torture/execute/string-opt-5.c execution,  -O3 -g 
FAIL: gcc.c-torture/execute/string-opt-5.c execution,  -Os 
WARNING: program timed out.
FAIL: gcc.c-torture/execute/struct-cpy-1.c execution,  -O1 
WARNING: program timed out.
FAIL: gcc.c-torture/execute/struct-cpy-1.c execution,  -O2 
FAIL: gcc.c-torture/execute/struct-cpy-1.c execution,  -O3 -fomit-frame-pointer 
FAIL: gcc.c-torture/execute/struct-cpy-1.c execution,  -O3 -g 
WARNING: program timed out.
FAIL: gcc.c-torture/execute/struct-cpy-1.c execution,  -Os 
WARNING: program timed out.
FAIL: gcc.c-torture/execute/struct-ret-1.c execution,  -O1 
FAIL: gcc.c-torture/execute/struct-ret-1.c execution,  -O2 
FAIL: gcc.c-torture/execute/struct-ret-1.c execution,  -O3 -fomit-frame-pointer 
FAIL: gcc.c-torture/execute/struct-ret-1.c execution,  -O3 -g 
FAIL: gcc.c-torture/execute/struct-ret-1.c execution,  -Os 
FAIL: gcc.c-torture/execute/struct-ret-2.c execution,  -O0 
FAIL: gcc.c-torture/execute/struct-ret-2.c execution,  -O1 
FAIL: gcc.c-torture/execute/struct-ret-2.c execution,  -O2 
FAIL: gcc.c-torture/execute/unroll-1.c execution,  -O0 
FAIL: gcc.c-torture/execute/va-arg-1.c execution,  -O1 
FAIL: gcc.c-torture/execute/va-arg-1.c execution,  -O2 
FAIL: gcc.c-torture/execute/va-arg-1.c execution,  -O3 -fomit-frame-pointer 
FAIL: gcc.c-torture/execute/va-arg-1.c execution,  -O3 -g 
FAIL: gcc.c-torture/execute/va-arg-1.c execution,  -Os 
FAIL: gcc.c-torture/execute/va-arg-10.c execution,  -O0 
FAIL: gcc.c-torture/execute/va-arg-10.c execution,  -O1 
FAIL: gcc.c-torture/execute/va-arg-10.c execution,  -O2 
FAIL: gcc.c-torture/execute/va-arg-10.c execution,  -O3 -fomit-frame-pointer 
FAIL: gcc.c-torture/execute/va-arg-10.c execution,  -O3 -fomit-frame-pointer -funroll-loops 
FAIL: gcc.c-torture/execute/va-arg-10.c execution,  -O3 -fomit-frame-pointer -funroll-all-loops -finline-functions 
FAIL: gcc.c-torture/execute/va-arg-10.c execution,  -O3 -g 
FAIL: gcc.c-torture/execute/va-arg-10.c execution,  -Os 
FAIL: gcc.c-torture/execute/va-arg-14.c execution,  -O2 
FAIL: gcc.c-torture/execute/va-arg-14.c execution,  -O3 -fomit-frame-pointer 
FAIL: gcc.c-torture/execute/va-arg-14.c execution,  -O3 -g 
FAIL: gcc.c-torture/execute/va-arg-14.c execution,  -Os 
FAIL: gcc.c-torture/execute/va-arg-15.c execution,  -O3 -fomit-frame-pointer -funroll-loops 
FAIL: gcc.c-torture/execute/va-arg-15.c execution,  -O3 -fomit-frame-pointer -funroll-all-loops -finline-functions 
FAIL: gcc.c-torture/execute/va-arg-16.c execution,  -O2 
FAIL: gcc.c-torture/execute/va-arg-16.c execution,  -O3 -fomit-frame-pointer 
FAIL: gcc.c-torture/execute/va-arg-16.c execution,  -O3 -g 
FAIL: gcc.c-torture/execute/va-arg-18.c execution,  -O1 
FAIL: gcc.c-torture/execute/va-arg-18.c execution,  -O2 
FAIL: gcc.c-torture/execute/va-arg-18.c execution,  -O3 -fomit-frame-pointer 
FAIL: gcc.c-torture/execute/va-arg-18.c execution,  -O3 -g 
FAIL: gcc.c-torture/execute/va-arg-18.c execution,  -Os 
FAIL: gcc.c-torture/execute/va-arg-19.c execution,  -O1 
FAIL: gcc.c-torture/execute/va-arg-19.c execution,  -O2 
FAIL: gcc.c-torture/execute/va-arg-19.c execution,  -O3 -fomit-frame-pointer 
FAIL: gcc.c-torture/execute/va-arg-19.c execution,  -O3 -g 
FAIL: gcc.c-torture/execute/va-arg-19.c execution,  -Os 
FAIL: gcc.c-torture/execute/va-arg-2.c execution,  -O0 
FAIL: gcc.c-torture/execute/va-arg-2.c execution,  -O1 
FAIL: gcc.c-torture/execute/va-arg-2.c execution,  -O2 
FAIL: gcc.c-torture/execute/va-arg-2.c execution,  -O3 -fomit-frame-pointer 
FAIL: gcc.c-torture/execute/va-arg-2.c execution,  -O3 -fomit-frame-pointer -funroll-loops 
FAIL: gcc.c-torture/execute/va-arg-2.c execution,  -O3 -fomit-frame-pointer -funroll-all-loops -finline-functions 
FAIL: gcc.c-torture/execute/va-arg-2.c execution,  -O3 -g 
FAIL: gcc.c-torture/execute/va-arg-2.c execution,  -Os 
FAIL: gcc.c-torture/execute/va-arg-21.c execution,  -O0 
FAIL: gcc.c-torture/execute/va-arg-21.c execution,  -O1 
FAIL: gcc.c-torture/execute/va-arg-21.c execution,  -O2 
FAIL: gcc.c-torture/execute/va-arg-21.c execution,  -O3 -fomit-frame-pointer 
FAIL: gcc.c-torture/execute/va-arg-21.c execution,  -O3 -fomit-frame-pointer -funroll-loops 
FAIL: gcc.c-torture/execute/va-arg-21.c execution,  -O3 -fomit-frame-pointer -funroll-all-loops -finline-functions 
FAIL: gcc.c-torture/execute/va-arg-21.c execution,  -O3 -g 
FAIL: gcc.c-torture/execute/va-arg-21.c execution,  -Os 
FAIL: gcc.c-torture/execute/va-arg-22.c execution,  -O0 
FAIL: gcc.c-torture/execute/va-arg-22.c execution,  -O1 
FAIL: gcc.c-torture/execute/va-arg-22.c execution,  -O2 
FAIL: gcc.c-torture/execute/va-arg-22.c execution,  -O3 -fomit-frame-pointer 
FAIL: gcc.c-torture/execute/va-arg-22.c execution,  -O3 -fomit-frame-pointer -funroll-loops 
FAIL: gcc.c-torture/execute/va-arg-22.c execution,  -O3 -fomit-frame-pointer -funroll-all-loops -finline-functions 
FAIL: gcc.c-torture/execute/va-arg-22.c execution,  -O3 -g 
FAIL: gcc.c-torture/execute/va-arg-22.c execution,  -Os 
FAIL: gcc.c-torture/execute/va-arg-23.c execution,  -O1 
FAIL: gcc.c-torture/execute/va-arg-23.c execution,  -O2 
FAIL: gcc.c-torture/execute/va-arg-23.c execution,  -O3 -fomit-frame-pointer 
FAIL: gcc.c-torture/execute/va-arg-23.c execution,  -O3 -g 
FAIL: gcc.c-torture/execute/va-arg-23.c execution,  -Os 
FAIL: gcc.c-torture/execute/va-arg-24.c execution,  -O0 
FAIL: gcc.c-torture/execute/va-arg-24.c execution,  -O1 
FAIL: gcc.c-torture/execute/va-arg-24.c execution,  -O2 
FAIL: gcc.c-torture/execute/va-arg-24.c execution,  -O3 -fomit-frame-pointer 
FAIL: gcc.c-torture/execute/va-arg-24.c execution,  -O3 -fomit-frame-pointer -funroll-loops 
FAIL: gcc.c-torture/execute/va-arg-24.c execution,  -O3 -fomit-frame-pointer -funroll-all-loops -finline-functions 
FAIL: gcc.c-torture/execute/va-arg-24.c execution,  -O3 -g 
FAIL: gcc.c-torture/execute/va-arg-24.c execution,  -Os 
FAIL: gcc.c-torture/execute/va-arg-4.c execution,  -O0 
FAIL: gcc.c-torture/execute/va-arg-4.c execution,  -O1 
FAIL: gcc.c-torture/execute/va-arg-4.c execution,  -O2 
FAIL: gcc.c-torture/execute/va-arg-4.c execution,  -O3 -fomit-frame-pointer 
FAIL: gcc.c-torture/execute/va-arg-4.c execution,  -O3 -g 
FAIL: gcc.c-torture/execute/va-arg-4.c execution,  -Os 
FAIL: gcc.c-torture/execute/va-arg-7.c execution,  -O1 
FAIL: gcc.c-torture/execute/va-arg-7.c execution,  -O2 
FAIL: gcc.c-torture/execute/va-arg-7.c execution,  -O3 -fomit-frame-pointer 
FAIL: gcc.c-torture/execute/va-arg-7.c execution,  -O3 -g 
FAIL: gcc.c-torture/execute/va-arg-7.c execution,  -Os 
FAIL: gcc.c-torture/execute/va-arg-9.c execution,  -O0 
FAIL: gcc.c-torture/execute/va-arg-9.c execution,  -O1 
FAIL: gcc.c-torture/execute/va-arg-9.c execution,  -O2 
FAIL: gcc.c-torture/execute/va-arg-9.c execution,  -O3 -fomit-frame-pointer 
FAIL: gcc.c-torture/execute/va-arg-9.c execution,  -O3 -fomit-frame-pointer -funroll-loops 
FAIL: gcc.c-torture/execute/va-arg-9.c execution,  -O3 -fomit-frame-pointer -funroll-all-loops -finline-functions 
FAIL: gcc.c-torture/execute/va-arg-9.c execution,  -O3 -g 
FAIL: gcc.c-torture/execute/va-arg-9.c execution,  -Os 
FAIL: gcc.c-torture/execute/vfprintf-1.c execution,  -O0 
FAIL: gcc.c-torture/execute/vfprintf-1.c execution,  -O1 
FAIL: gcc.c-torture/execute/vfprintf-1.c execution,  -O2 
FAIL: gcc.c-torture/execute/vfprintf-1.c execution,  -O3 -fomit-frame-pointer 
FAIL: gcc.c-torture/execute/vfprintf-1.c execution,  -O3 -g 
FAIL: gcc.c-torture/execute/vfprintf-1.c execution,  -Os 
FAIL: gcc.c-torture/execute/vfprintf-chk-1.c execution,  -O0 
FAIL: gcc.c-torture/execute/vfprintf-chk-1.c execution,  -O1 
FAIL: gcc.c-torture/execute/vfprintf-chk-1.c execution,  -O2 
FAIL: gcc.c-torture/execute/vfprintf-chk-1.c execution,  -O3 -fomit-frame-pointer 
FAIL: gcc.c-torture/execute/vfprintf-chk-1.c execution,  -O3 -g 
FAIL: gcc.c-torture/execute/vfprintf-chk-1.c execution,  -Os 
FAIL: gcc.c-torture/execute/vprintf-1.c execution,  -O0 
FAIL: gcc.c-torture/execute/vprintf-1.c execution,  -O1 
FAIL: gcc.c-torture/execute/vprintf-1.c execution,  -O2 
FAIL: gcc.c-torture/execute/vprintf-1.c execution,  -O3 -fomit-frame-pointer 
FAIL: gcc.c-torture/execute/vprintf-1.c execution,  -O3 -g 
FAIL: gcc.c-torture/execute/vprintf-1.c execution,  -Os 
FAIL: gcc.c-torture/execute/vprintf-chk-1.c execution,  -O0 
FAIL: gcc.c-torture/execute/vprintf-chk-1.c execution,  -O1 
FAIL: gcc.c-torture/execute/vprintf-chk-1.c execution,  -O2 
FAIL: gcc.c-torture/execute/vprintf-chk-1.c execution,  -O3 -fomit-frame-pointer 
FAIL: gcc.c-torture/execute/vprintf-chk-1.c execution,  -O3 -g 
FAIL: gcc.c-torture/execute/vprintf-chk-1.c execution,  -Os 
FAIL: gcc.c-torture/execute/vrp-4.c execution,  -O0 
FAIL: gcc.c-torture/execute/vrp-4.c execution,  -O1 
FAIL: gcc.c-torture/execute/vrp-4.c execution,  -O2 
FAIL: gcc.c-torture/execute/vrp-4.c execution,  -Os 
FAIL: gcc.c-torture/execute/vrp-5.c execution,  -O0 
FAIL: gcc.c-torture/execute/vrp-5.c execution,  -O1 
FAIL: gcc.c-torture/execute/vrp-5.c execution,  -O2 
FAIL: gcc.c-torture/execute/vrp-5.c execution,  -O3 -fomit-frame-pointer 
FAIL: gcc.c-torture/execute/vrp-5.c execution,  -O3 -g 
FAIL: gcc.c-torture/execute/vrp-5.c execution,  -Os 
FAIL: gcc.c-torture/execute/vrp-6.c execution,  -O0 
FAIL: gcc.c-torture/execute/vrp-6.c execution,  -O1 
FAIL: gcc.c-torture/execute/vrp-6.c execution,  -O2 
FAIL: gcc.c-torture/execute/vrp-6.c execution,  -O3 -fomit-frame-pointer 
FAIL: gcc.c-torture/execute/vrp-6.c execution,  -O3 -g 
FAIL: gcc.c-torture/execute/vrp-6.c execution,  -Os 
FAIL: gcc.c-torture/execute/wchar_t-1.c execution,  -O2 
FAIL: gcc.c-torture/execute/wchar_t-1.c execution,  -O3 -fomit-frame-pointer 
FAIL: gcc.c-torture/execute/wchar_t-1.c execution,  -O3 -g 
FAIL: gcc.c-torture/execute/wchar_t-1.c execution,  -Os 
FAIL: gcc.c-torture/execute/ieee/20001122-1.c execution,  -O0 
FAIL: gcc.c-torture/execute/ieee/20001122-1.c execution,  -O1 
FAIL: gcc.c-torture/execute/ieee/20001122-1.c execution,  -O2 
FAIL: gcc.c-torture/execute/ieee/20001122-1.c execution,  -O3 -fomit-frame-pointer 
FAIL: gcc.c-torture/execute/ieee/20001122-1.c execution,  -O3 -fomit-frame-pointer -funroll-loops 
FAIL: gcc.c-torture/execute/ieee/20001122-1.c execution,  -O3 -fomit-frame-pointer -funroll-all-loops -finline-functions 
FAIL: gcc.c-torture/execute/ieee/20001122-1.c execution,  -O3 -g 
FAIL: gcc.c-torture/execute/ieee/20001122-1.c execution,  -Os 
FAIL: gcc.c-torture/execute/ieee/920518-1.c execution,  -O0 
FAIL: gcc.c-torture/execute/ieee/920518-1.c execution,  -O1 
FAIL: gcc.c-torture/execute/ieee/920518-1.c execution,  -O2 
FAIL: gcc.c-torture/execute/ieee/920518-1.c execution,  -O3 -fomit-frame-pointer 
FAIL: gcc.c-torture/execute/ieee/920518-1.c execution,  -O3 -g 
FAIL: gcc.c-torture/execute/ieee/920518-1.c execution,  -Os 
FAIL: gcc.c-torture/execute/ieee/acc1.c execution,  -O0 
FAIL: gcc.c-torture/execute/ieee/acc1.c execution,  -O1 
FAIL: gcc.c-torture/execute/ieee/acc1.c execution,  -O2 
FAIL: gcc.c-torture/execute/ieee/acc1.c execution,  -O3 -fomit-frame-pointer 
FAIL: gcc.c-torture/execute/ieee/acc1.c execution,  -O3 -g 
FAIL: gcc.c-torture/execute/ieee/acc1.c execution,  -Os 
FAIL: gcc.c-torture/execute/ieee/acc2.c execution,  -O0 
FAIL: gcc.c-torture/execute/ieee/acc2.c execution,  -O1 
FAIL: gcc.c-torture/execute/ieee/acc2.c execution,  -O2 
FAIL: gcc.c-torture/execute/ieee/acc2.c execution,  -O3 -fomit-frame-pointer 
FAIL: gcc.c-torture/execute/ieee/acc2.c execution,  -O3 -g 
FAIL: gcc.c-torture/execute/ieee/acc2.c execution,  -Os 
FAIL: gcc.c-torture/execute/ieee/copysign1.c execution,  -O0 
FAIL: gcc.c-torture/execute/ieee/copysign1.c execution,  -O1 
FAIL: gcc.c-torture/execute/ieee/copysign1.c execution,  -O3 -fomit-frame-pointer 
FAIL: gcc.c-torture/execute/ieee/copysign1.c execution,  -O3 -fomit-frame-pointer -funroll-loops 
FAIL: gcc.c-torture/execute/ieee/copysign1.c execution,  -O3 -fomit-frame-pointer -funroll-all-loops -finline-functions 
FAIL: gcc.c-torture/execute/ieee/copysign1.c execution,  -O3 -g 
FAIL: gcc.c-torture/execute/ieee/copysign2.c execution,  -O0 
FAIL: gcc.c-torture/execute/ieee/copysign2.c execution,  -O1 
FAIL: gcc.c-torture/execute/ieee/copysign2.c execution,  -O2 
FAIL: gcc.c-torture/execute/ieee/copysign2.c execution,  -O3 -fomit-frame-pointer 
FAIL: gcc.c-torture/execute/ieee/copysign2.c execution,  -O3 -fomit-frame-pointer -funroll-loops 
FAIL: gcc.c-torture/execute/ieee/copysign2.c execution,  -O3 -fomit-frame-pointer -funroll-all-loops -finline-functions 
FAIL: gcc.c-torture/execute/ieee/copysign2.c execution,  -O3 -g 
FAIL: gcc.c-torture/execute/ieee/copysign2.c execution,  -Os 
FAIL: gcc.c-torture/execute/ieee/fp-cmp-1.c execution,  -O0 
FAIL: gcc.c-torture/execute/ieee/fp-cmp-1.c execution,  -O1 
FAIL: gcc.c-torture/execute/ieee/fp-cmp-1.c execution,  -O2 
FAIL: gcc.c-torture/execute/ieee/fp-cmp-1.c execution,  -O3 -fomit-frame-pointer 
FAIL: gcc.c-torture/execute/ieee/fp-cmp-1.c execution,  -O3 -fomit-frame-pointer -funroll-loops 
FAIL: gcc.c-torture/execute/ieee/fp-cmp-1.c execution,  -O3 -fomit-frame-pointer -funroll-all-loops -finline-functions 
FAIL: gcc.c-torture/execute/ieee/fp-cmp-1.c execution,  -O3 -g 
FAIL: gcc.c-torture/execute/ieee/fp-cmp-1.c execution,  -Os 
FAIL: gcc.c-torture/execute/ieee/fp-cmp-2.c execution,  -O0 
FAIL: gcc.c-torture/execute/ieee/fp-cmp-2.c execution,  -O1 
FAIL: gcc.c-torture/execute/ieee/fp-cmp-2.c execution,  -O2 
FAIL: gcc.c-torture/execute/ieee/fp-cmp-2.c execution,  -O3 -fomit-frame-pointer 
FAIL: gcc.c-torture/execute/ieee/fp-cmp-2.c execution,  -O3 -fomit-frame-pointer -funroll-loops 
FAIL: gcc.c-torture/execute/ieee/fp-cmp-2.c execution,  -O3 -fomit-frame-pointer -funroll-all-loops -finline-functions 
FAIL: gcc.c-torture/execute/ieee/fp-cmp-2.c execution,  -O3 -g 
FAIL: gcc.c-torture/execute/ieee/fp-cmp-2.c execution,  -Os 
FAIL: gcc.c-torture/execute/ieee/fp-cmp-3.c execution,  -O0 
FAIL: gcc.c-torture/execute/ieee/fp-cmp-3.c execution,  -O1 
FAIL: gcc.c-torture/execute/ieee/fp-cmp-3.c execution,  -O2 
FAIL: gcc.c-torture/execute/ieee/fp-cmp-3.c execution,  -O3 -fomit-frame-pointer 
FAIL: gcc.c-torture/execute/ieee/fp-cmp-3.c execution,  -O3 -fomit-frame-pointer -funroll-loops 
FAIL: gcc.c-torture/execute/ieee/fp-cmp-3.c execution,  -O3 -fomit-frame-pointer -funroll-all-loops -finline-functions 
FAIL: gcc.c-torture/execute/ieee/fp-cmp-3.c execution,  -O3 -g 
FAIL: gcc.c-torture/execute/ieee/fp-cmp-3.c execution,  -Os 
FAIL: gcc.c-torture/execute/ieee/fp-cmp-4.c execution,  -O0 
FAIL: gcc.c-torture/execute/ieee/fp-cmp-4.c execution,  -O1 
FAIL: gcc.c-torture/execute/ieee/fp-cmp-4.c execution,  -O2 
FAIL: gcc.c-torture/execute/ieee/fp-cmp-4.c execution,  -O3 -fomit-frame-pointer 
FAIL: gcc.c-torture/execute/ieee/fp-cmp-4.c execution,  -O3 -fomit-frame-pointer -funroll-loops 
FAIL: gcc.c-torture/execute/ieee/fp-cmp-4.c execution,  -O3 -fomit-frame-pointer -funroll-all-loops -finline-functions 
FAIL: gcc.c-torture/execute/ieee/fp-cmp-4.c execution,  -O3 -g 
FAIL: gcc.c-torture/execute/ieee/fp-cmp-4.c execution,  -Os 
FAIL: gcc.c-torture/execute/ieee/fp-cmp-4f.c execution,  -O0 
FAIL: gcc.c-torture/execute/ieee/fp-cmp-4f.c execution,  -O1 
FAIL: gcc.c-torture/execute/ieee/fp-cmp-4f.c execution,  -O2 
FAIL: gcc.c-torture/execute/ieee/fp-cmp-4f.c execution,  -O3 -fomit-frame-pointer 
FAIL: gcc.c-torture/execute/ieee/fp-cmp-4f.c execution,  -O3 -g 
FAIL: gcc.c-torture/execute/ieee/fp-cmp-4f.c execution,  -Os 
FAIL: gcc.c-torture/execute/ieee/fp-cmp-4l.c execution,  -O0 
FAIL: gcc.c-torture/execute/ieee/fp-cmp-4l.c execution,  -O1 
FAIL: gcc.c-torture/execute/ieee/fp-cmp-4l.c execution,  -O2 
FAIL: gcc.c-torture/execute/ieee/fp-cmp-4l.c execution,  -O3 -fomit-frame-pointer 
FAIL: gcc.c-torture/execute/ieee/fp-cmp-4l.c execution,  -O3 -g 
FAIL: gcc.c-torture/execute/ieee/fp-cmp-4l.c execution,  -Os 
FAIL: gcc.c-torture/execute/ieee/fp-cmp-6.c execution,  -O0 
FAIL: gcc.c-torture/execute/ieee/hugeval.c execution,  -O0 
FAIL: gcc.c-torture/execute/ieee/hugeval.c execution,  -O1 
FAIL: gcc.c-torture/execute/ieee/hugeval.c execution,  -O2 
FAIL: gcc.c-torture/execute/ieee/hugeval.c execution,  -O3 -fomit-frame-pointer 
FAIL: gcc.c-torture/execute/ieee/hugeval.c execution,  -O3 -g 
FAIL: gcc.c-torture/execute/ieee/hugeval.c execution,  -Os 
FAIL: gcc.c-torture/execute/ieee/mzero2.c execution,  -O0 
FAIL: gcc.c-torture/execute/ieee/mzero2.c execution,  -O1 
FAIL: gcc.c-torture/execute/ieee/mzero2.c execution,  -O2 
FAIL: gcc.c-torture/execute/ieee/mzero2.c execution,  -O3 -fomit-frame-pointer 
FAIL: gcc.c-torture/execute/ieee/mzero2.c execution,  -O3 -g 
FAIL: gcc.c-torture/execute/ieee/mzero2.c execution,  -Os 
FAIL: gcc.c-torture/execute/ieee/mzero3.c execution,  -O0 
FAIL: gcc.c-torture/execute/ieee/mzero3.c execution,  -O1 
FAIL: gcc.c-torture/execute/ieee/mzero3.c execution,  -O2 
FAIL: gcc.c-torture/execute/ieee/mzero3.c execution,  -O3 -fomit-frame-pointer 
FAIL: gcc.c-torture/execute/ieee/mzero3.c execution,  -O3 -g 
FAIL: gcc.c-torture/execute/ieee/mzero3.c execution,  -Os 
FAIL: gcc.c-torture/execute/ieee/mzero4.c execution,  -O0 
FAIL: gcc.c-torture/execute/ieee/mzero4.c execution,  -O1 
FAIL: gcc.c-torture/execute/ieee/mzero4.c execution,  -O2 
FAIL: gcc.c-torture/execute/ieee/mzero4.c execution,  -O3 -fomit-frame-pointer 
FAIL: gcc.c-torture/execute/ieee/mzero4.c execution,  -O3 -g 
FAIL: gcc.c-torture/execute/ieee/mzero4.c execution,  -Os 
FAIL: gcc.c-torture/execute/ieee/unsafe-fp-assoc-1.c execution,  -O0 
FAIL: gcc.c-torture/execute/ieee/unsafe-fp-assoc-1.c execution,  -O1 
FAIL: gcc.c-torture/execute/ieee/unsafe-fp-assoc-1.c execution,  -O2 
FAIL: gcc.c-torture/execute/ieee/unsafe-fp-assoc-1.c execution,  -O3 -fomit-frame-pointer 
FAIL: gcc.c-torture/execute/ieee/unsafe-fp-assoc-1.c execution,  -O3 -g 
FAIL: gcc.c-torture/execute/ieee/unsafe-fp-assoc-1.c execution,  -Os 
FAIL: gcc.c-torture/unsorted/a3.c,  -O1   (internal compiler error)
FAIL: gcc.c-torture/unsorted/a3.c,  -O2   (internal compiler error)
FAIL: gcc.c-torture/unsorted/a3.c,  -O3 -fomit-frame-pointer   (internal compiler error)
FAIL: gcc.c-torture/unsorted/a3.c,  -O3 -fomit-frame-pointer -funroll-loops   (internal compiler error)
FAIL: gcc.c-torture/unsorted/a3.c,  -O3 -fomit-frame-pointer -funroll-all-loops -finline-functions   (internal compiler error)
FAIL: gcc.c-torture/unsorted/a3.c,  -O3 -g   (internal compiler error)
FAIL: gcc.c-torture/unsorted/a3.c,  -Os   (internal compiler error)
FAIL: gcc.dg/compat/scalar-by-value-1 c_compat_x_tst.o-c_compat_y_tst.o execute 
FAIL: gcc.dg/compat/scalar-by-value-3 c_compat_x_tst.o-c_compat_y_tst.o execute 
FAIL: gcc.dg/compat/sdata-1 c_compat_x_tst.o-c_compat_y_tst.o execute 
FAIL: gcc.dg/compat/struct-align-1 c_compat_x_tst.o-c_compat_y_tst.o execute 
FAIL: gcc.dg/compat/struct-by-value-10 c_compat_x_tst.o-c_compat_y_tst.o execute 
FAIL: gcc.dg/compat/struct-by-value-11 c_compat_x_tst.o-c_compat_y_tst.o execute 
FAIL: gcc.dg/compat/struct-by-value-12 c_compat_x_tst.o-c_compat_y_tst.o execute 
FAIL: gcc.dg/compat/struct-by-value-13 c_compat_x_tst.o-c_compat_y_tst.o execute 
FAIL: gcc.dg/compat/struct-by-value-14 c_compat_x_tst.o-c_compat_y_tst.o execute 
FAIL: gcc.dg/compat/struct-by-value-15 c_compat_x_tst.o-c_compat_y_tst.o execute 
FAIL: gcc.dg/compat/struct-by-value-16 c_compat_x_tst.o-c_compat_y_tst.o execute 
FAIL: gcc.dg/compat/struct-by-value-17 c_compat_x_tst.o-c_compat_y_tst.o execute 
FAIL: gcc.dg/compat/struct-by-value-18 c_compat_x_tst.o-c_compat_y_tst.o execute 
FAIL: gcc.dg/compat/struct-by-value-19 c_compat_x_tst.o-c_compat_y_tst.o execute 
FAIL: gcc.dg/compat/struct-by-value-1 c_compat_x_tst.o-c_compat_y_tst.o execute 
FAIL: gcc.dg/compat/struct-by-value-20 c_compat_x_tst.o-c_compat_y_tst.o execute 
FAIL: gcc.dg/compat/struct-by-value-21 c_compat_x_tst.o-c_compat_y_tst.o execute 
FAIL: gcc.dg/compat/struct-by-value-22 c_compat_x_tst.o-c_compat_y_tst.o execute 
FAIL: gcc.dg/compat/struct-by-value-2 c_compat_x_tst.o-c_compat_y_tst.o execute 
FAIL: gcc.dg/compat/struct-by-value-3 c_compat_x_tst.o-c_compat_y_tst.o execute 
FAIL: gcc.dg/compat/struct-by-value-4 c_compat_x_tst.o-c_compat_y_tst.o execute 
FAIL: gcc.dg/compat/struct-by-value-5a c_compat_x_tst.o-c_compat_y_tst.o execute 
FAIL: gcc.dg/compat/struct-by-value-5b c_compat_x_tst.o-c_compat_y_tst.o execute 
FAIL: gcc.dg/compat/struct-by-value-6a c_compat_x_tst.o-c_compat_y_tst.o execute 
FAIL: gcc.dg/compat/struct-by-value-6b c_compat_x_tst.o-c_compat_y_tst.o execute 
FAIL: gcc.dg/compat/struct-by-value-7a c_compat_x_tst.o-c_compat_y_tst.o execute 
FAIL: gcc.dg/compat/struct-by-value-7b c_compat_x_tst.o-c_compat_y_tst.o execute 
FAIL: gcc.dg/compat/struct-by-value-8 c_compat_x_tst.o-c_compat_y_tst.o execute 
FAIL: gcc.dg/compat/struct-by-value-9 c_compat_x_tst.o-c_compat_y_tst.o execute 
FAIL: gcc.dg/compat/struct-layout-1 c_compat_main_tst.o compile
FAIL: gcc.dg/compat/struct-layout-1 c_compat_x_tst.o compile
FAIL: gcc.dg/compat/struct-layout-1 c_compat_y_tst.o compile
UNRESOLVED: gcc.dg/compat/struct-layout-1 c_compat_x_tst.o-c_compat_y_tst.o link 
UNRESOLVED: gcc.dg/compat/struct-layout-1 c_compat_x_tst.o-c_compat_y_tst.o execute 
FAIL: gcc.dg/compat/struct-return-10 c_compat_x_tst.o-c_compat_y_tst.o execute 
FAIL: gcc.dg/compat/struct-return-19 c_compat_x_tst.o-c_compat_y_tst.o execute 
FAIL: gcc.dg/compat/struct-return-20 c_compat_x_tst.o-c_compat_y_tst.o execute 
FAIL: gcc.dg/compat/struct-return-21 c_compat_x_tst.o-c_compat_y_tst.o execute 
FAIL: gcc.dg/compat/struct-return-2 c_compat_x_tst.o-c_compat_y_tst.o execute 
FAIL: gcc.dg/compat/struct-return-3 c_compat_x_tst.o-c_compat_y_tst.o execute 
FAIL: gcc.dg/compat/union-by-value-1 c_compat_x_tst.o-c_compat_y_tst.o execute 
FAIL: gcc.dg/compat/union-return-1 c_compat_x_tst.o-c_compat_y_tst.o execute 
FAIL: gcc.dg/compat/vector-1 c_compat_x_tst.o compile
FAIL: gcc.dg/compat/vector-1 c_compat_y_tst.o compile
UNRESOLVED: gcc.dg/compat/vector-1 c_compat_x_tst.o-c_compat_y_tst.o link 
UNRESOLVED: gcc.dg/compat/vector-1 c_compat_x_tst.o-c_compat_y_tst.o execute 
FAIL: gcc.dg/compat/vector-2 c_compat_x_tst.o compile
FAIL: gcc.dg/compat/vector-2 c_compat_y_tst.o compile
UNRESOLVED: gcc.dg/compat/vector-2 c_compat_x_tst.o-c_compat_y_tst.o link 
UNRESOLVED: gcc.dg/compat/vector-2 c_compat_x_tst.o-c_compat_y_tst.o execute 
FAIL: tmpdir-gcc.dg-struct-layout-1/t001 c_compat_main_tst.o compile
FAIL: tmpdir-gcc.dg-struct-layout-1/t001 c_compat_x_tst.o compile
FAIL: tmpdir-gcc.dg-struct-layout-1/t001 c_compat_y_tst.o compile
UNRESOLVED: tmpdir-gcc.dg-struct-layout-1/t001 c_compat_x_tst.o-c_compat_y_tst.o link 
UNRESOLVED: tmpdir-gcc.dg-struct-layout-1/t001 c_compat_x_tst.o-c_compat_y_tst.o execute 
FAIL: tmpdir-gcc.dg-struct-layout-1/t002 c_compat_main_tst.o compile
FAIL: tmpdir-gcc.dg-struct-layout-1/t002 c_compat_x_tst.o compile
FAIL: tmpdir-gcc.dg-struct-layout-1/t002 c_compat_y_tst.o compile
UNRESOLVED: tmpdir-gcc.dg-struct-layout-1/t002 c_compat_x_tst.o-c_compat_y_tst.o link 
UNRESOLVED: tmpdir-gcc.dg-struct-layout-1/t002 c_compat_x_tst.o-c_compat_y_tst.o execute 
FAIL: tmpdir-gcc.dg-struct-layout-1/t003 c_compat_main_tst.o compile
FAIL: tmpdir-gcc.dg-struct-layout-1/t003 c_compat_x_tst.o compile
FAIL: tmpdir-gcc.dg-struct-layout-1/t003 c_compat_y_tst.o compile
UNRESOLVED: tmpdir-gcc.dg-struct-layout-1/t003 c_compat_x_tst.o-c_compat_y_tst.o link 
UNRESOLVED: tmpdir-gcc.dg-struct-layout-1/t003 c_compat_x_tst.o-c_compat_y_tst.o execute 
FAIL: tmpdir-gcc.dg-struct-layout-1/t004 c_compat_main_tst.o compile
FAIL: tmpdir-gcc.dg-struct-layout-1/t004 c_compat_x_tst.o compile
FAIL: tmpdir-gcc.dg-struct-layout-1/t004 c_compat_y_tst.o compile
UNRESOLVED: tmpdir-gcc.dg-struct-layout-1/t004 c_compat_x_tst.o-c_compat_y_tst.o link 
UNRESOLVED: tmpdir-gcc.dg-struct-layout-1/t004 c_compat_x_tst.o-c_compat_y_tst.o execute 
FAIL: tmpdir-gcc.dg-struct-layout-1/t005 c_compat_main_tst.o compile
FAIL: tmpdir-gcc.dg-struct-layout-1/t005 c_compat_x_tst.o compile
FAIL: tmpdir-gcc.dg-struct-layout-1/t005 c_compat_y_tst.o compile
UNRESOLVED: tmpdir-gcc.dg-struct-layout-1/t005 c_compat_x_tst.o-c_compat_y_tst.o link 
UNRESOLVED: tmpdir-gcc.dg-struct-layout-1/t005 c_compat_x_tst.o-c_compat_y_tst.o execute 
FAIL: tmpdir-gcc.dg-struct-layout-1/t006 c_compat_main_tst.o compile
FAIL: tmpdir-gcc.dg-struct-layout-1/t006 c_compat_x_tst.o compile
FAIL: tmpdir-gcc.dg-struct-layout-1/t006 c_compat_y_tst.o compile
UNRESOLVED: tmpdir-gcc.dg-struct-layout-1/t006 c_compat_x_tst.o-c_compat_y_tst.o link 
UNRESOLVED: tmpdir-gcc.dg-struct-layout-1/t006 c_compat_x_tst.o-c_compat_y_tst.o execute 
FAIL: tmpdir-gcc.dg-struct-layout-1/t007 c_compat_main_tst.o compile
FAIL: tmpdir-gcc.dg-struct-layout-1/t007 c_compat_x_tst.o compile
FAIL: tmpdir-gcc.dg-struct-layout-1/t007 c_compat_y_tst.o compile
UNRESOLVED: tmpdir-gcc.dg-struct-layout-1/t007 c_compat_x_tst.o-c_compat_y_tst.o link 
UNRESOLVED: tmpdir-gcc.dg-struct-layout-1/t007 c_compat_x_tst.o-c_compat_y_tst.o execute 
FAIL: tmpdir-gcc.dg-struct-layout-1/t008 c_compat_main_tst.o compile
FAIL: tmpdir-gcc.dg-struct-layout-1/t008 c_compat_x_tst.o compile
FAIL: tmpdir-gcc.dg-struct-layout-1/t008 c_compat_y_tst.o compile
UNRESOLVED: tmpdir-gcc.dg-struct-layout-1/t008 c_compat_x_tst.o-c_compat_y_tst.o link 
UNRESOLVED: tmpdir-gcc.dg-struct-layout-1/t008 c_compat_x_tst.o-c_compat_y_tst.o execute 
FAIL: tmpdir-gcc.dg-struct-layout-1/t009 c_compat_main_tst.o compile
FAIL: tmpdir-gcc.dg-struct-layout-1/t009 c_compat_x_tst.o compile
FAIL: tmpdir-gcc.dg-struct-layout-1/t009 c_compat_y_tst.o compile
UNRESOLVED: tmpdir-gcc.dg-struct-layout-1/t009 c_compat_x_tst.o-c_compat_y_tst.o link 
UNRESOLVED: tmpdir-gcc.dg-struct-layout-1/t009 c_compat_x_tst.o-c_compat_y_tst.o execute 
FAIL: tmpdir-gcc.dg-struct-layout-1/t010 c_compat_main_tst.o compile
FAIL: tmpdir-gcc.dg-struct-layout-1/t010 c_compat_x_tst.o compile
FAIL: tmpdir-gcc.dg-struct-layout-1/t010 c_compat_y_tst.o compile
UNRESOLVED: tmpdir-gcc.dg-struct-layout-1/t010 c_compat_x_tst.o-c_compat_y_tst.o link 
UNRESOLVED: tmpdir-gcc.dg-struct-layout-1/t010 c_compat_x_tst.o-c_compat_y_tst.o execute 
FAIL: tmpdir-gcc.dg-struct-layout-1/t011 c_compat_main_tst.o compile
FAIL: tmpdir-gcc.dg-struct-layout-1/t011 c_compat_x_tst.o compile
FAIL: tmpdir-gcc.dg-struct-layout-1/t011 c_compat_y_tst.o compile
UNRESOLVED: tmpdir-gcc.dg-struct-layout-1/t011 c_compat_x_tst.o-c_compat_y_tst.o link 
UNRESOLVED: tmpdir-gcc.dg-struct-layout-1/t011 c_compat_x_tst.o-c_compat_y_tst.o execute 
FAIL: tmpdir-gcc.dg-struct-layout-1/t012 c_compat_main_tst.o compile
FAIL: tmpdir-gcc.dg-struct-layout-1/t012 c_compat_x_tst.o compile
FAIL: tmpdir-gcc.dg-struct-layout-1/t012 c_compat_y_tst.o compile
UNRESOLVED: tmpdir-gcc.dg-struct-layout-1/t012 c_compat_x_tst.o-c_compat_y_tst.o link 
UNRESOLVED: tmpdir-gcc.dg-struct-layout-1/t012 c_compat_x_tst.o-c_compat_y_tst.o execute 
FAIL: tmpdir-gcc.dg-struct-layout-1/t013 c_compat_main_tst.o compile
FAIL: tmpdir-gcc.dg-struct-layout-1/t013 c_compat_x_tst.o compile
FAIL: tmpdir-gcc.dg-struct-layout-1/t013 c_compat_y_tst.o compile
UNRESOLVED: tmpdir-gcc.dg-struct-layout-1/t013 c_compat_x_tst.o-c_compat_y_tst.o link 
UNRESOLVED: tmpdir-gcc.dg-struct-layout-1/t013 c_compat_x_tst.o-c_compat_y_tst.o execute 
FAIL: tmpdir-gcc.dg-struct-layout-1/t014 c_compat_main_tst.o compile
FAIL: tmpdir-gcc.dg-struct-layout-1/t014 c_compat_x_tst.o compile
FAIL: tmpdir-gcc.dg-struct-layout-1/t014 c_compat_y_tst.o compile
UNRESOLVED: tmpdir-gcc.dg-struct-layout-1/t014 c_compat_x_tst.o-c_compat_y_tst.o link 
UNRESOLVED: tmpdir-gcc.dg-struct-layout-1/t014 c_compat_x_tst.o-c_compat_y_tst.o execute 
FAIL: tmpdir-gcc.dg-struct-layout-1/t015 c_compat_main_tst.o compile
FAIL: tmpdir-gcc.dg-struct-layout-1/t015 c_compat_x_tst.o compile
FAIL: tmpdir-gcc.dg-struct-layout-1/t015 c_compat_y_tst.o compile
UNRESOLVED: tmpdir-gcc.dg-struct-layout-1/t015 c_compat_x_tst.o-c_compat_y_tst.o link 
UNRESOLVED: tmpdir-gcc.dg-struct-layout-1/t015 c_compat_x_tst.o-c_compat_y_tst.o execute 
FAIL: tmpdir-gcc.dg-struct-layout-1/t016 c_compat_main_tst.o compile
FAIL: tmpdir-gcc.dg-struct-layout-1/t016 c_compat_x_tst.o compile
FAIL: tmpdir-gcc.dg-struct-layout-1/t016 c_compat_y_tst.o compile
UNRESOLVED: tmpdir-gcc.dg-struct-layout-1/t016 c_compat_x_tst.o-c_compat_y_tst.o link 
UNRESOLVED: tmpdir-gcc.dg-struct-layout-1/t016 c_compat_x_tst.o-c_compat_y_tst.o execute 
FAIL: tmpdir-gcc.dg-struct-layout-1/t017 c_compat_main_tst.o compile
FAIL: tmpdir-gcc.dg-struct-layout-1/t017 c_compat_x_tst.o compile
FAIL: tmpdir-gcc.dg-struct-layout-1/t017 c_compat_y_tst.o compile
UNRESOLVED: tmpdir-gcc.dg-struct-layout-1/t017 c_compat_x_tst.o-c_compat_y_tst.o link 
UNRESOLVED: tmpdir-gcc.dg-struct-layout-1/t017 c_compat_x_tst.o-c_compat_y_tst.o execute 
FAIL: tmpdir-gcc.dg-struct-layout-1/t018 c_compat_main_tst.o compile
FAIL: tmpdir-gcc.dg-struct-layout-1/t018 c_compat_x_tst.o compile
FAIL: tmpdir-gcc.dg-struct-layout-1/t018 c_compat_y_tst.o compile
UNRESOLVED: tmpdir-gcc.dg-struct-layout-1/t018 c_compat_x_tst.o-c_compat_y_tst.o link 
UNRESOLVED: tmpdir-gcc.dg-struct-layout-1/t018 c_compat_x_tst.o-c_compat_y_tst.o execute 
FAIL: tmpdir-gcc.dg-struct-layout-1/t019 c_compat_main_tst.o compile
FAIL: tmpdir-gcc.dg-struct-layout-1/t019 c_compat_x_tst.o compile
FAIL: tmpdir-gcc.dg-struct-layout-1/t019 c_compat_y_tst.o compile
UNRESOLVED: tmpdir-gcc.dg-struct-layout-1/t019 c_compat_x_tst.o-c_compat_y_tst.o link 
UNRESOLVED: tmpdir-gcc.dg-struct-layout-1/t019 c_compat_x_tst.o-c_compat_y_tst.o execute 
FAIL: tmpdir-gcc.dg-struct-layout-1/t020 c_compat_main_tst.o compile
FAIL: tmpdir-gcc.dg-struct-layout-1/t020 c_compat_x_tst.o compile
FAIL: tmpdir-gcc.dg-struct-layout-1/t020 c_compat_y_tst.o compile
UNRESOLVED: tmpdir-gcc.dg-struct-layout-1/t020 c_compat_x_tst.o-c_compat_y_tst.o link 
UNRESOLVED: tmpdir-gcc.dg-struct-layout-1/t020 c_compat_x_tst.o-c_compat_y_tst.o execute 
FAIL: tmpdir-gcc.dg-struct-layout-1/t021 c_compat_main_tst.o compile
FAIL: tmpdir-gcc.dg-struct-layout-1/t021 c_compat_x_tst.o compile
FAIL: tmpdir-gcc.dg-struct-layout-1/t021 c_compat_y_tst.o compile
UNRESOLVED: tmpdir-gcc.dg-struct-layout-1/t021 c_compat_x_tst.o-c_compat_y_tst.o link 
UNRESOLVED: tmpdir-gcc.dg-struct-layout-1/t021 c_compat_x_tst.o-c_compat_y_tst.o execute 
FAIL: tmpdir-gcc.dg-struct-layout-1/t022 c_compat_main_tst.o compile
FAIL: tmpdir-gcc.dg-struct-layout-1/t022 c_compat_x_tst.o compile
FAIL: tmpdir-gcc.dg-struct-layout-1/t022 c_compat_y_tst.o compile
UNRESOLVED: tmpdir-gcc.dg-struct-layout-1/t022 c_compat_x_tst.o-c_compat_y_tst.o link 
UNRESOLVED: tmpdir-gcc.dg-struct-layout-1/t022 c_compat_x_tst.o-c_compat_y_tst.o execute 
FAIL: tmpdir-gcc.dg-struct-layout-1/t023 c_compat_main_tst.o compile
FAIL: tmpdir-gcc.dg-struct-layout-1/t023 c_compat_x_tst.o compile
FAIL: tmpdir-gcc.dg-struct-layout-1/t023 c_compat_y_tst.o compile
UNRESOLVED: tmpdir-gcc.dg-struct-layout-1/t023 c_compat_x_tst.o-c_compat_y_tst.o link 
UNRESOLVED: tmpdir-gcc.dg-struct-layout-1/t023 c_compat_x_tst.o-c_compat_y_tst.o execute 
FAIL: tmpdir-gcc.dg-struct-layout-1/t024 c_compat_main_tst.o compile
FAIL: tmpdir-gcc.dg-struct-layout-1/t024 c_compat_x_tst.o compile
FAIL: tmpdir-gcc.dg-struct-layout-1/t024 c_compat_y_tst.o compile
UNRESOLVED: tmpdir-gcc.dg-struct-layout-1/t024 c_compat_x_tst.o-c_compat_y_tst.o link 
UNRESOLVED: tmpdir-gcc.dg-struct-layout-1/t024 c_compat_x_tst.o-c_compat_y_tst.o execute 
FAIL: tmpdir-gcc.dg-struct-layout-1/t025 c_compat_main_tst.o compile
FAIL: tmpdir-gcc.dg-struct-layout-1/t025 c_compat_x_tst.o compile
FAIL: tmpdir-gcc.dg-struct-layout-1/t025 c_compat_y_tst.o compile
UNRESOLVED: tmpdir-gcc.dg-struct-layout-1/t025 c_compat_x_tst.o-c_compat_y_tst.o link 
UNRESOLVED: tmpdir-gcc.dg-struct-layout-1/t025 c_compat_x_tst.o-c_compat_y_tst.o execute 
FAIL: tmpdir-gcc.dg-struct-layout-1/t026 c_compat_main_tst.o compile
FAIL: tmpdir-gcc.dg-struct-layout-1/t026 c_compat_x_tst.o compile
FAIL: tmpdir-gcc.dg-struct-layout-1/t026 c_compat_y_tst.o compile
UNRESOLVED: tmpdir-gcc.dg-struct-layout-1/t026 c_compat_x_tst.o-c_compat_y_tst.o link 
UNRESOLVED: tmpdir-gcc.dg-struct-layout-1/t026 c_compat_x_tst.o-c_compat_y_tst.o execute 
FAIL: tmpdir-gcc.dg-struct-layout-1/t027 c_compat_main_tst.o compile
FAIL: tmpdir-gcc.dg-struct-layout-1/t027 c_compat_x_tst.o compile
FAIL: tmpdir-gcc.dg-struct-layout-1/t027 c_compat_y_tst.o compile
UNRESOLVED: tmpdir-gcc.dg-struct-layout-1/t027 c_compat_x_tst.o-c_compat_y_tst.o link 
UNRESOLVED: tmpdir-gcc.dg-struct-layout-1/t027 c_compat_x_tst.o-c_compat_y_tst.o execute 
FAIL: tmpdir-gcc.dg-struct-layout-1/t028 c_compat_main_tst.o compile
FAIL: tmpdir-gcc.dg-struct-layout-1/t028 c_compat_x_tst.o compile
FAIL: tmpdir-gcc.dg-struct-layout-1/t028 c_compat_y_tst.o compile
UNRESOLVED: tmpdir-gcc.dg-struct-layout-1/t028 c_compat_x_tst.o-c_compat_y_tst.o link 
UNRESOLVED: tmpdir-gcc.dg-struct-layout-1/t028 c_compat_x_tst.o-c_compat_y_tst.o execute 
FAIL: gcc.dg/cpp/19990407-1.c execution test
FAIL: gcc.dg/cpp/assert4.c (test for excess errors)
FAIL: gcc.dg/cpp/lexstrng.c execution test
FAIL: gcc.dg/cpp/paste9.c execution test
FAIL: gcc.dg/cpp/vararg1.c execution test
FAIL: gcc.dg/cpp/trad/macroargs.c execution test
FAIL: gcc.dg/20000906-1.c execution test
FAIL: gcc.dg/20010912-1.c execution test
FAIL: gcc.dg/20020206-1.c execution test
FAIL: gcc.dg/20020426-2.c execution test
FAIL: gcc.dg/20020525-1.c execution test
FAIL: gcc.dg/20020607-1.c execution test
FAIL: gcc.dg/20030826-2.c execution test
FAIL: gcc.dg/20031202-1.c execution test
FAIL: gcc.dg/20040625-1.c execution test
FAIL: gcc.dg/20050321-1.c (test for excess errors)
FAIL: gcc.dg/20050321-2.c (test for excess errors)
FAIL: gcc.dg/20050603-2.c execution test
FAIL: gcc.dg/20050922-1.c execution test
FAIL: gcc.dg/asm-1.c casts make rvalues (test for errors, line 10)
FAIL: gcc.dg/attr-weakref-1.c execution test
FAIL: gcc.dg/bitfld-9.c execution test
FAIL: gcc.dg/builtin-apply2.c execution test
FAIL: gcc.dg/builtin-apply3.c execution test
FAIL: gcc.dg/builtin-apply4.c execution test
FAIL: gcc.dg/builtin-object-size-1.c execution test
FAIL: gcc.dg/builtin-object-size-2.c execution test
FAIL: gcc.dg/builtin-object-size-3.c execution test
FAIL: gcc.dg/builtin-object-size-4.c execution test
FAIL: gcc.dg/builtin-return-1.c execution test
FAIL: gcc.dg/c90-digraph-1.c execution test
FAIL: gcc.dg/c90-hexfloat-2.c execution test
FAIL: gcc.dg/c90-scope-1.c execution test
FAIL: gcc.dg/c94-digraph-1.c execution test
FAIL: gcc.dg/c99-bool-1.c execution test
FAIL: gcc.dg/c99-complit-1.c execution test
FAIL: gcc.dg/c99-digraph-1.c execution test
FAIL: gcc.dg/c99-hexfloat-2.c execution test
FAIL: gcc.dg/c99-init-1.c execution test
FAIL: gcc.dg/c99-scope-1.c execution test
FAIL: gcc.dg/cleanup-5.c execution test
FAIL: gcc.dg/duff-2.c execution test
FAIL: gcc.dg/duff-4.c execution test
FAIL: gcc.dg/fastmath-1.c execution test
FAIL: gcc.dg/fold-mod-1.c scan-tree-dump a % (4294967288|0fffffff8)
FAIL: gcc.dg/fold-overflow-1.c scan-assembler-times 2139095040 2
FAIL: gcc.dg/ftrapv-1.c (test for excess errors)
WARNING: gcc.dg/ftrapv-1.c compilation failed to produce executable
FAIL: gcc.dg/ftrapv-2.c (test for excess errors)
WARNING: gcc.dg/ftrapv-2.c compilation failed to produce executable
FAIL: gcc.dg/gnu99-init-1.c execution test
FAIL: gcc.dg/init-string-2.c (test for excess errors)
FAIL: gcc.dg/large-size-array-2.c (internal compiler error)
FAIL: gcc.dg/large-size-array-2.c (test for excess errors)
FAIL: gcc.dg/max-1.c (test for excess errors)
FAIL: gcc.dg/pr14796-2.c (test for excess errors)
FAIL: gcc.dg/pr14796-2.c scan-tree-dump-times = 0 2
FAIL: gcc.dg/pr14796-2.c scan-tree-dump b >> 31
FAIL: gcc.dg/pr17112-1.c (test for excess errors)
WARNING: gcc.dg/pr17112-1.c compilation failed to produce executable
FAIL: gcc.dg/pr18241-1.c (test for excess errors)
FAIL: gcc.dg/pr18241-2.c (test for excess errors)
FAIL: gcc.dg/pr18963-1.c execution test
FAIL: gcc.dg/pr19340.c (test for excess errors)
FAIL: gcc.dg/pr19633-1.c execution test
FAIL: gcc.dg/pr23049.c (test for excess errors)
FAIL: gcc.dg/pr27363.c execution test
FAIL: gcc.dg/pr27639.c (test for excess errors)
FAIL: gcc.dg/pr27959.c (test for excess errors)
FAIL: gcc.dg/pr27959.c execution test
FAIL: gcc.dg/pr29683.c execution test
FAIL: gcc.dg/pr30286.c execution test
FAIL: gcc.dg/struct-by-value-1.c execution test
FAIL: gcc.dg/struct-ret-libc.c execution test
FAIL: gcc.dg/switch-warn-1.c execution test
FAIL: gcc.dg/switch-warn-2.c execution test
FAIL: gcc.dg/wtr-conversion-1.c (test for excess errors)
FAIL: gcc.dg/format/bitfld-1.c   (test for excess errors)
FAIL: gcc.dg/format/bitfld-1.c  -DWIDE  (test for excess errors)
FAIL: gcc.dg/noncompile/920923-1.c  -O0  int smaller than 32 bits (test for bogus messages, line 118)
FAIL: gcc.dg/noncompile/920923-1.c  -O1  int smaller than 32 bits (test for bogus messages, line 118)
FAIL: gcc.dg/noncompile/920923-1.c  -O2  int smaller than 32 bits (test for bogus messages, line 118)
FAIL: gcc.dg/noncompile/920923-1.c  -O3 -fomit-frame-pointer  int smaller than 32 bits (test for bogus messages, line 118)
FAIL: gcc.dg/noncompile/920923-1.c  -O3 -fomit-frame-pointer -funroll-loops  int smaller than 32 bits (test for bogus messages, line 118)
FAIL: gcc.dg/noncompile/920923-1.c  -O3 -fomit-frame-pointer -funroll-all-loops -finline-functions  int smaller than 32 bits (test for bogus messages, line 118)
FAIL: gcc.dg/noncompile/920923-1.c  -O3 -g  int smaller than 32 bits (test for bogus messages, line 118)
FAIL: gcc.dg/noncompile/920923-1.c  -Os  int smaller than 32 bits (test for bogus messages, line 118)
FAIL: gcc.dg/pch/struct-1.c -O0 -g (test for excess errors)
FAIL: gcc.dg/pch/struct-1.c -O0 -g (test for excess errors)
FAIL: gcc.dg/pch/struct-1.c  -O0  (test for excess errors)
FAIL: gcc.dg/pch/struct-1.c  -O0  (test for excess errors)
FAIL: gcc.dg/pch/struct-1.c  -O1  (test for excess errors)
FAIL: gcc.dg/pch/struct-1.c  -O1  (test for excess errors)
FAIL: gcc.dg/pch/struct-1.c  -O2  (test for excess errors)
FAIL: gcc.dg/pch/struct-1.c  -O2  (test for excess errors)
FAIL: gcc.dg/pch/struct-1.c  -O3 -fomit-frame-pointer  (test for excess errors)
FAIL: gcc.dg/pch/struct-1.c  -O3 -fomit-frame-pointer  (test for excess errors)
FAIL: gcc.dg/pch/struct-1.c  -O3 -g  (test for excess errors)
FAIL: gcc.dg/pch/struct-1.c  -O3 -g  (test for excess errors)
FAIL: gcc.dg/pch/struct-1.c  -Os  (test for excess errors)
FAIL: gcc.dg/pch/struct-1.c  -Os  (test for excess errors)
FAIL: gcc.dg/special/gcsec-1.c execution test
FAIL: gcc.dg/special/weak-1.c execution test
FAIL: gcc.dg/special/weak-2.c execution test
FAIL: gcc.dg/special/wkali-2.c execution test
FAIL: gcc.dg/torture/pr26587.c  -O0  (test for excess errors)
FAIL: gcc.dg/torture/pr26587.c  -O0  execution test
FAIL: gcc.dg/torture/pr26587.c  -O1  (test for excess errors)
FAIL: gcc.dg/torture/pr26587.c  -O1  execution test
FAIL: gcc.dg/torture/pr26587.c  -O2  (test for excess errors)
FAIL: gcc.dg/torture/pr26587.c  -O2  execution test
FAIL: gcc.dg/torture/pr26587.c  -O3 -fomit-frame-pointer  (test for excess errors)
FAIL: gcc.dg/torture/pr26587.c  -O3 -fomit-frame-pointer  execution test
FAIL: gcc.dg/torture/pr26587.c  -O3 -fomit-frame-pointer -funroll-loops  (test for excess errors)
FAIL: gcc.dg/torture/pr26587.c  -O3 -fomit-frame-pointer -funroll-loops  execution test
FAIL: gcc.dg/torture/pr26587.c  -O3 -fomit-frame-pointer -funroll-all-loops -finline-functions  (test for excess errors)
FAIL: gcc.dg/torture/pr26587.c  -O3 -fomit-frame-pointer -funroll-all-loops -finline-functions  execution test
FAIL: gcc.dg/torture/pr26587.c  -O3 -g  (test for excess errors)
FAIL: gcc.dg/torture/pr26587.c  -O3 -g  execution test
FAIL: gcc.dg/torture/pr26587.c  -Os  (test for excess errors)
FAIL: gcc.dg/torture/pr26587.c  -Os  execution test
FAIL: gcc.dg/torture/pr26630.c  -O0  (test for excess errors)
FAIL: gcc.dg/torture/pr26630.c  -O0  execution test
FAIL: gcc.dg/torture/pr26630.c  -O1  (test for excess errors)
FAIL: gcc.dg/torture/pr26630.c  -O1  execution test
FAIL: gcc.dg/torture/pr26630.c  -O2  (test for excess errors)
FAIL: gcc.dg/torture/pr26630.c  -O2  execution test
FAIL: gcc.dg/torture/pr26630.c  -O3 -fomit-frame-pointer  (test for excess errors)
FAIL: gcc.dg/torture/pr26630.c  -O3 -fomit-frame-pointer  execution test
FAIL: gcc.dg/torture/pr26630.c  -O3 -g  (test for excess errors)
FAIL: gcc.dg/torture/pr26630.c  -O3 -g  execution test
FAIL: gcc.dg/torture/pr26630.c  -Os  (test for excess errors)
FAIL: gcc.dg/torture/pr26630.c  -Os  execution test
FAIL: gcc.dg/torture/pr27603.c  -O0  execution test
FAIL: gcc.dg/torture/pr27603.c  -O1  execution test
FAIL: gcc.dg/torture/pr27603.c  -O3 -fomit-frame-pointer -funroll-loops  execution test
FAIL: gcc.dg/torture/pr27603.c  -O3 -fomit-frame-pointer -funroll-all-loops -finline-functions  execution test
FAIL: gcc.dg/torture/pr27743.c  -O0  (test for excess errors)
FAIL: gcc.dg/torture/pr27743.c  -O0  execution test
FAIL: gcc.dg/torture/pr27743.c  -O1  (test for excess errors)
FAIL: gcc.dg/torture/pr27743.c  -O1  execution test
FAIL: gcc.dg/torture/pr27743.c  -O2  (test for excess errors)
FAIL: gcc.dg/torture/pr27743.c  -O2  execution test
FAIL: gcc.dg/torture/pr27743.c  -O3 -fomit-frame-pointer  (test for excess errors)
FAIL: gcc.dg/torture/pr27743.c  -O3 -fomit-frame-pointer  execution test
FAIL: gcc.dg/torture/pr27743.c  -O3 -g  (test for excess errors)
FAIL: gcc.dg/torture/pr27743.c  -O3 -g  execution test
FAIL: gcc.dg/torture/pr27743.c  -Os  (test for excess errors)
FAIL: gcc.dg/torture/pr27743.c  -Os  execution test
FAIL: gcc.dg/torture/pr28814.c  -O0  (test for excess errors)
FAIL: gcc.dg/torture/pr28814.c  -O1  (test for excess errors)
FAIL: gcc.dg/torture/pr28814.c  -O2  (test for excess errors)
FAIL: gcc.dg/torture/pr28814.c  -O3 -fomit-frame-pointer  (test for excess errors)
FAIL: gcc.dg/torture/pr28814.c  -O3 -g  (test for excess errors)
FAIL: gcc.dg/torture/pr28814.c  -Os  (test for excess errors)
FAIL: gcc.dg/torture/pr29584.c  -O0  (test for excess errors)
FAIL: gcc.dg/torture/pr29584.c  -O1  (test for excess errors)
FAIL: gcc.dg/torture/pr29584.c  -O2  (test for excess errors)
FAIL: gcc.dg/torture/pr29584.c  -O3 -fomit-frame-pointer  (test for excess errors)
FAIL: gcc.dg/torture/pr29584.c  -O3 -fomit-frame-pointer -funroll-loops  (test for excess errors)
FAIL: gcc.dg/torture/pr29584.c  -O3 -fomit-frame-pointer -funroll-all-loops -finline-functions  (test for excess errors)
FAIL: gcc.dg/torture/pr29584.c  -O3 -g  (test for excess errors)
FAIL: gcc.dg/torture/pr29584.c  -Os  (test for excess errors)
FAIL: gcc.dg/torture/pr30313.c  -O0  (test for excess errors)
FAIL: gcc.dg/torture/pr30313.c  -O1  (test for excess errors)
FAIL: gcc.dg/torture/pr30313.c  -O2  (test for excess errors)
FAIL: gcc.dg/torture/pr30313.c  -O3 -fomit-frame-pointer  (test for excess errors)
FAIL: gcc.dg/torture/pr30313.c  -O3 -g  (test for excess errors)
FAIL: gcc.dg/torture/pr30313.c  -Os  (test for excess errors)
FAIL: gcc.dg/torture/pr30364-1.c  -O0  (test for excess errors)
FAIL: gcc.dg/torture/pr30364-1.c  -O0  execution test
FAIL: gcc.dg/torture/pr30364-1.c  -O1  (test for excess errors)
FAIL: gcc.dg/torture/pr30364-1.c  -O1  execution test
FAIL: gcc.dg/torture/pr30364-1.c  -O2  (test for excess errors)
FAIL: gcc.dg/torture/pr30364-1.c  -O2  execution test
FAIL: gcc.dg/torture/pr30364-1.c  -O3 -fomit-frame-pointer  (test for excess errors)
FAIL: gcc.dg/torture/pr30364-1.c  -O3 -fomit-frame-pointer  execution test
FAIL: gcc.dg/torture/pr30364-1.c  -O3 -g  (test for excess errors)
FAIL: gcc.dg/torture/pr30364-1.c  -O3 -g  execution test
FAIL: gcc.dg/torture/pr30364-1.c  -Os  (test for excess errors)
FAIL: gcc.dg/torture/pr30364-1.c  -Os  execution test
FAIL: gcc.dg/torture/pr30364-2.c  -O0  (test for excess errors)
FAIL: gcc.dg/torture/pr30364-2.c  -O0  execution test
FAIL: gcc.dg/torture/pr30364-2.c  -O1  (test for excess errors)
FAIL: gcc.dg/torture/pr30364-2.c  -O1  execution test
FAIL: gcc.dg/torture/pr30364-2.c  -O2  (test for excess errors)
FAIL: gcc.dg/torture/pr30364-2.c  -O2  execution test
FAIL: gcc.dg/torture/pr30364-2.c  -O3 -fomit-frame-pointer  (test for excess errors)
FAIL: gcc.dg/torture/pr30364-2.c  -O3 -fomit-frame-pointer  execution test
FAIL: gcc.dg/torture/pr30364-2.c  -O3 -g  (test for excess errors)
FAIL: gcc.dg/torture/pr30364-2.c  -O3 -g  execution test
FAIL: gcc.dg/torture/pr30364-2.c  -Os  (test for excess errors)
FAIL: gcc.dg/torture/pr30364-2.c  -Os  execution test
FAIL: gcc.dg/torture/pr30364-3.c  -O0  (test for excess errors)
FAIL: gcc.dg/torture/pr30364-3.c  -O0  execution test
FAIL: gcc.dg/torture/pr30364-3.c  -O1  (test for excess errors)
FAIL: gcc.dg/torture/pr30364-3.c  -O1  execution test
FAIL: gcc.dg/torture/pr30364-3.c  -O2  (test for excess errors)
FAIL: gcc.dg/torture/pr30364-3.c  -O2  execution test
FAIL: gcc.dg/torture/pr30364-3.c  -O3 -fomit-frame-pointer  (test for excess errors)
FAIL: gcc.dg/torture/pr30364-3.c  -O3 -fomit-frame-pointer  execution test
FAIL: gcc.dg/torture/pr30364-3.c  -O3 -g  (test for excess errors)
FAIL: gcc.dg/torture/pr30364-3.c  -O3 -g  execution test
FAIL: gcc.dg/torture/pr30364-3.c  -Os  (test for excess errors)
FAIL: gcc.dg/torture/pr30364-3.c  -Os  execution test
XPASS: gcc.dg/tree-ssa/20040204-1.c scan-tree-dump-times link_error 0
FAIL: gcc.dg/tree-ssa/foldaddr-1.c (test for excess errors)
FAIL: gcc.dg/tree-ssa/gen-vect-11.c execution test
FAIL: gcc.dg/tree-ssa/gen-vect-11.c scan-tree-dump-times vectorized 1 loops 1
FAIL: gcc.dg/tree-ssa/gen-vect-11a.c execution test
FAIL: gcc.dg/tree-ssa/gen-vect-11a.c scan-tree-dump-times vectorized 1 loops 1
FAIL: gcc.dg/tree-ssa/gen-vect-11b.c execution test
FAIL: gcc.dg/tree-ssa/gen-vect-11c.c execution test
FAIL: gcc.dg/tree-ssa/gen-vect-2.c execution test
FAIL: gcc.dg/tree-ssa/gen-vect-2.c scan-tree-dump-times vectorized 1 loops 1
FAIL: gcc.dg/tree-ssa/gen-vect-25.c scan-tree-dump-times vectorized 2 loops 1
FAIL: gcc.dg/tree-ssa/ifc-20040816-2.c (test for excess errors)
FAIL: gcc.dg/tree-ssa/ifc-20040816-2.c scan-tree-dump-times Applying if-conversion 1
FAIL: gcc.dg/tree-ssa/loop-10.c (test for excess errors)
FAIL: gcc.dg/tree-ssa/loop-10.c scan-tree-dump-times if  3
FAIL: gcc.dg/tree-ssa/loop-10.c scan-tree-dump-times bar  2
FAIL: gcc.dg/tree-ssa/loop-2.c (test for excess errors)
ERROR: gcc.dg/tree-ssa/loop-2.c: error executing dg-final: no files matched glob pattern "loop-2.c.t[0-9][0-9].vars"
UNRESOLVED: gcc.dg/tree-ssa/loop-2.c: error executing dg-final: no files matched glob pattern "loop-2.c.t[0-9][0-9].vars"
FAIL: gcc.dg/tree-ssa/loop-4.c (test for excess errors)
ERROR: gcc.dg/tree-ssa/loop-4.c: error executing dg-final: no files matched glob pattern "loop-4.c.t[0-9][0-9].vars"
UNRESOLVED: gcc.dg/tree-ssa/loop-4.c: error executing dg-final: no files matched glob pattern "loop-4.c.t[0-9][0-9].vars"
FAIL: gcc.dg/tree-ssa/ltrans-1.c (test for excess errors)
ERROR: gcc.dg/tree-ssa/ltrans-1.c: error executing dg-final: no files matched glob pattern "ltrans-1.c.t[0-9][0-9].ltrans"
UNRESOLVED: gcc.dg/tree-ssa/ltrans-1.c: error executing dg-final: no files matched glob pattern "ltrans-1.c.t[0-9][0-9].ltrans"
FAIL: gcc.dg/tree-ssa/ltrans-2.c (test for excess errors)
FAIL: gcc.dg/tree-ssa/ltrans-3.c (test for excess errors)
ERROR: gcc.dg/tree-ssa/ltrans-3.c: error executing dg-final: no files matched glob pattern "ltrans-3.c.t[0-9][0-9].ltrans"
UNRESOLVED: gcc.dg/tree-ssa/ltrans-3.c: error executing dg-final: no files matched glob pattern "ltrans-3.c.t[0-9][0-9].ltrans"
FAIL: gcc.dg/tree-ssa/ltrans-4.c (test for excess errors)
ERROR: gcc.dg/tree-ssa/ltrans-4.c: error executing dg-final: no files matched glob pattern "ltrans-4.c.t[0-9][0-9].ltrans"
UNRESOLVED: gcc.dg/tree-ssa/ltrans-4.c: error executing dg-final: no files matched glob pattern "ltrans-4.c.t[0-9][0-9].ltrans"
FAIL: gcc.dg/tree-ssa/pr14341.c (test for excess errors)
FAIL: gcc.dg/tree-ssa/pr23382.c (test for excess errors)
FAIL: gcc.dg/tree-ssa/pr24627.c (test for excess errors)
FAIL: gcc.dg/tree-ssa/pr26180.c (test for excess errors)
FAIL: gcc.dg/tree-ssa/tailrecursion-5.c execution test
FAIL: gcc.dg/tree-ssa/vrp14.c (test for excess errors)
WARNING: gcc.dg/tree-ssa/vrp14.c compilation failed to produce executable
FAIL: gcc.dg/tree-ssa/vrp21.c (test for excess errors)
FAIL: gcc.dg/weak/weak-14.c execution test

		=== gcc Summary ===

# of expected passes		34365
# of unexpected failures	2485
# of unexpected successes	1
# of expected failures		77
# of unresolved testcases	110
# of untested testcases		28
# of unsupported tests		1140
/mnt/disk01-2/mstein/sim/h8300-elf/build/gcc/xgcc  version 4.1.3 20070510 (prerelease)


Compiler version: 4.1.3 20070510 (prerelease) gcc 
Platform: h8300-unknown-elf
configure flags: --target=h8300-elf --prefix=/n/07/mstein/cross-local/h8300-elf --disable-nls --disable-build-warnings --with-ld=/n/07/mstein/cross-local/h8300-elf/bin/h8300-elf-ld --with-as=/n/07/mstein/cross-local/h8300-elf/bin/h8300-elf-as --disable-libssp --enable-languages=c


Index Nav: [Date Index] [Subject Index] [Author Index] [Thread Index]
Message Nav: [Date Prev] [Date Next] [Thread Prev] [Thread Next]