This is the mail archive of the gcc-testresults@gcc.gnu.org mailing list for the GCC project.


Index Nav: [Date Index] [Subject Index] [Author Index] [Thread Index]
Message Nav: [Date Prev] [Date Next] [Thread Prev] [Thread Next]
Other format: [Raw text]

Results for 4.1.1 testsuite on powerpc-ibm-aix5.2.0.0


LAST_UPDATED: Thu May 25 13:25:16 UTC 2006 (revision 114106M)

Native configuration is powerpc-ibm-aix5.2.0.0

		=== g++ tests ===


Running target unix
FAIL: tmpdir-g++.dg-struct-layout-1/t004 cp_compat_x_tst.o-cp_compat_y_tst.o execute 
FAIL: tmpdir-g++.dg-struct-layout-1/t007 cp_compat_x_tst.o-cp_compat_y_tst.o execute 
FAIL: tmpdir-g++.dg-struct-layout-1/t012 cp_compat_x_tst.o-cp_compat_y_tst.o execute 
FAIL: tmpdir-g++.dg-struct-layout-1/t014 cp_compat_x_tst.o-cp_compat_y_tst.o execute 
FAIL: tmpdir-g++.dg-struct-layout-1/t020 cp_compat_x_tst.o-cp_compat_y_tst.o execute 
FAIL: tmpdir-g++.dg-struct-layout-1/t022 cp_compat_x_tst.o-cp_compat_y_tst.o execute 
FAIL: tmpdir-g++.dg-struct-layout-1/t024 cp_compat_x_tst.o-cp_compat_y_tst.o execute 
FAIL: tmpdir-g++.dg-struct-layout-1/t025 cp_compat_x_tst.o-cp_compat_y_tst.o execute 
FAIL: tmpdir-g++.dg-struct-layout-1/t026 cp_compat_x_tst.o-cp_compat_y_tst.o execute 
FAIL: tmpdir-g++.dg-struct-layout-1/t027 cp_compat_x_tst.o-cp_compat_y_tst.o execute 
FAIL: tmpdir-g++.dg-struct-layout-1/t028 cp_compat_x_tst.o-cp_compat_y_tst.o execute 
FAIL: tmpdir-g++.dg-struct-layout-1/t029 cp_compat_x_tst.o-cp_compat_y_tst.o execute 
FAIL: tmpdir-g++.dg-struct-layout-1/t030 cp_compat_x_tst.o-cp_compat_y_tst.o execute 
FAIL: g++.dg/abi/local1.C execution test
FAIL: g++.dg/conversion/simd1.C (test for excess errors)
WARNING: g++.dg/ext/altivec-3.C compilation failed to produce executable
ERROR: g++.dg/ext/altivec-7.C: error executing dg-final: couldn't open "altivec-7.s": no such file or directory
UNRESOLVED: g++.dg/ext/altivec-7.C: error executing dg-final: couldn't open "altivec-7.s": no such file or directory
FAIL: g++.dg/ext/attribute-test-1.C (test for excess errors)
FAIL: g++.dg/ext/attribute-test-2.C (test for excess errors)
FAIL: g++.dg/ext/attribute-test-3.C (test for excess errors)
FAIL: g++.dg/ext/attribute-test-4.C (test for excess errors)
UNRESOLVED: g++.dg/ext/weak1.C
UNRESOLVED: g++.dg/ext/weak2.C
UNRESOLVED: g++.dg/ext/weak3.C
UNRESOLVED: g++.dg/init/dso_handle1.C
UNRESOLVED: g++.dg/init/init-ref4.C
FAIL: g++.dg/opt/pr15551.C (test for excess errors)
WARNING: g++.dg/opt/pr15551.C compilation failed to produce executable
WARNING: g++.dg/other/ucnid-1.C compilation failed to produce executable
FAIL: g++.dg/template/repo3.C (test for excess errors)
FAIL: g++.dg/template/repo4.C (test for excess errors)
XPASS: g++.dg/tree-ssa/pr14814.C scan-tree-dump-times &this 0
UNRESOLVED: g++.dg/warn/weak1.C
UNRESOLVED: g++.old-deja/g++.ext/attrib5.C
FAIL: g++.old-deja/g++.pt/const2.C  (test for errors, line )
FAIL: g++.old-deja/g++.pt/instantiate4.C (test for excess errors)
FAIL: g++.old-deja/g++.pt/instantiate6.C (test for excess errors)
FAIL: g++.old-deja/g++.pt/repo1.C (test for excess errors)
FAIL: g++.old-deja/g++.pt/repo2.C (test for excess errors)
FAIL: g++.old-deja/g++.pt/repo4.C (test for excess errors)
UNRESOLVED: g++.old-deja/g++.pt/static3.C

		=== g++ Summary ===

# of expected passes		11595
# of unexpected failures	28
# of unexpected successes	1
# of expected failures		85
# of unresolved testcases	9
# of unsupported tests		143
/opt/build/eric/gcc-4_1-branch/gcc/testsuite/g++/../../g++  version 4.1.1

		=== gcc tests ===


Running target unix
UNRESOLVED: gcc.c-torture/compile/20011119-1.c  -O0 
UNRESOLVED: gcc.c-torture/compile/20011119-1.c  -O1 
UNRESOLVED: gcc.c-torture/compile/20011119-1.c  -O2 
UNRESOLVED: gcc.c-torture/compile/20011119-1.c  -O3 -fomit-frame-pointer 
UNRESOLVED: gcc.c-torture/compile/20011119-1.c  -O3 -g 
UNRESOLVED: gcc.c-torture/compile/20011119-1.c  -Os 
UNRESOLVED: gcc.c-torture/compile/20011119-2.c  -O0 
UNRESOLVED: gcc.c-torture/compile/20011119-2.c  -O1 
UNRESOLVED: gcc.c-torture/compile/20011119-2.c  -O2 
UNRESOLVED: gcc.c-torture/compile/20011119-2.c  -O3 -fomit-frame-pointer 
UNRESOLVED: gcc.c-torture/compile/20011119-2.c  -O3 -g 
UNRESOLVED: gcc.c-torture/compile/20011119-2.c  -Os 
UNRESOLVED: gcc.c-torture/compile/981001-2.c  -O0 
UNRESOLVED: gcc.c-torture/compile/981001-2.c  -O1 
UNRESOLVED: gcc.c-torture/compile/981001-2.c  -O2 
UNRESOLVED: gcc.c-torture/compile/981001-2.c  -O3 -fomit-frame-pointer 
UNRESOLVED: gcc.c-torture/compile/981001-2.c  -O3 -g 
UNRESOLVED: gcc.c-torture/compile/981001-2.c  -Os 
FAIL: tmpdir-gcc.dg-struct-layout-1/t025 c_compat_x_tst.o-c_compat_y_tst.o execute 
FAIL: tmpdir-gcc.dg-struct-layout-1/t027 c_compat_x_tst.o-c_compat_y_tst.o execute 
FAIL: tmpdir-gcc.dg-struct-layout-1/t028 c_compat_x_tst.o-c_compat_y_tst.o execute 
FAIL: gcc.dg/asm-names.c scan-assembler-not ____frob14
UNRESOLVED: gcc.dg/attr-weakref-1.c
UNRESOLVED: gcc.dg/darwin-weakimport-1.c
UNRESOLVED: gcc.dg/darwin-weakimport-2.c
FAIL: gcc.dg/pr17957.c (test for excess errors)
WARNING: gcc.dg/ucnid-2.c compilation failed to produce executable
WARNING: gcc.dg/ucnid-3.c compilation failed to produce executable
WARNING: gcc.dg/ucnid-4.c compilation failed to produce executable
WARNING: gcc.dg/ucnid-5.c compilation failed to produce executable
XPASS: gcc.dg/ucnid-6.c (test for excess errors)
FAIL: gcc.dg/pch/save-temps-1.c -O0 -g assembly comparison
FAIL: gcc.dg/pch/static-1.c -O0 -g assembly comparison
FAIL: gcc.dg/pch/static-2.c -O0 -g assembly comparison
FAIL: gcc.dg/pch/static-3.c -O0 -g assembly comparison
FAIL: gcc.dg/pch/system-1.c -O0 -g assembly comparison
FAIL: largefile.c -O0 -g (test for excess errors)
FAIL: largefile.c  -O0  (test for excess errors)
FAIL: largefile.c  -O1  (test for excess errors)
FAIL: largefile.c  -O2  (test for excess errors)
FAIL: largefile.c  -O3 -fomit-frame-pointer  (test for excess errors)
FAIL: largefile.c  -O3 -g  (test for excess errors)
FAIL: largefile.c  -Os  (test for excess errors)
UNRESOLVED: gcc.dg/special/weak-1.c
UNRESOLVED: gcc.dg/special/weak-2.c
UNRESOLVED: gcc.dg/special/wkali-1.c
UNRESOLVED: gcc.dg/special/wkali-2.c
UNRESOLVED: gcc.dg/torture/builtin-noret-1.c  -O0 
UNRESOLVED: gcc.dg/torture/builtin-noret-1.c  -O1 
UNRESOLVED: gcc.dg/torture/builtin-noret-1.c  -O2 
UNRESOLVED: gcc.dg/torture/builtin-noret-1.c  -O3 -fomit-frame-pointer 
UNRESOLVED: gcc.dg/torture/builtin-noret-1.c  -O3 -g 
UNRESOLVED: gcc.dg/torture/builtin-noret-1.c  -Os 
UNRESOLVED: gcc.dg/torture/builtin-noret-2.c  -O0 
UNRESOLVED: gcc.dg/torture/builtin-noret-2.c  -O1 
UNRESOLVED: gcc.dg/torture/builtin-noret-2.c  -O2 
UNRESOLVED: gcc.dg/torture/builtin-noret-2.c  -O3 -fomit-frame-pointer 
UNRESOLVED: gcc.dg/torture/builtin-noret-2.c  -O3 -g 
UNRESOLVED: gcc.dg/torture/builtin-noret-2.c  -Os 
FAIL: gcc.dg/vect/pr16105.c scan-tree-dump-times vectorized 1 loops 1
FAIL: gcc.dg/vect/pr18400.c scan-tree-dump-times vectorized 1 loops 1
FAIL: gcc.dg/vect/pr18425.c scan-tree-dump-times vectorized 1 loops 1
FAIL: gcc.dg/vect/vect-1.c scan-tree-dump-times vectorized 3 loops 1
FAIL: gcc.dg/vect/vect-101.c scan-tree-dump-times can't determine dependence 1
FAIL: gcc.dg/vect/vect-102.c scan-tree-dump-times possible dependence between data-refs 1
FAIL: gcc.dg/vect/vect-103.c scan-tree-dump-times vectorized 1 loops 1
FAIL: gcc.dg/vect/vect-103.c scan-tree-dump-times dependence distance modulo vf == 0 1
FAIL: gcc.dg/vect/vect-104.c scan-tree-dump-times possible dependence between data-refs 1
FAIL: gcc.dg/vect/vect-105.c scan-tree-dump-times vectorized 1 loops 1
FAIL: gcc.dg/vect/vect-108.c scan-tree-dump-times vectorized 1 loops 1
FAIL: gcc.dg/vect/vect-11.c scan-tree-dump-times vectorized 1 loops 1
FAIL: gcc.dg/vect/vect-111.c scan-tree-dump-times vectorized 1 loops 1
FAIL: gcc.dg/vect/vect-115.c scan-tree-dump-times vectorized 2 loops 1
FAIL: gcc.dg/vect/vect-11a.c scan-tree-dump-times vectorized 1 loops 2
FAIL: gcc.dg/vect/vect-13.c scan-tree-dump-times vectorized 1 loops 1
FAIL: gcc.dg/vect/vect-17.c scan-tree-dump-times vectorized 3 loops 1
FAIL: gcc.dg/vect/vect-18.c scan-tree-dump-times vectorized 3 loops 1
FAIL: gcc.dg/vect/vect-19.c scan-tree-dump-times vectorized 3 loops 1
FAIL: gcc.dg/vect/vect-20.c scan-tree-dump-times vectorized 3 loops 1
FAIL: gcc.dg/vect/vect-22.c scan-tree-dump-times vectorized 4 loops 1
FAIL: gcc.dg/vect/vect-25.c scan-tree-dump-times vectorized 2 loops 1
FAIL: gcc.dg/vect/vect-26.c scan-tree-dump-times vectorized 1 loops 1
FAIL: gcc.dg/vect/vect-26.c scan-tree-dump-times Alignment of access forced using peeling 1
FAIL: gcc.dg/vect/vect-27.c scan-tree-dump-times vectorized 1 loops 1
FAIL: gcc.dg/vect/vect-27.c scan-tree-dump-times Vectorizing an unaligned access 1
FAIL: gcc.dg/vect/vect-28.c scan-tree-dump-times vectorized 1 loops 1
FAIL: gcc.dg/vect/vect-28.c scan-tree-dump-times Alignment of access forced using peeling 1
FAIL: gcc.dg/vect/vect-29.c scan-tree-dump-times vectorized 1 loops 1
FAIL: gcc.dg/vect/vect-29.c scan-tree-dump-times Vectorizing an unaligned access 1
FAIL: gcc.dg/vect/vect-3.c scan-tree-dump-times vectorized 1 loops 1
FAIL: gcc.dg/vect/vect-30.c scan-tree-dump-times vectorized 1 loops 2
FAIL: gcc.dg/vect/vect-31.c scan-tree-dump-times vectorized 4 loops 1
FAIL: gcc.dg/vect/vect-31.c scan-tree-dump-times Alignment of access forced using peeling 2
FAIL: gcc.dg/vect/vect-4.c scan-tree-dump-times vectorized 1 loops 1
FAIL: gcc.dg/vect/vect-40.c scan-tree-dump-times vectorized 1 loops 1
FAIL: gcc.dg/vect/vect-42.c scan-tree-dump-times vectorized 1 loops 1
FAIL: gcc.dg/vect/vect-42.c scan-tree-dump-times Vectorizing an unaligned access 2
FAIL: gcc.dg/vect/vect-42.c scan-tree-dump-times Alignment of access forced using peeling 1
FAIL: gcc.dg/vect/vect-43.c scan-tree-dump-times vectorized 1 loops 1
FAIL: gcc.dg/vect/vect-44.c scan-tree-dump-times vectorized 1 loops 1
FAIL: gcc.dg/vect/vect-44.c scan-tree-dump-times Vectorizing an unaligned access 2
FAIL: gcc.dg/vect/vect-44.c scan-tree-dump-times Alignment of access forced using peeling 1
FAIL: gcc.dg/vect/vect-46.c scan-tree-dump-times vectorized 1 loops 1
FAIL: gcc.dg/vect/vect-48.c scan-tree-dump-times vectorized 1 loops 1
FAIL: gcc.dg/vect/vect-48.c scan-tree-dump-times Vectorizing an unaligned access 2
FAIL: gcc.dg/vect/vect-5.c scan-tree-dump-times vectorized 2 loops 1
FAIL: gcc.dg/vect/vect-50.c scan-tree-dump-times vectorized 1 loops 1
FAIL: gcc.dg/vect/vect-50.c scan-tree-dump-times Vectorizing an unaligned access 2
FAIL: gcc.dg/vect/vect-50.c scan-tree-dump-times Alignment of access forced using peeling 1
FAIL: gcc.dg/vect/vect-52.c scan-tree-dump-times vectorized 1 loops 1
FAIL: gcc.dg/vect/vect-52.c scan-tree-dump-times Vectorizing an unaligned access 2
FAIL: gcc.dg/vect/vect-54.c scan-tree-dump-times vectorized 1 loops 1
FAIL: gcc.dg/vect/vect-54.c scan-tree-dump-times Alignment of access forced using peeling 1
FAIL: gcc.dg/vect/vect-56.c scan-tree-dump-times vectorized 1 loops 1
FAIL: gcc.dg/vect/vect-56.c scan-tree-dump-times Vectorizing an unaligned access 2
FAIL: gcc.dg/vect/vect-58.c scan-tree-dump-times vectorized 1 loops 1
FAIL: gcc.dg/vect/vect-58.c scan-tree-dump-times Alignment of access forced using peeling 1
FAIL: gcc.dg/vect/vect-6.c scan-tree-dump-times vectorized 2 loops 1
FAIL: gcc.dg/vect/vect-60.c scan-tree-dump-times vectorized 1 loops 1
FAIL: gcc.dg/vect/vect-60.c scan-tree-dump-times Vectorizing an unaligned access 2
FAIL: gcc.dg/vect/vect-62.c scan-tree-dump-times vectorized 1 loops 1
FAIL: gcc.dg/vect/vect-64.c scan-tree-dump-times vectorized 3 loops 1
FAIL: gcc.dg/vect/vect-64.c scan-tree-dump-times Alignment of access forced using peeling 2
FAIL: gcc.dg/vect/vect-65.c scan-tree-dump-times vectorized 2 loops 1
FAIL: gcc.dg/vect/vect-66.c scan-tree-dump-times vectorized 3 loops 1
FAIL: gcc.dg/vect/vect-66.c scan-tree-dump-times Alignment of access forced using peeling 1
FAIL: gcc.dg/vect/vect-67.c scan-tree-dump-times vectorized 1 loops 1
FAIL: gcc.dg/vect/vect-68.c scan-tree-dump-times vectorized 4 loops 1
FAIL: gcc.dg/vect/vect-68.c scan-tree-dump-times Alignment of access forced using peeling 2
FAIL: gcc.dg/vect/vect-69.c scan-tree-dump-times vectorized 4 loops 1
FAIL: gcc.dg/vect/vect-69.c scan-tree-dump-times Alignment of access forced using peeling 2
FAIL: gcc.dg/vect/vect-70.c scan-tree-dump-times vectorized 1 loops 1
FAIL: gcc.dg/vect/vect-70.c scan-tree-dump-times Alignment of access forced using peeling 1
FAIL: gcc.dg/vect/vect-72.c scan-tree-dump-times vectorized 1 loops 1
FAIL: gcc.dg/vect/vect-72.c scan-tree-dump-times Vectorizing an unaligned access 1
FAIL: gcc.dg/vect/vect-73.c scan-tree-dump-times vectorized 1 loops 1
FAIL: gcc.dg/vect/vect-74.c scan-tree-dump-times vectorized 1 loops 1
FAIL: gcc.dg/vect/vect-74.c scan-tree-dump-times Vectorizing an unaligned access 2
FAIL: gcc.dg/vect/vect-74.c scan-tree-dump-times Alignment of access forced using peeling 1
FAIL: gcc.dg/vect/vect-75.c scan-tree-dump-times vectorized 1 loops 1
FAIL: gcc.dg/vect/vect-75.c scan-tree-dump-times Vectorizing an unaligned access 1
FAIL: gcc.dg/vect/vect-76.c scan-tree-dump-times vectorized 3 loops 1
FAIL: gcc.dg/vect/vect-76.c scan-tree-dump-times Vectorizing an unaligned access 2
FAIL: gcc.dg/vect/vect-77.c scan-tree-dump-times vectorized 1 loops 1
FAIL: gcc.dg/vect/vect-77.c scan-tree-dump-times Vectorizing an unaligned access 1
FAIL: gcc.dg/vect/vect-78.c scan-tree-dump-times vectorized 1 loops 1
FAIL: gcc.dg/vect/vect-78.c scan-tree-dump-times Vectorizing an unaligned access 1
FAIL: gcc.dg/vect/vect-79.c scan-tree-dump-times can't determine dependence between 1
FAIL: gcc.dg/vect/vect-8.c scan-tree-dump-times vectorized 1 loops 1
FAIL: gcc.dg/vect/vect-80.c scan-tree-dump-times vectorized 1 loops 1
FAIL: gcc.dg/vect/vect-80.c scan-tree-dump-times Vectorizing an unaligned access 2
FAIL: gcc.dg/vect/vect-80.c scan-tree-dump-times Alignment of access forced using peeling 1
FAIL: gcc.dg/vect/vect-82.c scan-tree-dump-times vectorized 1 loops 1
FAIL: gcc.dg/vect/vect-82_64.c (test for excess errors)
ERROR: gcc.dg/vect/vect-82_64.c: error executing dg-final: no files matched glob pattern "vect-82_64.c.t[0-9][0-9].vect"
UNRESOLVED: gcc.dg/vect/vect-82_64.c: error executing dg-final: no files matched glob pattern "vect-82_64.c.t[0-9][0-9].vect"
FAIL: gcc.dg/vect/vect-83.c scan-tree-dump-times vectorized 1 loops 1
FAIL: gcc.dg/vect/vect-83_64.c (test for excess errors)
ERROR: gcc.dg/vect/vect-83_64.c: error executing dg-final: no files matched glob pattern "vect-83_64.c.t[0-9][0-9].vect"
UNRESOLVED: gcc.dg/vect/vect-83_64.c: error executing dg-final: no files matched glob pattern "vect-83_64.c.t[0-9][0-9].vect"
FAIL: gcc.dg/vect/vect-85.c scan-tree-dump-times vectorized 1 loops 1
FAIL: gcc.dg/vect/vect-86.c scan-tree-dump-times vectorized 1 loops 1
FAIL: gcc.dg/vect/vect-87.c scan-tree-dump-times vectorized 1 loops 1
FAIL: gcc.dg/vect/vect-87.c scan-tree-dump-times Alignment of access forced using peeling 1
FAIL: gcc.dg/vect/vect-88.c scan-tree-dump-times vectorized 1 loops 1
FAIL: gcc.dg/vect/vect-88.c scan-tree-dump-times Alignment of access forced using peeling 1
FAIL: gcc.dg/vect/vect-89.c scan-tree-dump-times vectorized 1 loops 1
FAIL: gcc.dg/vect/vect-89.c scan-tree-dump-times Alignment of access forced using peeling 1
FAIL: gcc.dg/vect/vect-91.c scan-tree-dump-times vectorized 1 loops 3
FAIL: gcc.dg/vect/vect-91.c scan-tree-dump-times accesses have the same alignment. 3
FAIL: gcc.dg/vect/vect-91.c scan-tree-dump-times Alignment of access forced using peeling 3
FAIL: gcc.dg/vect/vect-92.c scan-tree-dump-times vectorized 1 loops 3
FAIL: gcc.dg/vect/vect-92.c scan-tree-dump-times Alignment of access forced using peeling 3
FAIL: gcc.dg/vect/vect-93.c scan-tree-dump-times vectorized 2 loops 1
FAIL: gcc.dg/vect/vect-93.c scan-tree-dump-times Alignment of access forced using peeling 3
FAIL: gcc.dg/vect/vect-93.c scan-tree-dump-times vectorized 1 loops 1
FAIL: gcc.dg/vect/vect-93.c scan-tree-dump-times Vectorizing an unaligned access 1
FAIL: gcc.dg/vect/vect-95.c scan-tree-dump-times vectorized 1 loops 1
FAIL: gcc.dg/vect/vect-95.c scan-tree-dump-times Vectorizing an unaligned access 2
FAIL: gcc.dg/vect/vect-95.c scan-tree-dump-times Alignment of access forced using versioning 2
FAIL: gcc.dg/vect/vect-96.c scan-tree-dump-times vectorized 1 loops 1
FAIL: gcc.dg/vect/vect-96.c scan-tree-dump-times Vectorizing an unaligned access 1
FAIL: gcc.dg/vect/vect-96.c scan-tree-dump-times Alignment of access forced using peeling 1
FAIL: gcc.dg/vect/vect-98.c scan-tree-dump-times not vectorized: complicated access pattern 1
FAIL: gcc.dg/vect/vect-99.c scan-tree-dump-times vectorized 1 loops 1
FAIL: gcc.dg/vect/vect-all.c scan-tree-dump-times vectorized 10 loops 1
FAIL: gcc.dg/vect/vect-dv-2.c scan-tree-dump-times vectorized 2 loops 1
FAIL: gcc.dg/vect/vect-dv-2.c scan-tree-dump-times accesses have the same alignment. 2
FAIL: gcc.dg/vect/vect-ifcvt-2.c scan-tree-dump-times vectorized 1 loops 1
FAIL: gcc.dg/vect/vect-ifcvt-3.c scan-tree-dump-times vectorized 1 loops 1
FAIL: gcc.dg/vect/vect-ifcvt-4.c scan-tree-dump-times vectorized 1 loops 1
FAIL: gcc.dg/vect/vect-ifcvt-5.c scan-tree-dump-times vectorized 1 loops 1
FAIL: gcc.dg/vect/vect-ifcvt-6.c scan-tree-dump-times vectorized 1 loops 1
FAIL: gcc.dg/vect/vect-ifcvt-7.c scan-tree-dump-times vectorized 1 loops 1
FAIL: gcc.dg/vect/vect-ifcvt-9.c scan-tree-dump-times vectorized 1 loops 2
FAIL: gcc.dg/vect/vect-reduc-1.c scan-tree-dump-times vectorized 3 loops 1
FAIL: gcc.dg/vect/vect-reduc-1char.c scan-tree-dump-times vectorized 3 loops 1
FAIL: gcc.dg/vect/vect-reduc-1short.c scan-tree-dump-times vectorized 3 loops 1
FAIL: gcc.dg/vect/vect-reduc-2.c scan-tree-dump-times vectorized 3 loops 1
FAIL: gcc.dg/vect/vect-reduc-3.c scan-tree-dump-times vectorized 1 loops 1
FAIL: gcc.dg/vect/vect-shift-1.c scan-tree-dump-times vectorized 1 loops 1
FAIL: gcc.dg/vect/fast-math-vect-reduc-5.c scan-tree-dump-times vectorized 3 loops 1
UNRESOLVED: gcc.dg/weak/typeof-2.c
UNRESOLVED: gcc.dg/weak/weak-1.c
UNRESOLVED: gcc.dg/weak/weak-10.c
UNRESOLVED: gcc.dg/weak/weak-11.c
UNRESOLVED: gcc.dg/weak/weak-12.c
UNRESOLVED: gcc.dg/weak/weak-13.c
UNRESOLVED: gcc.dg/weak/weak-14.c
UNRESOLVED: gcc.dg/weak/weak-2.c
UNRESOLVED: gcc.dg/weak/weak-3.c
UNRESOLVED: gcc.dg/weak/weak-4.c
UNRESOLVED: gcc.dg/weak/weak-5.c
UNRESOLVED: gcc.dg/weak/weak-6.c
UNRESOLVED: gcc.dg/weak/weak-7.c
UNRESOLVED: gcc.dg/weak/weak-8.c
UNRESOLVED: gcc.dg/weak/weak-9.c
FAIL: gcc.target/powerpc/20020118-1.c execution test
WARNING: gcc.target/powerpc/altivec-1.c compilation failed to produce executable
ERROR: gcc.target/powerpc/altivec-11.c: error executing dg-final: couldn't open "altivec-11.s": no such file or directory
UNRESOLVED: gcc.target/powerpc/altivec-11.c: error executing dg-final: couldn't open "altivec-11.s": no such file or directory
WARNING: gcc.target/powerpc/altivec-12.c compilation failed to produce executable
FAIL: gcc.target/powerpc/altivec-14.c  (test for warnings, line 8)
FAIL: gcc.target/powerpc/altivec-14.c  (test for warnings, line 9)
FAIL: gcc.target/powerpc/altivec-14.c  (test for warnings, line 10)
FAIL: gcc.target/powerpc/altivec-14.c  (test for warnings, line 11)
FAIL: gcc.target/powerpc/altivec-14.c  (test for warnings, line 12)
FAIL: gcc.target/powerpc/altivec-14.c  (test for warnings, line 14)
FAIL: gcc.target/powerpc/altivec-14.c  (test for warnings, line 15)
FAIL: gcc.target/powerpc/altivec-14.c  (test for warnings, line 16)
FAIL: gcc.target/powerpc/altivec-14.c  (test for warnings, line 20)
FAIL: gcc.target/powerpc/altivec-14.c  (test for warnings, line 21)
FAIL: gcc.target/powerpc/altivec-14.c  (test for warnings, line 22)
FAIL: gcc.target/powerpc/altivec-14.c (test for excess errors)
ERROR: gcc.target/powerpc/altivec-18.c: error executing dg-final: couldn't open "altivec-18.s": no such file or directory
UNRESOLVED: gcc.target/powerpc/altivec-18.c: error executing dg-final: couldn't open "altivec-18.s": no such file or directory
XPASS: gcc.target/powerpc/altivec-2.c  (test for errors, line 14)
FAIL: gcc.target/powerpc/altivec-2.c (test for excess errors)
FAIL: gcc.target/powerpc/altivec-20.c (test for excess errors)
FAIL: gcc.target/powerpc/altivec-21.c  (test for errors, line 13)
FAIL: gcc.target/powerpc/altivec-21.c  (test for errors, line 14)
FAIL: gcc.target/powerpc/altivec-21.c (test for excess errors)
ERROR: gcc.target/powerpc/altivec-22.c: error executing dg-final: couldn't open "altivec-22.s": no such file or directory
UNRESOLVED: gcc.target/powerpc/altivec-22.c: error executing dg-final: couldn't open "altivec-22.s": no such file or directory
WARNING: gcc.target/powerpc/altivec-3.c compilation failed to produce executable
WARNING: gcc.target/powerpc/altivec-consts.c compilation failed to produce executable
WARNING: gcc.target/powerpc/altivec-varargs-1.c compilation failed to produce executable
WARNING: gcc.target/powerpc/altivec-vec-merge.c compilation failed to produce executable
XPASS: gcc.target/powerpc/darwin-longlong.c (test for excess errors)
FAIL: gcc.target/powerpc/ppc-vector-memcpy.c scan-assembler lvx
XPASS: gcc.target/powerpc/ppc-vector-memset.c (test for excess errors)
FAIL: gcc.target/powerpc/ppc-vector-memset.c scan-assembler stvx
XPASS: gcc.target/powerpc/pr16155.c -maltivec -mansi (test for bogus messages, line )
FAIL: gcc.target/powerpc/pr16155.c (test for excess errors)
XPASS: gcc.target/powerpc/pr16286.c -maltivec (test for bogus messages, line )
FAIL: gcc.target/powerpc/pr16286.c (test for excess errors)
FAIL: gcc.target/powerpc/pr18096-1.c stack frame too large (test for warnings, line 11)
FAIL: gcc.target/powerpc/pr18096-1.c (test for excess errors)

		=== gcc Summary ===

# of expected passes		36832
# of unexpected failures	180
# of unexpected successes	6
# of expected failures		134
# of unresolved testcases	57
# of untested testcases		35
# of unsupported tests		436
/opt/build/eric/gcc-4_1-branch/gcc/xgcc  version 4.1.1

		=== obj-c++ tests ===


Running target unix
FAIL: obj-c++.dg/basic.mm (test for excess errors)
WARNING: obj-c++.dg/basic.mm compilation failed to produce executable
FAIL: obj-c++.dg/bitfield-1.mm (test for excess errors)
WARNING: obj-c++.dg/bitfield-1.mm compilation failed to produce executable
FAIL: obj-c++.dg/bitfield-2.mm (test for excess errors)
WARNING: obj-c++.dg/bitfield-2.mm compilation failed to produce executable
FAIL: obj-c++.dg/bitfield-4.mm (test for excess errors)
WARNING: obj-c++.dg/bitfield-4.mm compilation failed to produce executable
FAIL: obj-c++.dg/comp-types-1.mm (test for excess errors)
FAIL: obj-c++.dg/comp-types-10.mm (test for excess errors)
FAIL: obj-c++.dg/comp-types-11.mm (test for excess errors)
FAIL: obj-c++.dg/comp-types-2.mm (test for excess errors)
FAIL: obj-c++.dg/comp-types-3.mm (test for excess errors)
FAIL: obj-c++.dg/comp-types-4.mm (test for excess errors)
FAIL: obj-c++.dg/comp-types-6.mm (test for excess errors)
FAIL: obj-c++.dg/comp-types-7.mm (test for excess errors)
FAIL: obj-c++.dg/comp-types-8.mm (test for excess errors)
FAIL: obj-c++.dg/comp-types-9.mm (test for excess errors)
FAIL: obj-c++.dg/const-str-5.mm (test for excess errors)
FAIL: obj-c++.dg/cxx-ivars-1.mm (test for excess errors)
WARNING: obj-c++.dg/cxx-ivars-1.mm compilation failed to produce executable
FAIL: obj-c++.dg/cxx-ivars-2.mm (test for excess errors)
WARNING: obj-c++.dg/cxx-ivars-2.mm compilation failed to produce executable
FAIL: obj-c++.dg/cxx-scope-1.mm (test for excess errors)
WARNING: obj-c++.dg/cxx-scope-1.mm compilation failed to produce executable
FAIL: obj-c++.dg/defs.mm (test for excess errors)
WARNING: obj-c++.dg/defs.mm compilation failed to produce executable
FAIL: obj-c++.dg/encode-1.mm (test for excess errors)
ERROR: obj-c++.dg/encode-1.mm: error executing dg-final: couldn't open "encode-1.s": no such file or directory
UNRESOLVED: obj-c++.dg/encode-1.mm: error executing dg-final: couldn't open "encode-1.s": no such file or directory
FAIL: obj-c++.dg/encode-3.mm (test for excess errors)
WARNING: obj-c++.dg/encode-3.mm compilation failed to produce executable
FAIL: obj-c++.dg/encode-4.mm (test for excess errors)
WARNING: obj-c++.dg/encode-4.mm compilation failed to produce executable
FAIL: obj-c++.dg/encode-5.mm (test for excess errors)
WARNING: obj-c++.dg/encode-5.mm compilation failed to produce executable
FAIL: obj-c++.dg/encode-6.mm (test for excess errors)
WARNING: obj-c++.dg/encode-6.mm compilation failed to produce executable
FAIL: obj-c++.dg/encode-7.mm (test for excess errors)
FAIL: obj-c++.dg/encode-8.mm (test for excess errors)
WARNING: obj-c++.dg/encode-8.mm compilation failed to produce executable
FAIL: obj-c++.dg/except-1.mm (test for excess errors)
WARNING: obj-c++.dg/except-1.mm compilation failed to produce executable
FAIL: obj-c++.dg/extern-c-1.mm (test for excess errors)
FAIL: obj-c++.dg/gnu-runtime-1.mm (test for excess errors)
FAIL: obj-c++.dg/gnu-runtime-2.mm (test for excess errors)
FAIL: obj-c++.dg/gnu-runtime-3.mm (test for excess errors)
WARNING: obj-c++.dg/gnu-runtime-3.mm compilation failed to produce executable
FAIL: obj-c++.dg/isa-field-1.mm (test for excess errors)
FAIL: obj-c++.dg/local-decl-1.mm (test for excess errors)
FAIL: obj-c++.dg/lookup-2.mm (test for excess errors)
WARNING: obj-c++.dg/lookup-2.mm compilation failed to produce executable
FAIL: obj-c++.dg/method-1.mm (test for excess errors)
FAIL: obj-c++.dg/method-10.mm (test for excess errors)
WARNING: obj-c++.dg/method-10.mm compilation failed to produce executable
FAIL: obj-c++.dg/method-11.mm (test for excess errors)
ERROR: obj-c++.dg/method-11.mm: error executing dg-final: couldn't open "method-11.s": no such file or directory
UNRESOLVED: obj-c++.dg/method-11.mm: error executing dg-final: couldn't open "method-11.s": no such file or directory
FAIL: obj-c++.dg/method-13.mm (test for excess errors)
FAIL: obj-c++.dg/method-14.mm (test for excess errors)
FAIL: obj-c++.dg/method-15.mm (test for excess errors)
FAIL: obj-c++.dg/method-17.mm (test for excess errors)
WARNING: obj-c++.dg/method-17.mm compilation failed to produce executable
FAIL: obj-c++.dg/method-18.mm (test for excess errors)
FAIL: obj-c++.dg/method-19.mm (test for excess errors)
WARNING: obj-c++.dg/method-19.mm compilation failed to produce executable
FAIL: obj-c++.dg/method-2.mm (test for excess errors)
FAIL: obj-c++.dg/method-20.mm (test for excess errors)
ERROR: obj-c++.dg/method-20.mm: error executing dg-final: couldn't open "method-20.s": no such file or directory
UNRESOLVED: obj-c++.dg/method-20.mm: error executing dg-final: couldn't open "method-20.s": no such file or directory
FAIL: obj-c++.dg/method-3.mm (test for excess errors)
FAIL: obj-c++.dg/method-4.mm (test for excess errors)
FAIL: obj-c++.dg/method-5.mm (test for excess errors)
FAIL: obj-c++.dg/method-6.mm (test for excess errors)
FAIL: obj-c++.dg/method-9.mm (test for excess errors)
FAIL: obj-c++.dg/no-extra-load.mm (test for excess errors)
ERROR: obj-c++.dg/no-extra-load.mm: error executing dg-final: couldn't open "no-extra-load.s": no such file or directory
UNRESOLVED: obj-c++.dg/no-extra-load.mm: error executing dg-final: couldn't open "no-extra-load.s": no such file or directory
FAIL: obj-c++.dg/pragma-2.mm (test for excess errors)
FAIL: obj-c++.dg/private-2.mm (test for excess errors)
FAIL: obj-c++.dg/proto-lossage-1.mm (test for excess errors)
FAIL: obj-c++.dg/proto-lossage-2.mm (test for excess errors)
FAIL: obj-c++.dg/proto-lossage-3.mm (test for excess errors)
WARNING: obj-c++.dg/proto-lossage-3.mm compilation failed to produce executable
FAIL: obj-c++.dg/proto-lossage-5.mm (test for excess errors)
FAIL: obj-c++.dg/proto-lossage-6.mm (test for excess errors)
FAIL: obj-c++.dg/proto-qual-1.mm (test for excess errors)
WARNING: obj-c++.dg/proto-qual-1.mm compilation failed to produce executable
FAIL: obj-c++.dg/qual-types-1.mm (test for excess errors)
WARNING: obj-c++.dg/qual-types-1.mm compilation failed to produce executable
FAIL: obj-c++.dg/selector-1.mm (test for excess errors)
ERROR: obj-c++.dg/selector-1.mm: error executing dg-final: couldn't open "selector-1.s": no such file or directory
UNRESOLVED: obj-c++.dg/selector-1.mm: error executing dg-final: couldn't open "selector-1.s": no such file or directory
FAIL: obj-c++.dg/selector-2.mm (test for excess errors)
FAIL: obj-c++.dg/selector-3.mm (test for excess errors)
FAIL: obj-c++.dg/selector-4.mm (test for excess errors)
FAIL: obj-c++.dg/selector-5.mm (test for excess errors)
ERROR: obj-c++.dg/selector-5.mm: error executing dg-final: couldn't open "selector-5.s": no such file or directory
UNRESOLVED: obj-c++.dg/selector-5.mm: error executing dg-final: couldn't open "selector-5.s": no such file or directory
FAIL: obj-c++.dg/selector-6.mm (test for excess errors)
ERROR: obj-c++.dg/selector-6.mm: error executing dg-final: couldn't open "selector-6.s": no such file or directory
UNRESOLVED: obj-c++.dg/selector-6.mm: error executing dg-final: couldn't open "selector-6.s": no such file or directory
FAIL: obj-c++.dg/super-class-1.mm (test for excess errors)
FAIL: obj-c++.dg/super-dealloc-1.mm (test for excess errors)
FAIL: obj-c++.dg/super-dealloc-2.mm (test for excess errors)
FAIL: obj-c++.dg/template-1.mm (test for excess errors)
WARNING: obj-c++.dg/template-1.mm compilation failed to produce executable
FAIL: obj-c++.dg/template-3.mm (test for excess errors)
WARNING: obj-c++.dg/template-3.mm compilation failed to produce executable
FAIL: obj-c++.dg/template-4.mm (test for excess errors)
WARNING: obj-c++.dg/template-4.mm compilation failed to produce executable
FAIL: obj-c++.dg/template-5.mm (test for excess errors)
ERROR: obj-c++.dg/template-5.mm: error executing dg-final: couldn't open "template-5.s": no such file or directory
UNRESOLVED: obj-c++.dg/template-5.mm: error executing dg-final: couldn't open "template-5.s": no such file or directory
FAIL: obj-c++.dg/template-6.mm (test for excess errors)
ERROR: obj-c++.dg/template-6.mm: error executing dg-final: couldn't open "template-6.s": no such file or directory
UNRESOLVED: obj-c++.dg/template-6.mm: error executing dg-final: couldn't open "template-6.s": no such file or directory
FAIL: obj-c++.dg/try-catch-1.mm (test for excess errors)
FAIL: obj-c++.dg/try-catch-10.mm (test for excess errors)
FAIL: obj-c++.dg/try-catch-11.mm (test for excess errors)
FAIL: obj-c++.dg/try-catch-2.mm (test for excess errors)
WARNING: obj-c++.dg/try-catch-2.mm compilation failed to produce executable
FAIL: obj-c++.dg/try-catch-3.mm (test for excess errors)
FAIL: obj-c++.dg/try-catch-4.mm (test for excess errors)
FAIL: obj-c++.dg/try-catch-5.mm (test for excess errors)
FAIL: obj-c++.dg/try-catch-6.mm (test for excess errors)
FAIL: obj-c++.dg/try-catch-7.mm (test for excess errors)
FAIL: obj-c++.dg/try-catch-8.mm (test for excess errors)
FAIL: obj-c++.dg/try-catch-9.mm (test for excess errors)
WARNING: obj-c++.dg/try-catch-9.mm compilation failed to produce executable
FAIL: obj-c++.dg/typedef-alias-1.mm (test for excess errors)
FAIL: obj-c++.dg/va-meth-1.mm (test for excess errors)
WARNING: obj-c++.dg/va-meth-1.mm compilation failed to produce executable

		=== obj-c++ Summary ===

# of expected passes		301
# of unexpected failures	87
# of unresolved testcases	9
# of unsupported tests		13
/opt/build/eric/gcc-4_1-branch/gcc/testsuite/obj-c++/../../g++  version 4.1.1

		=== objc tests ===


Running target unix
UNRESOLVED: objc.dg/weak-1.m

		=== objc Summary ===

# of expected passes		1682
# of unresolved testcases	1
# of unsupported tests		24
/opt/build/eric/gcc-4_1-branch/gcc/xgcc  version 4.1.1

		=== libstdc++ tests ===


Running target unix
FAIL: 22_locale/codecvt/in/wchar_t/1.cc (test for excess errors)
FAIL: 22_locale/codecvt/in/wchar_t/5.cc (test for excess errors)
FAIL: 22_locale/codecvt/in/wchar_t/6.cc (test for excess errors)
FAIL: 22_locale/ctype/is/char/3.cc execution test
FAIL: 26_numerics/cmath/c99_classification_macros_c.cc (test for excess errors)
FAIL: 27_io/ios_base/storage/11584.cc execution test
FAIL: 27_io/objects/char/6.cc execution test
FAIL: 27_io/objects/wchar_t/6.cc execution test
FAIL: ext/mt_allocator/check_new.cc execution test
FAIL: ext/pool_allocator/check_new.cc execution test
FAIL: ext/stdio_sync_filebuf/wchar_t/1.cc (test for excess errors)

		=== libstdc++ Summary ===

# of expected passes		3361
# of unexpected failures	11
# of expected failures		10
# of unsupported tests		317

Compiler version: 4.1.1 
Platform: powerpc-ibm-aix5.2.0.0
configure flags: --prefix=/opt/build/eric/local --with-local-prefix=/opt/build/eric/local --enable-languages=c,c++,objc,obj-c++
BOOT_CFLAGS=-g -O2


Index Nav: [Date Index] [Subject Index] [Author Index] [Thread Index]
Message Nav: [Date Prev] [Date Next] [Thread Prev] [Thread Next]