This is the mail archive of the gcc-testresults@gcc.gnu.org mailing list for the GCC project.


Index Nav: [Date Index] [Subject Index] [Author Index] [Thread Index]
Message Nav: [Date Prev] [Date Next] [Thread Prev] [Thread Next]
Other format: [Raw text]

Results for 4.1.0 20051113 (experimental) testsuite on powerpc64-suse-linux-gnu


Bootstrap and regtesting on powerpc64-suse-linux-gnu.
SVN sources: mainline.
LAST_UPDATED: Sun Nov 13 11:04:32 UTC 2005 (revision 106861)

Native configuration is powerpc64-suse-linux-gnu

		=== gcc tests ===


Running target unix/-m64
FAIL: gcc.dg/cleanup-10.c execution test
FAIL: gcc.dg/cleanup-11.c execution test
FAIL: gcc.dg/cleanup-8.c execution test
FAIL: gcc.dg/cleanup-9.c execution test
XPASS: gcc.dg/tree-ssa/sra-2.c scan-tree-dump-times link_error 0
FAIL: gcc.dg/vect/pr16105.c (test for excess errors)
FAIL: gcc.dg/vect/pr18400.c (test for excess errors)
WARNING: gcc.dg/vect/pr18400.c compilation failed to produce executable
FAIL: gcc.dg/vect/pr18536.c (test for excess errors)
WARNING: gcc.dg/vect/pr18536.c compilation failed to produce executable
FAIL: gcc.dg/vect/pr20122.c (test for excess errors)
WARNING: gcc.dg/vect/pr20122.c compilation failed to produce executable
FAIL: gcc.dg/vect/pr20122.c scan-tree-dump-times vectorized 1 loops 2
FAIL: gcc.dg/vect/pr22506.c (test for excess errors)
FAIL: gcc.dg/vect/pr23816-1.c (test for excess errors)
FAIL: gcc.dg/vect/pr23831.c (test for excess errors)
FAIL: gcc.dg/vect/pr24059.c (test for excess errors)
FAIL: gcc.dg/vect/pr24300.c (test for excess errors)
FAIL: gcc.dg/vect/vect-1.c (test for excess errors)
FAIL: gcc.dg/vect/vect-100.c (test for excess errors)
WARNING: gcc.dg/vect/vect-100.c compilation failed to produce executable
FAIL: gcc.dg/vect/vect-103.c (test for excess errors)
WARNING: gcc.dg/vect/vect-103.c compilation failed to produce executable
FAIL: gcc.dg/vect/vect-105.c (test for excess errors)
WARNING: gcc.dg/vect/vect-105.c compilation failed to produce executable
FAIL: gcc.dg/vect/vect-108.c (test for excess errors)
WARNING: gcc.dg/vect/vect-108.c compilation failed to produce executable
FAIL: gcc.dg/vect/vect-11.c (test for excess errors)
WARNING: gcc.dg/vect/vect-11.c compilation failed to produce executable
FAIL: gcc.dg/vect/vect-111.c (test for excess errors)
WARNING: gcc.dg/vect/vect-111.c compilation failed to produce executable
FAIL: gcc.dg/vect/vect-115.c (test for excess errors)
WARNING: gcc.dg/vect/vect-115.c compilation failed to produce executable
FAIL: gcc.dg/vect/vect-11a.c (test for excess errors)
WARNING: gcc.dg/vect/vect-11a.c compilation failed to produce executable
FAIL: gcc.dg/vect/vect-11a.c scan-tree-dump-times vectorized 1 loops 2
FAIL: gcc.dg/vect/vect-13.c (test for excess errors)
WARNING: gcc.dg/vect/vect-13.c compilation failed to produce executable
FAIL: gcc.dg/vect/vect-17.c (test for excess errors)
WARNING: gcc.dg/vect/vect-17.c compilation failed to produce executable
FAIL: gcc.dg/vect/vect-18.c (test for excess errors)
WARNING: gcc.dg/vect/vect-18.c compilation failed to produce executable
FAIL: gcc.dg/vect/vect-19.c (test for excess errors)
WARNING: gcc.dg/vect/vect-19.c compilation failed to produce executable
FAIL: gcc.dg/vect/vect-2.c (test for excess errors)
WARNING: gcc.dg/vect/vect-2.c compilation failed to produce executable
FAIL: gcc.dg/vect/vect-20.c (test for excess errors)
WARNING: gcc.dg/vect/vect-20.c compilation failed to produce executable
FAIL: gcc.dg/vect/vect-22.c (test for excess errors)
WARNING: gcc.dg/vect/vect-22.c compilation failed to produce executable
FAIL: gcc.dg/vect/vect-25.c (test for excess errors)
WARNING: gcc.dg/vect/vect-25.c compilation failed to produce executable
FAIL: gcc.dg/vect/vect-26.c (test for excess errors)
WARNING: gcc.dg/vect/vect-26.c compilation failed to produce executable
FAIL: gcc.dg/vect/vect-27.c (test for excess errors)
WARNING: gcc.dg/vect/vect-27.c compilation failed to produce executable
FAIL: gcc.dg/vect/vect-28.c (test for excess errors)
WARNING: gcc.dg/vect/vect-28.c compilation failed to produce executable
FAIL: gcc.dg/vect/vect-29.c (test for excess errors)
WARNING: gcc.dg/vect/vect-29.c compilation failed to produce executable
FAIL: gcc.dg/vect/vect-3.c (test for excess errors)
WARNING: gcc.dg/vect/vect-3.c compilation failed to produce executable
FAIL: gcc.dg/vect/vect-30.c (test for excess errors)
WARNING: gcc.dg/vect/vect-30.c compilation failed to produce executable
FAIL: gcc.dg/vect/vect-30.c scan-tree-dump-times vectorized 1 loops 2
FAIL: gcc.dg/vect/vect-31.c (test for excess errors)
WARNING: gcc.dg/vect/vect-31.c compilation failed to produce executable
FAIL: gcc.dg/vect/vect-32.c (test for excess errors)
WARNING: gcc.dg/vect/vect-32.c compilation failed to produce executable
FAIL: gcc.dg/vect/vect-33.c (test for excess errors)
FAIL: gcc.dg/vect/vect-34.c (test for excess errors)
WARNING: gcc.dg/vect/vect-34.c compilation failed to produce executable
FAIL: gcc.dg/vect/vect-36.c (test for excess errors)
WARNING: gcc.dg/vect/vect-36.c compilation failed to produce executable
FAIL: gcc.dg/vect/vect-4.c (test for excess errors)
WARNING: gcc.dg/vect/vect-4.c compilation failed to produce executable
FAIL: gcc.dg/vect/vect-40.c (test for excess errors)
WARNING: gcc.dg/vect/vect-40.c compilation failed to produce executable
FAIL: gcc.dg/vect/vect-42.c (test for excess errors)
WARNING: gcc.dg/vect/vect-42.c compilation failed to produce executable
FAIL: gcc.dg/vect/vect-43.c (test for excess errors)
WARNING: gcc.dg/vect/vect-43.c compilation failed to produce executable
FAIL: gcc.dg/vect/vect-44.c (test for excess errors)
WARNING: gcc.dg/vect/vect-44.c compilation failed to produce executable
FAIL: gcc.dg/vect/vect-46.c (test for excess errors)
WARNING: gcc.dg/vect/vect-46.c compilation failed to produce executable
FAIL: gcc.dg/vect/vect-48.c (test for excess errors)
WARNING: gcc.dg/vect/vect-48.c compilation failed to produce executable
FAIL: gcc.dg/vect/vect-5.c (test for excess errors)
WARNING: gcc.dg/vect/vect-5.c compilation failed to produce executable
FAIL: gcc.dg/vect/vect-50.c (test for excess errors)
WARNING: gcc.dg/vect/vect-50.c compilation failed to produce executable
FAIL: gcc.dg/vect/vect-52.c (test for excess errors)
WARNING: gcc.dg/vect/vect-52.c compilation failed to produce executable
FAIL: gcc.dg/vect/vect-54.c (test for excess errors)
WARNING: gcc.dg/vect/vect-54.c compilation failed to produce executable
FAIL: gcc.dg/vect/vect-56.c (test for excess errors)
WARNING: gcc.dg/vect/vect-56.c compilation failed to produce executable
FAIL: gcc.dg/vect/vect-58.c (test for excess errors)
WARNING: gcc.dg/vect/vect-58.c compilation failed to produce executable
FAIL: gcc.dg/vect/vect-6.c (test for excess errors)
WARNING: gcc.dg/vect/vect-6.c compilation failed to produce executable
FAIL: gcc.dg/vect/vect-60.c (test for excess errors)
WARNING: gcc.dg/vect/vect-60.c compilation failed to produce executable
FAIL: gcc.dg/vect/vect-62.c (test for excess errors)
WARNING: gcc.dg/vect/vect-62.c compilation failed to produce executable
FAIL: gcc.dg/vect/vect-64.c (test for excess errors)
WARNING: gcc.dg/vect/vect-64.c compilation failed to produce executable
FAIL: gcc.dg/vect/vect-65.c (test for excess errors)
WARNING: gcc.dg/vect/vect-65.c compilation failed to produce executable
FAIL: gcc.dg/vect/vect-66.c (test for excess errors)
WARNING: gcc.dg/vect/vect-66.c compilation failed to produce executable
FAIL: gcc.dg/vect/vect-67.c (test for excess errors)
WARNING: gcc.dg/vect/vect-67.c compilation failed to produce executable
FAIL: gcc.dg/vect/vect-68.c (test for excess errors)
WARNING: gcc.dg/vect/vect-68.c compilation failed to produce executable
FAIL: gcc.dg/vect/vect-69.c (test for excess errors)
WARNING: gcc.dg/vect/vect-69.c compilation failed to produce executable
FAIL: gcc.dg/vect/vect-7.c (test for excess errors)
WARNING: gcc.dg/vect/vect-7.c compilation failed to produce executable
FAIL: gcc.dg/vect/vect-70.c (test for excess errors)
WARNING: gcc.dg/vect/vect-70.c compilation failed to produce executable
FAIL: gcc.dg/vect/vect-72.c (test for excess errors)
WARNING: gcc.dg/vect/vect-72.c compilation failed to produce executable
FAIL: gcc.dg/vect/vect-73.c (test for excess errors)
WARNING: gcc.dg/vect/vect-73.c compilation failed to produce executable
FAIL: gcc.dg/vect/vect-74.c (test for excess errors)
WARNING: gcc.dg/vect/vect-74.c compilation failed to produce executable
FAIL: gcc.dg/vect/vect-75.c (test for excess errors)
WARNING: gcc.dg/vect/vect-75.c compilation failed to produce executable
FAIL: gcc.dg/vect/vect-76.c (test for excess errors)
WARNING: gcc.dg/vect/vect-76.c compilation failed to produce executable
FAIL: gcc.dg/vect/vect-77.c (test for excess errors)
WARNING: gcc.dg/vect/vect-77.c compilation failed to produce executable
FAIL: gcc.dg/vect/vect-78.c (test for excess errors)
WARNING: gcc.dg/vect/vect-78.c compilation failed to produce executable
FAIL: gcc.dg/vect/vect-8.c (test for excess errors)
WARNING: gcc.dg/vect/vect-8.c compilation failed to produce executable
FAIL: gcc.dg/vect/vect-80.c (test for excess errors)
WARNING: gcc.dg/vect/vect-80.c compilation failed to produce executable
FAIL: gcc.dg/vect/vect-85.c (test for excess errors)
WARNING: gcc.dg/vect/vect-85.c compilation failed to produce executable
FAIL: gcc.dg/vect/vect-86.c (test for excess errors)
WARNING: gcc.dg/vect/vect-86.c compilation failed to produce executable
FAIL: gcc.dg/vect/vect-87.c (test for excess errors)
WARNING: gcc.dg/vect/vect-87.c compilation failed to produce executable
FAIL: gcc.dg/vect/vect-88.c (test for excess errors)
WARNING: gcc.dg/vect/vect-88.c compilation failed to produce executable
FAIL: gcc.dg/vect/vect-89.c (test for excess errors)
WARNING: gcc.dg/vect/vect-89.c compilation failed to produce executable
FAIL: gcc.dg/vect/vect-91.c (test for excess errors)
FAIL: gcc.dg/vect/vect-91.c scan-tree-dump-times vectorized 1 loops 3
FAIL: gcc.dg/vect/vect-91.c scan-tree-dump-times accesses have the same alignment. 3
FAIL: gcc.dg/vect/vect-91.c scan-tree-dump-times Alignment of access forced using peeling 3
FAIL: gcc.dg/vect/vect-92.c (test for excess errors)
WARNING: gcc.dg/vect/vect-92.c compilation failed to produce executable
FAIL: gcc.dg/vect/vect-92.c scan-tree-dump-times vectorized 1 loops 3
FAIL: gcc.dg/vect/vect-92.c scan-tree-dump-times Alignment of access forced using peeling 3
FAIL: gcc.dg/vect/vect-93.c (test for excess errors)
WARNING: gcc.dg/vect/vect-93.c compilation failed to produce executable
FAIL: gcc.dg/vect/vect-93.c scan-tree-dump-times Alignment of access forced using peeling 3
FAIL: gcc.dg/vect/vect-93.c scan-tree-dump-times vectorized 1 loops 1
FAIL: gcc.dg/vect/vect-93.c scan-tree-dump-times Vectorizing an unaligned access 1
FAIL: gcc.dg/vect/vect-95.c (test for excess errors)
WARNING: gcc.dg/vect/vect-95.c compilation failed to produce executable
FAIL: gcc.dg/vect/vect-96.c (test for excess errors)
WARNING: gcc.dg/vect/vect-96.c compilation failed to produce executable
FAIL: gcc.dg/vect/vect-97.c (test for excess errors)
WARNING: gcc.dg/vect/vect-97.c compilation failed to produce executable
FAIL: gcc.dg/vect/vect-99.c (test for excess errors)
WARNING: gcc.dg/vect/vect-99.c compilation failed to produce executable
FAIL: gcc.dg/vect/vect-all.c (test for excess errors)
WARNING: gcc.dg/vect/vect-all.c compilation failed to produce executable
FAIL: gcc.dg/vect/vect-dv-2.c (test for excess errors)
WARNING: gcc.dg/vect/vect-dv-2.c compilation failed to produce executable
FAIL: gcc.dg/vect/vect-ifcvt-2.c (test for excess errors)
WARNING: gcc.dg/vect/vect-ifcvt-2.c compilation failed to produce executable
FAIL: gcc.dg/vect/vect-ifcvt-3.c (test for excess errors)
WARNING: gcc.dg/vect/vect-ifcvt-3.c compilation failed to produce executable
FAIL: gcc.dg/vect/vect-ifcvt-4.c (test for excess errors)
WARNING: gcc.dg/vect/vect-ifcvt-4.c compilation failed to produce executable
FAIL: gcc.dg/vect/vect-ifcvt-5.c (test for excess errors)
WARNING: gcc.dg/vect/vect-ifcvt-5.c compilation failed to produce executable
FAIL: gcc.dg/vect/vect-ifcvt-6.c (test for excess errors)
WARNING: gcc.dg/vect/vect-ifcvt-6.c compilation failed to produce executable
FAIL: gcc.dg/vect/vect-ifcvt-7.c (test for excess errors)
WARNING: gcc.dg/vect/vect-ifcvt-7.c compilation failed to produce executable
FAIL: gcc.dg/vect/vect-ifcvt-9.c (test for excess errors)
WARNING: gcc.dg/vect/vect-ifcvt-9.c compilation failed to produce executable
FAIL: gcc.dg/vect/vect-ifcvt-9.c scan-tree-dump-times vectorized 1 loops 2
FAIL: gcc.dg/vect/vect-reduc-1.c (test for excess errors)
WARNING: gcc.dg/vect/vect-reduc-1.c compilation failed to produce executable
FAIL: gcc.dg/vect/vect-reduc-1char.c (test for excess errors)
WARNING: gcc.dg/vect/vect-reduc-1char.c compilation failed to produce executable
FAIL: gcc.dg/vect/vect-reduc-1short.c (test for excess errors)
WARNING: gcc.dg/vect/vect-reduc-1short.c compilation failed to produce executable
FAIL: gcc.dg/vect/vect-reduc-2.c (test for excess errors)
WARNING: gcc.dg/vect/vect-reduc-2.c compilation failed to produce executable
FAIL: gcc.dg/vect/vect-reduc-2char.c (test for excess errors)
WARNING: gcc.dg/vect/vect-reduc-2char.c compilation failed to produce executable
FAIL: gcc.dg/vect/vect-reduc-2short.c (test for excess errors)
WARNING: gcc.dg/vect/vect-reduc-2short.c compilation failed to produce executable
FAIL: gcc.dg/vect/vect-reduc-3.c (test for excess errors)
WARNING: gcc.dg/vect/vect-reduc-3.c compilation failed to produce executable
FAIL: gcc.dg/vect/vect-reduc-7.c (test for excess errors)
WARNING: gcc.dg/vect/vect-reduc-7.c compilation failed to produce executable
FAIL: gcc.dg/vect/vect-reduc-8.c (test for excess errors)
WARNING: gcc.dg/vect/vect-reduc-8.c compilation failed to produce executable
FAIL: gcc.dg/vect/vect-reduc-9.c (test for excess errors)
WARNING: gcc.dg/vect/vect-reduc-9.c compilation failed to produce executable
FAIL: gcc.dg/vect/vect-shift-1.c (test for excess errors)
WARNING: gcc.dg/vect/vect-shift-1.c compilation failed to produce executable
FAIL: gcc.dg/vect/fast-math-vect-reduc-5.c (test for excess errors)
WARNING: gcc.dg/vect/fast-math-vect-reduc-5.c compilation failed to produce executable
FAIL: gcc.dg/vmx/1b-01.c  -O0  (test for excess errors)
WARNING: gcc.dg/vmx/1b-01.c  -O0  compilation failed to produce executable
FAIL: gcc.dg/vmx/1b-01.c  -O1  (test for excess errors)
WARNING: gcc.dg/vmx/1b-01.c  -O1  compilation failed to produce executable
FAIL: gcc.dg/vmx/1b-01.c  -O2  (test for excess errors)
WARNING: gcc.dg/vmx/1b-01.c  -O2  compilation failed to produce executable
FAIL: gcc.dg/vmx/1b-01.c  -O3 -fomit-frame-pointer  (test for excess errors)
WARNING: gcc.dg/vmx/1b-01.c  -O3 -fomit-frame-pointer  compilation failed to produce executable
FAIL: gcc.dg/vmx/1b-01.c  -O3 -g  (test for excess errors)
WARNING: gcc.dg/vmx/1b-01.c  -O3 -g  compilation failed to produce executable
FAIL: gcc.dg/vmx/1b-01.c  -Os  (test for excess errors)
WARNING: gcc.dg/vmx/1b-01.c  -Os  compilation failed to produce executable
FAIL: gcc.dg/vmx/1b-04.c  -O0  (test for excess errors)
WARNING: gcc.dg/vmx/1b-04.c  -O0  compilation failed to produce executable
FAIL: gcc.dg/vmx/3a-01.c  -O0  (test for excess errors)
WARNING: gcc.dg/vmx/3a-01.c  -O0  compilation failed to produce executable
FAIL: gcc.dg/vmx/3a-01.c  -O1  (test for excess errors)
WARNING: gcc.dg/vmx/3a-01.c  -O1  compilation failed to produce executable
FAIL: gcc.dg/vmx/3a-01.c  -O2  (test for excess errors)
WARNING: gcc.dg/vmx/3a-01.c  -O2  compilation failed to produce executable
FAIL: gcc.dg/vmx/3a-01.c  -O3 -fomit-frame-pointer  (test for excess errors)
WARNING: gcc.dg/vmx/3a-01.c  -O3 -fomit-frame-pointer  compilation failed to produce executable
FAIL: gcc.dg/vmx/3a-01.c  -O3 -g  (test for excess errors)
WARNING: gcc.dg/vmx/3a-01.c  -O3 -g  compilation failed to produce executable
FAIL: gcc.dg/vmx/3a-01.c  -Os  (test for excess errors)
WARNING: gcc.dg/vmx/3a-01.c  -Os  compilation failed to produce executable
FAIL: gcc.dg/vmx/3a-01a.c  -O0  (test for excess errors)
WARNING: gcc.dg/vmx/3a-01a.c  -O0  compilation failed to produce executable
FAIL: gcc.dg/vmx/3a-01a.c  -O1  (test for excess errors)
WARNING: gcc.dg/vmx/3a-01a.c  -O1  compilation failed to produce executable
FAIL: gcc.dg/vmx/3a-01a.c  -O2  (test for excess errors)
WARNING: gcc.dg/vmx/3a-01a.c  -O2  compilation failed to produce executable
FAIL: gcc.dg/vmx/3a-01a.c  -O3 -fomit-frame-pointer  (test for excess errors)
WARNING: gcc.dg/vmx/3a-01a.c  -O3 -fomit-frame-pointer  compilation failed to produce executable
FAIL: gcc.dg/vmx/3a-01a.c  -O3 -g  (test for excess errors)
WARNING: gcc.dg/vmx/3a-01a.c  -O3 -g  compilation failed to produce executable
FAIL: gcc.dg/vmx/3a-01a.c  -Os  (test for excess errors)
WARNING: gcc.dg/vmx/3a-01a.c  -Os  compilation failed to produce executable
FAIL: gcc.dg/vmx/3a-01m.c  -O0  (test for excess errors)
WARNING: gcc.dg/vmx/3a-01m.c  -O0  compilation failed to produce executable
FAIL: gcc.dg/vmx/3a-01m.c  -O1  (test for excess errors)
WARNING: gcc.dg/vmx/3a-01m.c  -O1  compilation failed to produce executable
FAIL: gcc.dg/vmx/3a-01m.c  -O2  (test for excess errors)
WARNING: gcc.dg/vmx/3a-01m.c  -O2  compilation failed to produce executable
FAIL: gcc.dg/vmx/3a-01m.c  -O3 -fomit-frame-pointer  (test for excess errors)
WARNING: gcc.dg/vmx/3a-01m.c  -O3 -fomit-frame-pointer  compilation failed to produce executable
FAIL: gcc.dg/vmx/3a-01m.c  -O3 -g  (test for excess errors)
WARNING: gcc.dg/vmx/3a-01m.c  -O3 -g  compilation failed to produce executable
FAIL: gcc.dg/vmx/3a-01m.c  -Os  (test for excess errors)
WARNING: gcc.dg/vmx/3a-01m.c  -Os  compilation failed to produce executable
FAIL: gcc.dg/vmx/3a-03.c  -O0  (test for excess errors)
WARNING: gcc.dg/vmx/3a-03.c  -O0  compilation failed to produce executable
FAIL: gcc.dg/vmx/3a-03.c  -O1  (test for excess errors)
WARNING: gcc.dg/vmx/3a-03.c  -O1  compilation failed to produce executable
FAIL: gcc.dg/vmx/3a-03.c  -O2  (test for excess errors)
WARNING: gcc.dg/vmx/3a-03.c  -O2  compilation failed to produce executable
FAIL: gcc.dg/vmx/3a-03.c  -O3 -fomit-frame-pointer  (test for excess errors)
WARNING: gcc.dg/vmx/3a-03.c  -O3 -fomit-frame-pointer  compilation failed to produce executable
FAIL: gcc.dg/vmx/3a-03.c  -O3 -g  (test for excess errors)
WARNING: gcc.dg/vmx/3a-03.c  -O3 -g  compilation failed to produce executable
FAIL: gcc.dg/vmx/3a-03.c  -Os  (test for excess errors)
WARNING: gcc.dg/vmx/3a-03.c  -Os  compilation failed to produce executable
FAIL: gcc.dg/vmx/3a-03m.c  -O0  (test for excess errors)
WARNING: gcc.dg/vmx/3a-03m.c  -O0  compilation failed to produce executable
FAIL: gcc.dg/vmx/3a-03m.c  -O1  (test for excess errors)
WARNING: gcc.dg/vmx/3a-03m.c  -O1  compilation failed to produce executable
FAIL: gcc.dg/vmx/3a-03m.c  -O2  (test for excess errors)
WARNING: gcc.dg/vmx/3a-03m.c  -O2  compilation failed to produce executable
FAIL: gcc.dg/vmx/3a-03m.c  -O3 -fomit-frame-pointer  (test for excess errors)
WARNING: gcc.dg/vmx/3a-03m.c  -O3 -fomit-frame-pointer  compilation failed to produce executable
FAIL: gcc.dg/vmx/3a-03m.c  -O3 -g  (test for excess errors)
WARNING: gcc.dg/vmx/3a-03m.c  -O3 -g  compilation failed to produce executable
FAIL: gcc.dg/vmx/3a-03m.c  -Os  (test for excess errors)
WARNING: gcc.dg/vmx/3a-03m.c  -Os  compilation failed to produce executable
FAIL: gcc.dg/vmx/3a-04.c  -O0  (test for excess errors)
WARNING: gcc.dg/vmx/3a-04.c  -O0  compilation failed to produce executable
FAIL: gcc.dg/vmx/3a-04.c  -O1  (test for excess errors)
WARNING: gcc.dg/vmx/3a-04.c  -O1  compilation failed to produce executable
FAIL: gcc.dg/vmx/3a-04.c  -O2  (test for excess errors)
WARNING: gcc.dg/vmx/3a-04.c  -O2  compilation failed to produce executable
FAIL: gcc.dg/vmx/3a-04.c  -O3 -fomit-frame-pointer  (test for excess errors)
WARNING: gcc.dg/vmx/3a-04.c  -O3 -fomit-frame-pointer  compilation failed to produce executable
FAIL: gcc.dg/vmx/3a-04.c  -O3 -g  (test for excess errors)
WARNING: gcc.dg/vmx/3a-04.c  -O3 -g  compilation failed to produce executable
FAIL: gcc.dg/vmx/3a-04.c  -Os  (test for excess errors)
WARNING: gcc.dg/vmx/3a-04.c  -Os  compilation failed to produce executable
FAIL: gcc.dg/vmx/3a-04m.c  -O0  (test for excess errors)
WARNING: gcc.dg/vmx/3a-04m.c  -O0  compilation failed to produce executable
FAIL: gcc.dg/vmx/3a-04m.c  -O1  (test for excess errors)
WARNING: gcc.dg/vmx/3a-04m.c  -O1  compilation failed to produce executable
FAIL: gcc.dg/vmx/3a-04m.c  -O2  (test for excess errors)
WARNING: gcc.dg/vmx/3a-04m.c  -O2  compilation failed to produce executable
FAIL: gcc.dg/vmx/3a-04m.c  -O3 -fomit-frame-pointer  (test for excess errors)
WARNING: gcc.dg/vmx/3a-04m.c  -O3 -fomit-frame-pointer  compilation failed to produce executable
FAIL: gcc.dg/vmx/3a-04m.c  -O3 -g  (test for excess errors)
WARNING: gcc.dg/vmx/3a-04m.c  -O3 -g  compilation failed to produce executable
FAIL: gcc.dg/vmx/3a-04m.c  -Os  (test for excess errors)
WARNING: gcc.dg/vmx/3a-04m.c  -Os  compilation failed to produce executable
FAIL: gcc.dg/vmx/3a-05.c  -O0  (test for excess errors)
WARNING: gcc.dg/vmx/3a-05.c  -O0  compilation failed to produce executable
FAIL: gcc.dg/vmx/3a-05.c  -O1  (test for excess errors)
WARNING: gcc.dg/vmx/3a-05.c  -O1  compilation failed to produce executable
FAIL: gcc.dg/vmx/3a-05.c  -O2  (test for excess errors)
WARNING: gcc.dg/vmx/3a-05.c  -O2  compilation failed to produce executable
FAIL: gcc.dg/vmx/3a-05.c  -O3 -fomit-frame-pointer  (test for excess errors)
WARNING: gcc.dg/vmx/3a-05.c  -O3 -fomit-frame-pointer  compilation failed to produce executable
FAIL: gcc.dg/vmx/3a-05.c  -O3 -g  (test for excess errors)
WARNING: gcc.dg/vmx/3a-05.c  -O3 -g  compilation failed to produce executable
FAIL: gcc.dg/vmx/3a-05.c  -Os  (test for excess errors)
WARNING: gcc.dg/vmx/3a-05.c  -Os  compilation failed to produce executable
FAIL: gcc.dg/vmx/3a-06.c  -O0  (test for excess errors)
WARNING: gcc.dg/vmx/3a-06.c  -O0  compilation failed to produce executable
FAIL: gcc.dg/vmx/3a-06.c  -O1  (test for excess errors)
WARNING: gcc.dg/vmx/3a-06.c  -O1  compilation failed to produce executable
FAIL: gcc.dg/vmx/3a-06.c  -O2  (test for excess errors)
WARNING: gcc.dg/vmx/3a-06.c  -O2  compilation failed to produce executable
FAIL: gcc.dg/vmx/3a-06.c  -O3 -fomit-frame-pointer  (test for excess errors)
WARNING: gcc.dg/vmx/3a-06.c  -O3 -fomit-frame-pointer  compilation failed to produce executable
FAIL: gcc.dg/vmx/3a-06.c  -O3 -g  (test for excess errors)
WARNING: gcc.dg/vmx/3a-06.c  -O3 -g  compilation failed to produce executable
FAIL: gcc.dg/vmx/3a-06.c  -Os  (test for excess errors)
WARNING: gcc.dg/vmx/3a-06.c  -Os  compilation failed to produce executable
FAIL: gcc.dg/vmx/3a-06m.c  -O0  (test for excess errors)
WARNING: gcc.dg/vmx/3a-06m.c  -O0  compilation failed to produce executable
FAIL: gcc.dg/vmx/3a-06m.c  -O1  (test for excess errors)
WARNING: gcc.dg/vmx/3a-06m.c  -O1  compilation failed to produce executable
FAIL: gcc.dg/vmx/3a-06m.c  -O2  (test for excess errors)
WARNING: gcc.dg/vmx/3a-06m.c  -O2  compilation failed to produce executable
FAIL: gcc.dg/vmx/3a-06m.c  -O3 -fomit-frame-pointer  (test for excess errors)
WARNING: gcc.dg/vmx/3a-06m.c  -O3 -fomit-frame-pointer  compilation failed to produce executable
FAIL: gcc.dg/vmx/3a-06m.c  -O3 -g  (test for excess errors)
WARNING: gcc.dg/vmx/3a-06m.c  -O3 -g  compilation failed to produce executable
FAIL: gcc.dg/vmx/3a-06m.c  -Os  (test for excess errors)
WARNING: gcc.dg/vmx/3a-06m.c  -Os  compilation failed to produce executable
FAIL: gcc.dg/vmx/3a-07.c  -O0  (test for excess errors)
WARNING: gcc.dg/vmx/3a-07.c  -O0  compilation failed to produce executable
FAIL: gcc.dg/vmx/3a-07.c  -O1  (test for excess errors)
WARNING: gcc.dg/vmx/3a-07.c  -O1  compilation failed to produce executable
FAIL: gcc.dg/vmx/3a-07.c  -O2  (test for excess errors)
WARNING: gcc.dg/vmx/3a-07.c  -O2  compilation failed to produce executable
FAIL: gcc.dg/vmx/3a-07.c  -O3 -fomit-frame-pointer  (test for excess errors)
WARNING: gcc.dg/vmx/3a-07.c  -O3 -fomit-frame-pointer  compilation failed to produce executable
FAIL: gcc.dg/vmx/3a-07.c  -O3 -g  (test for excess errors)
WARNING: gcc.dg/vmx/3a-07.c  -O3 -g  compilation failed to produce executable
FAIL: gcc.dg/vmx/3a-07.c  -Os  (test for excess errors)
WARNING: gcc.dg/vmx/3a-07.c  -Os  compilation failed to produce executable
FAIL: gcc.dg/vmx/3b-01.c  -O0  (test for excess errors)
WARNING: gcc.dg/vmx/3b-01.c  -O0  compilation failed to produce executable
FAIL: gcc.dg/vmx/3b-01.c  -O1  (test for excess errors)
WARNING: gcc.dg/vmx/3b-01.c  -O1  compilation failed to produce executable
FAIL: gcc.dg/vmx/3b-01.c  -O2  (test for excess errors)
WARNING: gcc.dg/vmx/3b-01.c  -O2  compilation failed to produce executable
FAIL: gcc.dg/vmx/3b-01.c  -O3 -fomit-frame-pointer  (test for excess errors)
WARNING: gcc.dg/vmx/3b-01.c  -O3 -fomit-frame-pointer  compilation failed to produce executable
FAIL: gcc.dg/vmx/3b-01.c  -O3 -g  (test for excess errors)
WARNING: gcc.dg/vmx/3b-01.c  -O3 -g  compilation failed to produce executable
FAIL: gcc.dg/vmx/3b-01.c  -Os  (test for excess errors)
WARNING: gcc.dg/vmx/3b-01.c  -Os  compilation failed to produce executable
FAIL: gcc.dg/vmx/3b-02.c  -O0  (test for excess errors)
WARNING: gcc.dg/vmx/3b-02.c  -O0  compilation failed to produce executable
FAIL: gcc.dg/vmx/3b-02.c  -O1  (test for excess errors)
WARNING: gcc.dg/vmx/3b-02.c  -O1  compilation failed to produce executable
FAIL: gcc.dg/vmx/3b-02.c  -O2  (test for excess errors)
WARNING: gcc.dg/vmx/3b-02.c  -O2  compilation failed to produce executable
FAIL: gcc.dg/vmx/3b-02.c  -O3 -fomit-frame-pointer  (test for excess errors)
WARNING: gcc.dg/vmx/3b-02.c  -O3 -fomit-frame-pointer  compilation failed to produce executable
FAIL: gcc.dg/vmx/3b-02.c  -O3 -g  (test for excess errors)
WARNING: gcc.dg/vmx/3b-02.c  -O3 -g  compilation failed to produce executable
FAIL: gcc.dg/vmx/3b-02.c  -Os  (test for excess errors)
WARNING: gcc.dg/vmx/3b-02.c  -Os  compilation failed to produce executable
FAIL: gcc.dg/vmx/3b-10.c  -O0  (test for excess errors)
WARNING: gcc.dg/vmx/3b-10.c  -O0  compilation failed to produce executable
FAIL: gcc.dg/vmx/3b-10.c  -O1  (test for excess errors)
WARNING: gcc.dg/vmx/3b-10.c  -O1  compilation failed to produce executable
FAIL: gcc.dg/vmx/3b-10.c  -O2  (test for excess errors)
WARNING: gcc.dg/vmx/3b-10.c  -O2  compilation failed to produce executable
FAIL: gcc.dg/vmx/3b-10.c  -O3 -fomit-frame-pointer  (test for excess errors)
WARNING: gcc.dg/vmx/3b-10.c  -O3 -fomit-frame-pointer  compilation failed to produce executable
FAIL: gcc.dg/vmx/3b-10.c  -O3 -g  (test for excess errors)
WARNING: gcc.dg/vmx/3b-10.c  -O3 -g  compilation failed to produce executable
FAIL: gcc.dg/vmx/3b-10.c  -Os  (test for excess errors)
WARNING: gcc.dg/vmx/3b-10.c  -Os  compilation failed to produce executable
FAIL: gcc.dg/vmx/3b-13.c  -O0  (test for excess errors)
WARNING: gcc.dg/vmx/3b-13.c  -O0  compilation failed to produce executable
FAIL: gcc.dg/vmx/3b-13.c  -O1  (test for excess errors)
WARNING: gcc.dg/vmx/3b-13.c  -O1  compilation failed to produce executable
FAIL: gcc.dg/vmx/3b-13.c  -O2  (test for excess errors)
WARNING: gcc.dg/vmx/3b-13.c  -O2  compilation failed to produce executable
FAIL: gcc.dg/vmx/3b-13.c  -O3 -fomit-frame-pointer  (test for excess errors)
WARNING: gcc.dg/vmx/3b-13.c  -O3 -fomit-frame-pointer  compilation failed to produce executable
FAIL: gcc.dg/vmx/3b-13.c  -O3 -g  (test for excess errors)
WARNING: gcc.dg/vmx/3b-13.c  -O3 -g  compilation failed to produce executable
FAIL: gcc.dg/vmx/3b-13.c  -Os  (test for excess errors)
WARNING: gcc.dg/vmx/3b-13.c  -Os  compilation failed to produce executable
FAIL: gcc.dg/vmx/3b-14.c  -O0  (test for excess errors)
WARNING: gcc.dg/vmx/3b-14.c  -O0  compilation failed to produce executable
FAIL: gcc.dg/vmx/3b-14.c  -O1  (test for excess errors)
WARNING: gcc.dg/vmx/3b-14.c  -O1  compilation failed to produce executable
FAIL: gcc.dg/vmx/3b-14.c  -O2  (test for excess errors)
WARNING: gcc.dg/vmx/3b-14.c  -O2  compilation failed to produce executable
FAIL: gcc.dg/vmx/3b-14.c  -O3 -fomit-frame-pointer  (test for excess errors)
WARNING: gcc.dg/vmx/3b-14.c  -O3 -fomit-frame-pointer  compilation failed to produce executable
FAIL: gcc.dg/vmx/3b-14.c  -O3 -g  (test for excess errors)
WARNING: gcc.dg/vmx/3b-14.c  -O3 -g  compilation failed to produce executable
FAIL: gcc.dg/vmx/3b-14.c  -Os  (test for excess errors)
WARNING: gcc.dg/vmx/3b-14.c  -Os  compilation failed to produce executable
FAIL: gcc.dg/vmx/3b-15.c  -O0  (test for excess errors)
WARNING: gcc.dg/vmx/3b-15.c  -O0  compilation failed to produce executable
FAIL: gcc.dg/vmx/3b-15.c  -O1  (test for excess errors)
WARNING: gcc.dg/vmx/3b-15.c  -O1  compilation failed to produce executable
FAIL: gcc.dg/vmx/3b-15.c  -O2  (test for excess errors)
WARNING: gcc.dg/vmx/3b-15.c  -O2  compilation failed to produce executable
FAIL: gcc.dg/vmx/3b-15.c  -O3 -fomit-frame-pointer  (test for excess errors)
WARNING: gcc.dg/vmx/3b-15.c  -O3 -fomit-frame-pointer  compilation failed to produce executable
FAIL: gcc.dg/vmx/3b-15.c  -O3 -g  (test for excess errors)
WARNING: gcc.dg/vmx/3b-15.c  -O3 -g  compilation failed to produce executable
FAIL: gcc.dg/vmx/3b-15.c  -Os  (test for excess errors)
WARNING: gcc.dg/vmx/3b-15.c  -Os  compilation failed to produce executable
FAIL: gcc.dg/vmx/3c-01.c  -O0  (test for excess errors)
WARNING: gcc.dg/vmx/3c-01.c  -O0  compilation failed to produce executable
FAIL: gcc.dg/vmx/3c-01.c  -O1  (test for excess errors)
WARNING: gcc.dg/vmx/3c-01.c  -O1  compilation failed to produce executable
FAIL: gcc.dg/vmx/3c-01.c  -O2  (test for excess errors)
WARNING: gcc.dg/vmx/3c-01.c  -O2  compilation failed to produce executable
FAIL: gcc.dg/vmx/3c-01.c  -O3 -fomit-frame-pointer  (test for excess errors)
WARNING: gcc.dg/vmx/3c-01.c  -O3 -fomit-frame-pointer  compilation failed to produce executable
FAIL: gcc.dg/vmx/3c-01.c  -O3 -g  (test for excess errors)
WARNING: gcc.dg/vmx/3c-01.c  -O3 -g  compilation failed to produce executable
FAIL: gcc.dg/vmx/3c-01.c  -Os  (test for excess errors)
WARNING: gcc.dg/vmx/3c-01.c  -Os  compilation failed to produce executable
FAIL: gcc.dg/vmx/3c-01a.c  -O0  (test for excess errors)
FAIL: gcc.dg/vmx/3c-01a.c  -O1  (test for excess errors)
FAIL: gcc.dg/vmx/3c-01a.c  -O2  (test for excess errors)
FAIL: gcc.dg/vmx/3c-01a.c  -O3 -fomit-frame-pointer  (test for excess errors)
FAIL: gcc.dg/vmx/3c-01a.c  -O3 -g  (test for excess errors)
FAIL: gcc.dg/vmx/3c-01a.c  -Os  (test for excess errors)
FAIL: gcc.dg/vmx/3c-02.c  -O0  (test for excess errors)
WARNING: gcc.dg/vmx/3c-02.c  -O0  compilation failed to produce executable
FAIL: gcc.dg/vmx/3c-02.c  -O1  (test for excess errors)
WARNING: gcc.dg/vmx/3c-02.c  -O1  compilation failed to produce executable
FAIL: gcc.dg/vmx/3c-02.c  -O2  (test for excess errors)
WARNING: gcc.dg/vmx/3c-02.c  -O2  compilation failed to produce executable
FAIL: gcc.dg/vmx/3c-02.c  -O3 -fomit-frame-pointer  (test for excess errors)
WARNING: gcc.dg/vmx/3c-02.c  -O3 -fomit-frame-pointer  compilation failed to produce executable
FAIL: gcc.dg/vmx/3c-02.c  -O3 -g  (test for excess errors)
WARNING: gcc.dg/vmx/3c-02.c  -O3 -g  compilation failed to produce executable
FAIL: gcc.dg/vmx/3c-02.c  -Os  (test for excess errors)
WARNING: gcc.dg/vmx/3c-02.c  -Os  compilation failed to produce executable
FAIL: gcc.dg/vmx/3c-03.c  -O0  (test for excess errors)
WARNING: gcc.dg/vmx/3c-03.c  -O0  compilation failed to produce executable
FAIL: gcc.dg/vmx/3c-03.c  -O1  (test for excess errors)
WARNING: gcc.dg/vmx/3c-03.c  -O1  compilation failed to produce executable
FAIL: gcc.dg/vmx/3c-03.c  -O2  (test for excess errors)
WARNING: gcc.dg/vmx/3c-03.c  -O2  compilation failed to produce executable
FAIL: gcc.dg/vmx/3c-03.c  -O3 -fomit-frame-pointer  (test for excess errors)
WARNING: gcc.dg/vmx/3c-03.c  -O3 -fomit-frame-pointer  compilation failed to produce executable
FAIL: gcc.dg/vmx/3c-03.c  -O3 -g  (test for excess errors)
WARNING: gcc.dg/vmx/3c-03.c  -O3 -g  compilation failed to produce executable
FAIL: gcc.dg/vmx/3c-03.c  -Os  (test for excess errors)
WARNING: gcc.dg/vmx/3c-03.c  -Os  compilation failed to produce executable
FAIL: gcc.dg/vmx/3d-01.c  -O0  (test for excess errors)
FAIL: gcc.dg/vmx/4-01.c  -O0  (test for excess errors)
FAIL: gcc.dg/vmx/4-03.c  -O0  (test for excess errors)
FAIL: gcc.dg/vmx/5-04.c  -O0  (test for excess errors)
FAIL: gcc.dg/vmx/5-04.c  -O1  (test for excess errors)
FAIL: gcc.dg/vmx/5-04.c  -O2  (test for excess errors)
FAIL: gcc.dg/vmx/5-04.c  -O3 -fomit-frame-pointer  (test for excess errors)
FAIL: gcc.dg/vmx/5-04.c  -O3 -g  (test for excess errors)
FAIL: gcc.dg/vmx/5-04.c  -Os  (test for excess errors)
FAIL: gcc.dg/vmx/5-10.c  -O0  (test for excess errors)
FAIL: gcc.dg/vmx/5-10.c  -O1  (test for excess errors)
FAIL: gcc.dg/vmx/5-10.c  -O2  (test for excess errors)
FAIL: gcc.dg/vmx/5-10.c  -O3 -fomit-frame-pointer  (test for excess errors)
FAIL: gcc.dg/vmx/5-10.c  -O3 -g  (test for excess errors)
FAIL: gcc.dg/vmx/5-10.c  -Os  (test for excess errors)
FAIL: gcc.dg/vmx/5-11.c  -O0  (test for excess errors)
FAIL: gcc.dg/vmx/7-01.c  -O0  (test for excess errors)
FAIL: gcc.dg/vmx/7-01.c  -O1  (test for excess errors)
FAIL: gcc.dg/vmx/7-01.c  -O2  (test for excess errors)
FAIL: gcc.dg/vmx/7-01.c  -O3 -fomit-frame-pointer  (test for excess errors)
FAIL: gcc.dg/vmx/7-01.c  -O3 -fomit-frame-pointer -funroll-loops  (test for excess errors)
FAIL: gcc.dg/vmx/7-01.c  -O3 -fomit-frame-pointer -funroll-all-loops -finline-functions  (test for excess errors)
FAIL: gcc.dg/vmx/7-01.c  -O3 -g  (test for excess errors)
FAIL: gcc.dg/vmx/7-01.c  -Os  (test for excess errors)
FAIL: gcc.dg/vmx/7-01a.c  -O0  (test for excess errors)
FAIL: gcc.dg/vmx/7-01a.c  -O1  (test for excess errors)
FAIL: gcc.dg/vmx/7-01a.c  -O2  (test for excess errors)
FAIL: gcc.dg/vmx/7-01a.c  -O3 -fomit-frame-pointer  (test for excess errors)
FAIL: gcc.dg/vmx/7-01a.c  -O3 -fomit-frame-pointer -funroll-loops  (test for excess errors)
FAIL: gcc.dg/vmx/7-01a.c  -O3 -fomit-frame-pointer -funroll-all-loops -finline-functions  (test for excess errors)
FAIL: gcc.dg/vmx/7-01a.c  -O3 -g  (test for excess errors)
FAIL: gcc.dg/vmx/7-01a.c  -Os  (test for excess errors)
FAIL: gcc.dg/vmx/7c-01.c  -O0  (test for excess errors)
FAIL: gcc.dg/vmx/7c-01.c  -O1  (test for excess errors)
FAIL: gcc.dg/vmx/7c-01.c  -O2  (test for excess errors)
FAIL: gcc.dg/vmx/7c-01.c  -O3 -fomit-frame-pointer  (test for excess errors)
FAIL: gcc.dg/vmx/7c-01.c  -O3 -g  (test for excess errors)
FAIL: gcc.dg/vmx/7c-01.c  -Os  (test for excess errors)
FAIL: gcc.dg/vmx/7d-01.c  -O0  (test for excess errors)
FAIL: gcc.dg/vmx/7d-02.c  -O0  (test for excess errors)
FAIL: gcc.dg/vmx/brode-1.c  -O0  (test for excess errors)
WARNING: gcc.dg/vmx/brode-1.c  -O0  compilation failed to produce executable
FAIL: gcc.dg/vmx/brode-1.c  -O1  (test for excess errors)
WARNING: gcc.dg/vmx/brode-1.c  -O1  compilation failed to produce executable
FAIL: gcc.dg/vmx/brode-1.c  -O2  (test for excess errors)
WARNING: gcc.dg/vmx/brode-1.c  -O2  compilation failed to produce executable
FAIL: gcc.dg/vmx/brode-1.c  -O3 -fomit-frame-pointer  (test for excess errors)
WARNING: gcc.dg/vmx/brode-1.c  -O3 -fomit-frame-pointer  compilation failed to produce executable
FAIL: gcc.dg/vmx/brode-1.c  -O3 -g  (test for excess errors)
WARNING: gcc.dg/vmx/brode-1.c  -O3 -g  compilation failed to produce executable
FAIL: gcc.dg/vmx/brode-1.c  -Os  (test for excess errors)
WARNING: gcc.dg/vmx/brode-1.c  -Os  compilation failed to produce executable
FAIL: gcc.dg/vmx/bug-1.c  -O0  (test for excess errors)
WARNING: gcc.dg/vmx/bug-1.c  -O0  compilation failed to produce executable
FAIL: gcc.dg/vmx/bug-1.c  -O1  (test for excess errors)
WARNING: gcc.dg/vmx/bug-1.c  -O1  compilation failed to produce executable
FAIL: gcc.dg/vmx/bug-1.c  -O2  (test for excess errors)
WARNING: gcc.dg/vmx/bug-1.c  -O2  compilation failed to produce executable
FAIL: gcc.dg/vmx/bug-1.c  -O3 -fomit-frame-pointer  (test for excess errors)
WARNING: gcc.dg/vmx/bug-1.c  -O3 -fomit-frame-pointer  compilation failed to produce executable
FAIL: gcc.dg/vmx/bug-1.c  -O3 -fomit-frame-pointer -funroll-loops  (test for excess errors)
WARNING: gcc.dg/vmx/bug-1.c  -O3 -fomit-frame-pointer -funroll-loops  compilation failed to produce executable
FAIL: gcc.dg/vmx/bug-1.c  -O3 -fomit-frame-pointer -funroll-all-loops -finline-functions  (test for excess errors)
WARNING: gcc.dg/vmx/bug-1.c  -O3 -fomit-frame-pointer -funroll-all-loops -finline-functions  compilation failed to produce executable
FAIL: gcc.dg/vmx/bug-1.c  -O3 -g  (test for excess errors)
WARNING: gcc.dg/vmx/bug-1.c  -O3 -g  compilation failed to produce executable
FAIL: gcc.dg/vmx/bug-1.c  -Os  (test for excess errors)
WARNING: gcc.dg/vmx/bug-1.c  -Os  compilation failed to produce executable
FAIL: gcc.dg/vmx/bug-2.c  -O0  (test for excess errors)
WARNING: gcc.dg/vmx/bug-2.c  -O0  compilation failed to produce executable
FAIL: gcc.dg/vmx/bug-2.c  -O1  (test for excess errors)
WARNING: gcc.dg/vmx/bug-2.c  -O1  compilation failed to produce executable
FAIL: gcc.dg/vmx/bug-2.c  -O2  (test for excess errors)
WARNING: gcc.dg/vmx/bug-2.c  -O2  compilation failed to produce executable
FAIL: gcc.dg/vmx/bug-2.c  -O3 -fomit-frame-pointer  (test for excess errors)
WARNING: gcc.dg/vmx/bug-2.c  -O3 -fomit-frame-pointer  compilation failed to produce executable
FAIL: gcc.dg/vmx/bug-2.c  -O3 -g  (test for excess errors)
WARNING: gcc.dg/vmx/bug-2.c  -O3 -g  compilation failed to produce executable
FAIL: gcc.dg/vmx/bug-2.c  -Os  (test for excess errors)
WARNING: gcc.dg/vmx/bug-2.c  -Os  compilation failed to produce executable
FAIL: gcc.dg/vmx/bug-3.c  -O0  (test for excess errors)
WARNING: gcc.dg/vmx/bug-3.c  -O0  compilation failed to produce executable
FAIL: gcc.dg/vmx/bug-3.c  -O1  (test for excess errors)
WARNING: gcc.dg/vmx/bug-3.c  -O1  compilation failed to produce executable
FAIL: gcc.dg/vmx/bug-3.c  -O2  (test for excess errors)
WARNING: gcc.dg/vmx/bug-3.c  -O2  compilation failed to produce executable
FAIL: gcc.dg/vmx/bug-3.c  -O3 -fomit-frame-pointer  (test for excess errors)
WARNING: gcc.dg/vmx/bug-3.c  -O3 -fomit-frame-pointer  compilation failed to produce executable
FAIL: gcc.dg/vmx/bug-3.c  -O3 -g  (test for excess errors)
WARNING: gcc.dg/vmx/bug-3.c  -O3 -g  compilation failed to produce executable
FAIL: gcc.dg/vmx/bug-3.c  -Os  (test for excess errors)
WARNING: gcc.dg/vmx/bug-3.c  -Os  compilation failed to produce executable
FAIL: gcc.dg/vmx/cw-bug-1.c  -O0  (test for excess errors)
WARNING: gcc.dg/vmx/cw-bug-1.c  -O0  compilation failed to produce executable
FAIL: gcc.dg/vmx/cw-bug-1.c  -O1  (test for excess errors)
WARNING: gcc.dg/vmx/cw-bug-1.c  -O1  compilation failed to produce executable
FAIL: gcc.dg/vmx/cw-bug-1.c  -O2  (test for excess errors)
WARNING: gcc.dg/vmx/cw-bug-1.c  -O2  compilation failed to produce executable
FAIL: gcc.dg/vmx/cw-bug-1.c  -O3 -fomit-frame-pointer  (test for excess errors)
WARNING: gcc.dg/vmx/cw-bug-1.c  -O3 -fomit-frame-pointer  compilation failed to produce executable
FAIL: gcc.dg/vmx/cw-bug-1.c  -O3 -g  (test for excess errors)
WARNING: gcc.dg/vmx/cw-bug-1.c  -O3 -g  compilation failed to produce executable
FAIL: gcc.dg/vmx/cw-bug-1.c  -Os  (test for excess errors)
WARNING: gcc.dg/vmx/cw-bug-1.c  -Os  compilation failed to produce executable
FAIL: gcc.dg/vmx/dct.c  -O0  (test for excess errors)
FAIL: gcc.dg/vmx/dct.c  -O1  (test for excess errors)
FAIL: gcc.dg/vmx/dct.c  -O2  (test for excess errors)
FAIL: gcc.dg/vmx/dct.c  -O3 -fomit-frame-pointer  (test for excess errors)
FAIL: gcc.dg/vmx/dct.c  -O3 -g  (test for excess errors)
FAIL: gcc.dg/vmx/dct.c  -Os  (test for excess errors)
FAIL: gcc.dg/vmx/debug-3.c  -O0  (test for excess errors)
WARNING: gcc.dg/vmx/debug-3.c  -O0  compilation failed to produce executable
FAIL: gcc.dg/vmx/debug-3.c  -O1  (test for excess errors)
WARNING: gcc.dg/vmx/debug-3.c  -O1  compilation failed to produce executable
FAIL: gcc.dg/vmx/debug-3.c  -O2  (test for excess errors)
WARNING: gcc.dg/vmx/debug-3.c  -O2  compilation failed to produce executable
FAIL: gcc.dg/vmx/debug-3.c  -O3 -fomit-frame-pointer  (test for excess errors)
WARNING: gcc.dg/vmx/debug-3.c  -O3 -fomit-frame-pointer  compilation failed to produce executable
FAIL: gcc.dg/vmx/debug-3.c  -O3 -g  (test for excess errors)
WARNING: gcc.dg/vmx/debug-3.c  -O3 -g  compilation failed to produce executable
FAIL: gcc.dg/vmx/debug-3.c  -Os  (test for excess errors)
WARNING: gcc.dg/vmx/debug-3.c  -Os  compilation failed to produce executable
FAIL: gcc.dg/vmx/debug-4.c  -O0  (test for excess errors)
WARNING: gcc.dg/vmx/debug-4.c  -O0  compilation failed to produce executable
FAIL: gcc.dg/vmx/debug-4.c  -O1  (test for excess errors)
WARNING: gcc.dg/vmx/debug-4.c  -O1  compilation failed to produce executable
FAIL: gcc.dg/vmx/debug-4.c  -O2  (test for excess errors)
WARNING: gcc.dg/vmx/debug-4.c  -O2  compilation failed to produce executable
FAIL: gcc.dg/vmx/debug-4.c  -O3 -fomit-frame-pointer  (test for excess errors)
WARNING: gcc.dg/vmx/debug-4.c  -O3 -fomit-frame-pointer  compilation failed to produce executable
FAIL: gcc.dg/vmx/debug-4.c  -O3 -g  (test for excess errors)
WARNING: gcc.dg/vmx/debug-4.c  -O3 -g  compilation failed to produce executable
FAIL: gcc.dg/vmx/debug-4.c  -Os  (test for excess errors)
WARNING: gcc.dg/vmx/debug-4.c  -Os  compilation failed to produce executable
FAIL: gcc.dg/vmx/dos-bug-1-gdb.c  -O0  (test for excess errors)
WARNING: gcc.dg/vmx/dos-bug-1-gdb.c  -O0  compilation failed to produce executable
FAIL: gcc.dg/vmx/dos-bug-2-gdb.c  -O0  (test for excess errors)
WARNING: gcc.dg/vmx/dos-bug-2-gdb.c  -O0  compilation failed to produce executable
FAIL: gcc.dg/vmx/eg-5.c  -O0  (test for excess errors)
WARNING: gcc.dg/vmx/eg-5.c  -O0  compilation failed to produce executable
FAIL: gcc.dg/vmx/eg-5.c  -O1  (test for excess errors)
WARNING: gcc.dg/vmx/eg-5.c  -O1  compilation failed to produce executable
FAIL: gcc.dg/vmx/eg-5.c  -O2  (test for excess errors)
WARNING: gcc.dg/vmx/eg-5.c  -O2  compilation failed to produce executable
FAIL: gcc.dg/vmx/eg-5.c  -O3 -fomit-frame-pointer  (test for excess errors)
WARNING: gcc.dg/vmx/eg-5.c  -O3 -fomit-frame-pointer  compilation failed to produce executable
FAIL: gcc.dg/vmx/eg-5.c  -O3 -g  (test for excess errors)
WARNING: gcc.dg/vmx/eg-5.c  -O3 -g  compilation failed to produce executable
FAIL: gcc.dg/vmx/eg-5.c  -Os  (test for excess errors)
WARNING: gcc.dg/vmx/eg-5.c  -Os  compilation failed to produce executable
FAIL: gcc.dg/vmx/fft.c  -O0  (test for excess errors)
FAIL: gcc.dg/vmx/fft.c  -O1  (test for excess errors)
FAIL: gcc.dg/vmx/fft.c  -O2  (test for excess errors)
FAIL: gcc.dg/vmx/fft.c  -O3 -fomit-frame-pointer  (test for excess errors)
FAIL: gcc.dg/vmx/fft.c  -O3 -fomit-frame-pointer -funroll-loops  (test for excess errors)
FAIL: gcc.dg/vmx/fft.c  -O3 -fomit-frame-pointer -funroll-all-loops -finline-functions  (test for excess errors)
FAIL: gcc.dg/vmx/fft.c  -O3 -g  (test for excess errors)
FAIL: gcc.dg/vmx/fft.c  -Os  (test for excess errors)
FAIL: gcc.dg/vmx/gcc-bug-1.c  -O0  (test for excess errors)
FAIL: gcc.dg/vmx/gcc-bug-1.c  -O1  (test for excess errors)
FAIL: gcc.dg/vmx/gcc-bug-1.c  -O2  (test for excess errors)
FAIL: gcc.dg/vmx/gcc-bug-1.c  -O3 -fomit-frame-pointer  (test for excess errors)
FAIL: gcc.dg/vmx/gcc-bug-1.c  -O3 -g  (test for excess errors)
FAIL: gcc.dg/vmx/gcc-bug-1.c  -Os  (test for excess errors)
FAIL: gcc.dg/vmx/gcc-bug-3.c  -O0  (test for excess errors)
FAIL: gcc.dg/vmx/gcc-bug-5.c  -O0  (test for excess errors)
FAIL: gcc.dg/vmx/gcc-bug-6.c  -O0  (test for excess errors)
FAIL: gcc.dg/vmx/gcc-bug-7.c  -O0  (test for excess errors)
FAIL: gcc.dg/vmx/gcc-bug-7.c  -O1  (test for excess errors)
FAIL: gcc.dg/vmx/gcc-bug-7.c  -O2  (test for excess errors)
FAIL: gcc.dg/vmx/gcc-bug-7.c  -O3 -fomit-frame-pointer  (test for excess errors)
FAIL: gcc.dg/vmx/gcc-bug-7.c  -O3 -g  (test for excess errors)
FAIL: gcc.dg/vmx/gcc-bug-7.c  -Os  (test for excess errors)
FAIL: gcc.dg/vmx/gcc-bug-b.c  -O0  (test for excess errors)
FAIL: gcc.dg/vmx/gcc-bug-b.c  -O1  (test for excess errors)
FAIL: gcc.dg/vmx/gcc-bug-b.c  -O2  (test for excess errors)
FAIL: gcc.dg/vmx/gcc-bug-b.c  -O3 -fomit-frame-pointer  (test for excess errors)
FAIL: gcc.dg/vmx/gcc-bug-b.c  -O3 -g  (test for excess errors)
FAIL: gcc.dg/vmx/gcc-bug-b.c  -Os  (test for excess errors)
FAIL: gcc.dg/vmx/gcc-bug-c.c  -O0  (test for excess errors)
FAIL: gcc.dg/vmx/gcc-bug-c.c  -O1  (test for excess errors)
FAIL: gcc.dg/vmx/gcc-bug-c.c  -O2  (test for excess errors)
FAIL: gcc.dg/vmx/gcc-bug-c.c  -O3 -fomit-frame-pointer  (test for excess errors)
FAIL: gcc.dg/vmx/gcc-bug-c.c  -O3 -g  (test for excess errors)
FAIL: gcc.dg/vmx/gcc-bug-c.c  -Os  (test for excess errors)
FAIL: gcc.dg/vmx/gcc-bug-d.c  -O0  (test for excess errors)
FAIL: gcc.dg/vmx/gcc-bug-d.c  -O1  (test for excess errors)
FAIL: gcc.dg/vmx/gcc-bug-d.c  -O2  (test for excess errors)
FAIL: gcc.dg/vmx/gcc-bug-d.c  -O3 -fomit-frame-pointer  (test for excess errors)
FAIL: gcc.dg/vmx/gcc-bug-d.c  -O3 -g  (test for excess errors)
FAIL: gcc.dg/vmx/gcc-bug-d.c  -Os  (test for excess errors)
FAIL: gcc.dg/vmx/gcc-bug-e.c  -O0  (test for excess errors)
WARNING: gcc.dg/vmx/gcc-bug-e.c  -O0  compilation failed to produce executable
FAIL: gcc.dg/vmx/gcc-bug-e.c  -O1  (test for excess errors)
WARNING: gcc.dg/vmx/gcc-bug-e.c  -O1  compilation failed to produce executable
FAIL: gcc.dg/vmx/gcc-bug-e.c  -O2  (test for excess errors)
WARNING: gcc.dg/vmx/gcc-bug-e.c  -O2  compilation failed to produce executable
FAIL: gcc.dg/vmx/gcc-bug-e.c  -O3 -fomit-frame-pointer  (test for excess errors)
WARNING: gcc.dg/vmx/gcc-bug-e.c  -O3 -fomit-frame-pointer  compilation failed to produce executable
FAIL: gcc.dg/vmx/gcc-bug-e.c  -O3 -g  (test for excess errors)
WARNING: gcc.dg/vmx/gcc-bug-e.c  -O3 -g  compilation failed to produce executable
FAIL: gcc.dg/vmx/gcc-bug-e.c  -Os  (test for excess errors)
WARNING: gcc.dg/vmx/gcc-bug-e.c  -Os  compilation failed to produce executable
FAIL: gcc.dg/vmx/gcc-bug-f.c  -O0  (test for excess errors)
FAIL: gcc.dg/vmx/gcc-bug-f.c  -O1  (test for excess errors)
FAIL: gcc.dg/vmx/gcc-bug-f.c  -O2  (test for excess errors)
FAIL: gcc.dg/vmx/gcc-bug-f.c  -O3 -fomit-frame-pointer  (test for excess errors)
FAIL: gcc.dg/vmx/gcc-bug-f.c  -O3 -g  (test for excess errors)
FAIL: gcc.dg/vmx/gcc-bug-f.c  -Os  (test for excess errors)
FAIL: gcc.dg/vmx/gcc-bug-g.c  -O0  (test for excess errors)
FAIL: gcc.dg/vmx/gcc-bug-g.c  -O1  (test for excess errors)
FAIL: gcc.dg/vmx/gcc-bug-g.c  -O2  (test for excess errors)
FAIL: gcc.dg/vmx/gcc-bug-g.c  -O3 -fomit-frame-pointer  (test for excess errors)
FAIL: gcc.dg/vmx/gcc-bug-g.c  -O3 -g  (test for excess errors)
FAIL: gcc.dg/vmx/gcc-bug-g.c  -Os  (test for excess errors)
FAIL: gcc.dg/vmx/gcc-bug-i.c  -O0  (test for excess errors)
WARNING: gcc.dg/vmx/gcc-bug-i.c  -O0  compilation failed to produce executable
FAIL: gcc.dg/vmx/gcc-bug-i.c  -O1  (test for excess errors)
WARNING: gcc.dg/vmx/gcc-bug-i.c  -O1  compilation failed to produce executable
FAIL: gcc.dg/vmx/gcc-bug-i.c  -O2  (test for excess errors)
WARNING: gcc.dg/vmx/gcc-bug-i.c  -O2  compilation failed to produce executable
FAIL: gcc.dg/vmx/gcc-bug-i.c  -O3 -fomit-frame-pointer  (test for excess errors)
WARNING: gcc.dg/vmx/gcc-bug-i.c  -O3 -fomit-frame-pointer  compilation failed to produce executable
FAIL: gcc.dg/vmx/gcc-bug-i.c  -O3 -fomit-frame-pointer -funroll-loops  (test for excess errors)
WARNING: gcc.dg/vmx/gcc-bug-i.c  -O3 -fomit-frame-pointer -funroll-loops  compilation failed to produce executable
FAIL: gcc.dg/vmx/gcc-bug-i.c  -O3 -fomit-frame-pointer -funroll-all-loops -finline-functions  (test for excess errors)
WARNING: gcc.dg/vmx/gcc-bug-i.c  -O3 -fomit-frame-pointer -funroll-all-loops -finline-functions  compilation failed to produce executable
FAIL: gcc.dg/vmx/gcc-bug-i.c  -O3 -g  (test for excess errors)
WARNING: gcc.dg/vmx/gcc-bug-i.c  -O3 -g  compilation failed to produce executable
FAIL: gcc.dg/vmx/gcc-bug-i.c  -Os  (test for excess errors)
WARNING: gcc.dg/vmx/gcc-bug-i.c  -Os  compilation failed to produce executable
FAIL: gcc.dg/vmx/ira1.c  -O0  (test for excess errors)
WARNING: gcc.dg/vmx/ira1.c  -O0  compilation failed to produce executable
FAIL: gcc.dg/vmx/ira1.c  -O1  (test for excess errors)
WARNING: gcc.dg/vmx/ira1.c  -O1  compilation failed to produce executable
FAIL: gcc.dg/vmx/ira1.c  -O2  (test for excess errors)
WARNING: gcc.dg/vmx/ira1.c  -O2  compilation failed to produce executable
FAIL: gcc.dg/vmx/ira1.c  -O3 -fomit-frame-pointer  (test for excess errors)
WARNING: gcc.dg/vmx/ira1.c  -O3 -fomit-frame-pointer  compilation failed to produce executable
FAIL: gcc.dg/vmx/ira1.c  -O3 -g  (test for excess errors)
WARNING: gcc.dg/vmx/ira1.c  -O3 -g  compilation failed to produce executable
FAIL: gcc.dg/vmx/ira1.c  -Os  (test for excess errors)
WARNING: gcc.dg/vmx/ira1.c  -Os  compilation failed to produce executable
FAIL: gcc.dg/vmx/ira2.c  -O0  (test for excess errors)
FAIL: gcc.dg/vmx/ira2.c  -O1  (test for excess errors)
FAIL: gcc.dg/vmx/ira2.c  -O2  (test for excess errors)
FAIL: gcc.dg/vmx/ira2.c  -O3 -fomit-frame-pointer  (test for excess errors)
FAIL: gcc.dg/vmx/ira2.c  -O3 -g  (test for excess errors)
FAIL: gcc.dg/vmx/ira2.c  -Os  (test for excess errors)
FAIL: gcc.dg/vmx/ira2b.c  -O0  (test for excess errors)
WARNING: gcc.dg/vmx/ira2b.c  -O0  compilation failed to produce executable
FAIL: gcc.dg/vmx/ira2b.c  -O1  (test for excess errors)
WARNING: gcc.dg/vmx/ira2b.c  -O1  compilation failed to produce executable
FAIL: gcc.dg/vmx/ira2b.c  -O2  (test for excess errors)
WARNING: gcc.dg/vmx/ira2b.c  -O2  compilation failed to produce executable
FAIL: gcc.dg/vmx/ira2b.c  -O3 -fomit-frame-pointer  (test for excess errors)
WARNING: gcc.dg/vmx/ira2b.c  -O3 -fomit-frame-pointer  compilation failed to produce executable
FAIL: gcc.dg/vmx/ira2b.c  -O3 -g  (test for excess errors)
WARNING: gcc.dg/vmx/ira2b.c  -O3 -g  compilation failed to produce executable
FAIL: gcc.dg/vmx/ira2b.c  -Os  (test for excess errors)
WARNING: gcc.dg/vmx/ira2b.c  -Os  compilation failed to produce executable
FAIL: gcc.dg/vmx/mem.c  -O0  (test for excess errors)
FAIL: gcc.dg/vmx/mem.c  -O1  (test for excess errors)
FAIL: gcc.dg/vmx/mem.c  -O2  (test for excess errors)
FAIL: gcc.dg/vmx/mem.c  -O3 -fomit-frame-pointer  (test for excess errors)
FAIL: gcc.dg/vmx/mem.c  -O3 -fomit-frame-pointer -funroll-loops  (test for excess errors)
FAIL: gcc.dg/vmx/mem.c  -O3 -fomit-frame-pointer -funroll-all-loops -finline-functions  (test for excess errors)
FAIL: gcc.dg/vmx/mem.c  -O3 -g  (test for excess errors)
FAIL: gcc.dg/vmx/mem.c  -Os  (test for excess errors)
FAIL: gcc.dg/vmx/newton-1.c  -O0  (test for excess errors)
FAIL: gcc.dg/vmx/newton-1.c  -O1  (test for excess errors)
FAIL: gcc.dg/vmx/newton-1.c  -O2  (test for excess errors)
FAIL: gcc.dg/vmx/newton-1.c  -O3 -fomit-frame-pointer  (test for excess errors)
FAIL: gcc.dg/vmx/newton-1.c  -O3 -fomit-frame-pointer -funroll-loops  (test for excess errors)
FAIL: gcc.dg/vmx/newton-1.c  -O3 -fomit-frame-pointer -funroll-all-loops -finline-functions  (test for excess errors)
FAIL: gcc.dg/vmx/newton-1.c  -O3 -g  (test for excess errors)
FAIL: gcc.dg/vmx/newton-1.c  -Os  (test for excess errors)
FAIL: gcc.dg/vmx/ops-long-1.c  -O0  (test for excess errors)
FAIL: gcc.dg/vmx/ops-long-1.c  -O1  (test for excess errors)
FAIL: gcc.dg/vmx/ops-long-1.c  -O2  (test for excess errors)
FAIL: gcc.dg/vmx/ops-long-1.c  -O3 -fomit-frame-pointer  (test for excess errors)
FAIL: gcc.dg/vmx/ops-long-1.c  -O3 -g  (test for excess errors)
FAIL: gcc.dg/vmx/ops-long-1.c  -Os  (test for excess errors)
FAIL: gcc.dg/vmx/ops.c  -O0  (test for excess errors)
FAIL: gcc.dg/vmx/ops.c  -O1  (test for excess errors)
FAIL: gcc.dg/vmx/ops.c  -O2  (test for excess errors)
FAIL: gcc.dg/vmx/ops.c  -O3 -fomit-frame-pointer  (test for excess errors)
FAIL: gcc.dg/vmx/ops.c  -O3 -g  (test for excess errors)
FAIL: gcc.dg/vmx/ops.c  -Os  (test for excess errors)
FAIL: gcc.dg/vmx/sn7153.c  -O0  (test for excess errors)
WARNING: gcc.dg/vmx/sn7153.c  -O0  compilation failed to produce executable
FAIL: gcc.dg/vmx/sn7153.c  -O1  (test for excess errors)
WARNING: gcc.dg/vmx/sn7153.c  -O1  compilation failed to produce executable
FAIL: gcc.dg/vmx/sn7153.c  -O2  (test for excess errors)
WARNING: gcc.dg/vmx/sn7153.c  -O2  compilation failed to produce executable
FAIL: gcc.dg/vmx/sn7153.c  -O3 -fomit-frame-pointer  (test for excess errors)
WARNING: gcc.dg/vmx/sn7153.c  -O3 -fomit-frame-pointer  compilation failed to produce executable
FAIL: gcc.dg/vmx/sn7153.c  -O3 -fomit-frame-pointer -funroll-loops  (test for excess errors)
WARNING: gcc.dg/vmx/sn7153.c  -O3 -fomit-frame-pointer -funroll-loops  compilation failed to produce executable
FAIL: gcc.dg/vmx/sn7153.c  -O3 -fomit-frame-pointer -funroll-all-loops -finline-functions  (test for excess errors)
WARNING: gcc.dg/vmx/sn7153.c  -O3 -fomit-frame-pointer -funroll-all-loops -finline-functions  compilation failed to produce executable
FAIL: gcc.dg/vmx/sn7153.c  -O3 -g  (test for excess errors)
WARNING: gcc.dg/vmx/sn7153.c  -O3 -g  compilation failed to produce executable
FAIL: gcc.dg/vmx/sn7153.c  -Os  (test for excess errors)
WARNING: gcc.dg/vmx/sn7153.c  -Os  compilation failed to produce executable
FAIL: gcc.dg/vmx/spill.c  -O0  (test for excess errors)
WARNING: gcc.dg/vmx/spill.c  -O0  compilation failed to produce executable
FAIL: gcc.dg/vmx/spill2.c  -O0  (test for excess errors)
WARNING: gcc.dg/vmx/spill2.c  -O0  compilation failed to produce executable
FAIL: gcc.dg/vmx/spill3.c  -O0  (test for excess errors)
WARNING: gcc.dg/vmx/spill3.c  -O0  compilation failed to produce executable
FAIL: gcc.dg/vmx/varargs-1.c  -O0  (test for excess errors)
WARNING: gcc.dg/vmx/varargs-1.c  -O0  compilation failed to produce executable
FAIL: gcc.dg/vmx/varargs-1.c  -O1  (test for excess errors)
WARNING: gcc.dg/vmx/varargs-1.c  -O1  compilation failed to produce executable
FAIL: gcc.dg/vmx/varargs-1.c  -O2  (test for excess errors)
WARNING: gcc.dg/vmx/varargs-1.c  -O2  compilation failed to produce executable
FAIL: gcc.dg/vmx/varargs-1.c  -O3 -fomit-frame-pointer  (test for excess errors)
WARNING: gcc.dg/vmx/varargs-1.c  -O3 -fomit-frame-pointer  compilation failed to produce executable
FAIL: gcc.dg/vmx/varargs-1.c  -O3 -fomit-frame-pointer -funroll-loops  (test for excess errors)
WARNING: gcc.dg/vmx/varargs-1.c  -O3 -fomit-frame-pointer -funroll-loops  compilation failed to produce executable
FAIL: gcc.dg/vmx/varargs-1.c  -O3 -fomit-frame-pointer -funroll-all-loops -finline-functions  (test for excess errors)
WARNING: gcc.dg/vmx/varargs-1.c  -O3 -fomit-frame-pointer -funroll-all-loops -finline-functions  compilation failed to produce executable
FAIL: gcc.dg/vmx/varargs-1.c  -O3 -g  (test for excess errors)
WARNING: gcc.dg/vmx/varargs-1.c  -O3 -g  compilation failed to produce executable
FAIL: gcc.dg/vmx/varargs-1.c  -Os  (test for excess errors)
WARNING: gcc.dg/vmx/varargs-1.c  -Os  compilation failed to produce executable
FAIL: gcc.dg/vmx/varargs-2.c  -O0  (test for excess errors)
WARNING: gcc.dg/vmx/varargs-2.c  -O0  compilation failed to produce executable
FAIL: gcc.dg/vmx/varargs-2.c  -O1  (test for excess errors)
WARNING: gcc.dg/vmx/varargs-2.c  -O1  compilation failed to produce executable
FAIL: gcc.dg/vmx/varargs-2.c  -O2  (test for excess errors)
WARNING: gcc.dg/vmx/varargs-2.c  -O2  compilation failed to produce executable
FAIL: gcc.dg/vmx/varargs-2.c  -O3 -fomit-frame-pointer  (test for excess errors)
WARNING: gcc.dg/vmx/varargs-2.c  -O3 -fomit-frame-pointer  compilation failed to produce executable
FAIL: gcc.dg/vmx/varargs-2.c  -O3 -g  (test for excess errors)
WARNING: gcc.dg/vmx/varargs-2.c  -O3 -g  compilation failed to produce executable
FAIL: gcc.dg/vmx/varargs-2.c  -Os  (test for excess errors)
WARNING: gcc.dg/vmx/varargs-2.c  -Os  compilation failed to produce executable
FAIL: gcc.dg/vmx/varargs-3.c  -O0  (test for excess errors)
WARNING: gcc.dg/vmx/varargs-3.c  -O0  compilation failed to produce executable
FAIL: gcc.dg/vmx/varargs-3.c  -O1  (test for excess errors)
WARNING: gcc.dg/vmx/varargs-3.c  -O1  compilation failed to produce executable
FAIL: gcc.dg/vmx/varargs-3.c  -O2  (test for excess errors)
WARNING: gcc.dg/vmx/varargs-3.c  -O2  compilation failed to produce executable
FAIL: gcc.dg/vmx/varargs-3.c  -O3 -fomit-frame-pointer  (test for excess errors)
WARNING: gcc.dg/vmx/varargs-3.c  -O3 -fomit-frame-pointer  compilation failed to produce executable
FAIL: gcc.dg/vmx/varargs-3.c  -O3 -g  (test for excess errors)
WARNING: gcc.dg/vmx/varargs-3.c  -O3 -g  compilation failed to produce executable
FAIL: gcc.dg/vmx/varargs-3.c  -Os  (test for excess errors)
WARNING: gcc.dg/vmx/varargs-3.c  -Os  compilation failed to produce executable
FAIL: gcc.dg/vmx/varargs-4.c  -O0  (test for excess errors)
WARNING: gcc.dg/vmx/varargs-4.c  -O0  compilation failed to produce executable
FAIL: gcc.dg/vmx/varargs-4.c  -O1  (test for excess errors)
WARNING: gcc.dg/vmx/varargs-4.c  -O1  compilation failed to produce executable
FAIL: gcc.dg/vmx/varargs-4.c  -O2  (test for excess errors)
WARNING: gcc.dg/vmx/varargs-4.c  -O2  compilation failed to produce executable
FAIL: gcc.dg/vmx/varargs-4.c  -O3 -fomit-frame-pointer  (test for excess errors)
WARNING: gcc.dg/vmx/varargs-4.c  -O3 -fomit-frame-pointer  compilation failed to produce executable
FAIL: gcc.dg/vmx/varargs-4.c  -O3 -fomit-frame-pointer -funroll-loops  (test for excess errors)
WARNING: gcc.dg/vmx/varargs-4.c  -O3 -fomit-frame-pointer -funroll-loops  compilation failed to produce executable
FAIL: gcc.dg/vmx/varargs-4.c  -O3 -fomit-frame-pointer -funroll-all-loops -finline-functions  (test for excess errors)
WARNING: gcc.dg/vmx/varargs-4.c  -O3 -fomit-frame-pointer -funroll-all-loops -finline-functions  compilation failed to produce executable
FAIL: gcc.dg/vmx/varargs-4.c  -O3 -g  (test for excess errors)
WARNING: gcc.dg/vmx/varargs-4.c  -O3 -g  compilation failed to produce executable
FAIL: gcc.dg/vmx/varargs-4.c  -Os  (test for excess errors)
WARNING: gcc.dg/vmx/varargs-4.c  -Os  compilation failed to produce executable
FAIL: gcc.dg/vmx/varargs-5.c  -O0  (test for excess errors)
WARNING: gcc.dg/vmx/varargs-5.c  -O0  compilation failed to produce executable
FAIL: gcc.dg/vmx/varargs-5.c  -O1  (test for excess errors)
WARNING: gcc.dg/vmx/varargs-5.c  -O1  compilation failed to produce executable
FAIL: gcc.dg/vmx/varargs-5.c  -O2  (test for excess errors)
WARNING: gcc.dg/vmx/varargs-5.c  -O2  compilation failed to produce executable
FAIL: gcc.dg/vmx/varargs-5.c  -O3 -fomit-frame-pointer  (test for excess errors)
WARNING: gcc.dg/vmx/varargs-5.c  -O3 -fomit-frame-pointer  compilation failed to produce executable
FAIL: gcc.dg/vmx/varargs-5.c  -O3 -g  (test for excess errors)
WARNING: gcc.dg/vmx/varargs-5.c  -O3 -g  compilation failed to produce executable
FAIL: gcc.dg/vmx/varargs-5.c  -Os  (test for excess errors)
WARNING: gcc.dg/vmx/varargs-5.c  -Os  compilation failed to produce executable
FAIL: gcc.dg/vmx/varargs-6.c  -O0  (test for excess errors)
WARNING: gcc.dg/vmx/varargs-6.c  -O0  compilation failed to produce executable
FAIL: gcc.dg/vmx/varargs-6.c  -O1  (test for excess errors)
WARNING: gcc.dg/vmx/varargs-6.c  -O1  compilation failed to produce executable
FAIL: gcc.dg/vmx/varargs-6.c  -O2  (test for excess errors)
WARNING: gcc.dg/vmx/varargs-6.c  -O2  compilation failed to produce executable
FAIL: gcc.dg/vmx/varargs-6.c  -O3 -fomit-frame-pointer  (test for excess errors)
WARNING: gcc.dg/vmx/varargs-6.c  -O3 -fomit-frame-pointer  compilation failed to produce executable
FAIL: gcc.dg/vmx/varargs-6.c  -O3 -g  (test for excess errors)
WARNING: gcc.dg/vmx/varargs-6.c  -O3 -g  compilation failed to produce executable
FAIL: gcc.dg/vmx/varargs-6.c  -Os  (test for excess errors)
WARNING: gcc.dg/vmx/varargs-6.c  -Os  compilation failed to produce executable
FAIL: gcc.dg/vmx/varargs-7.c  -O0  (test for excess errors)
WARNING: gcc.dg/vmx/varargs-7.c  -O0  compilation failed to produce executable
FAIL: gcc.dg/vmx/varargs-7.c  -O1  (test for excess errors)
WARNING: gcc.dg/vmx/varargs-7.c  -O1  compilation failed to produce executable
FAIL: gcc.dg/vmx/varargs-7.c  -O2  (test for excess errors)
WARNING: gcc.dg/vmx/varargs-7.c  -O2  compilation failed to produce executable
FAIL: gcc.dg/vmx/varargs-7.c  -O3 -fomit-frame-pointer  (test for excess errors)
WARNING: gcc.dg/vmx/varargs-7.c  -O3 -fomit-frame-pointer  compilation failed to produce executable
FAIL: gcc.dg/vmx/varargs-7.c  -O3 -g  (test for excess errors)
WARNING: gcc.dg/vmx/varargs-7.c  -O3 -g  compilation failed to produce executable
FAIL: gcc.dg/vmx/varargs-7.c  -Os  (test for excess errors)
WARNING: gcc.dg/vmx/varargs-7.c  -Os  compilation failed to produce executable
FAIL: gcc.dg/vmx/x-01.c  -O0  (test for excess errors)
WARNING: gcc.dg/vmx/x-01.c  -O0  compilation failed to produce executable
FAIL: gcc.dg/vmx/x-01.c  -O1  (test for excess errors)
WARNING: gcc.dg/vmx/x-01.c  -O1  compilation failed to produce executable
FAIL: gcc.dg/vmx/x-01.c  -O2  (test for excess errors)
WARNING: gcc.dg/vmx/x-01.c  -O2  compilation failed to produce executable
FAIL: gcc.dg/vmx/x-02.c  -O0  (test for excess errors)
WARNING: gcc.dg/vmx/x-02.c  -O0  compilation failed to produce executable
FAIL: gcc.dg/vmx/x-03.c  -O0  (test for excess errors)
WARNING: gcc.dg/vmx/x-03.c  -O0  compilation failed to produce executable
FAIL: gcc.dg/vmx/x-04.c  -O0  (test for excess errors)
WARNING: gcc.dg/vmx/x-04.c  -O0  compilation failed to produce executable
FAIL: gcc.dg/vmx/x-04.c  -O1  (test for excess errors)
WARNING: gcc.dg/vmx/x-04.c  -O1  compilation failed to produce executable
FAIL: gcc.dg/vmx/x-04.c  -O2  (test for excess errors)
WARNING: gcc.dg/vmx/x-04.c  -O2  compilation failed to produce executable
FAIL: gcc.dg/vmx/x-04.c  -O3 -fomit-frame-pointer  (test for excess errors)
WARNING: gcc.dg/vmx/x-04.c  -O3 -fomit-frame-pointer  compilation failed to produce executable
FAIL: gcc.dg/vmx/x-04.c  -O3 -g  (test for excess errors)
WARNING: gcc.dg/vmx/x-04.c  -O3 -g  compilation failed to produce executable
FAIL: gcc.dg/vmx/x-04.c  -Os  (test for excess errors)
WARNING: gcc.dg/vmx/x-04.c  -Os  compilation failed to produce executable
FAIL: gcc.dg/vmx/x-05.c  -O0  (test for excess errors)
WARNING: gcc.dg/vmx/x-05.c  -O0  compilation failed to produce executable
FAIL: gcc.dg/vmx/yousufi-1.c  -O0  (test for excess errors)
WARNING: gcc.dg/vmx/yousufi-1.c  -O0  compilation failed to produce executable
FAIL: gcc.dg/vmx/yousufi-1.c  -O1  (test for excess errors)
WARNING: gcc.dg/vmx/yousufi-1.c  -O1  compilation failed to produce executable
FAIL: gcc.dg/vmx/yousufi-1.c  -O2  (test for excess errors)
WARNING: gcc.dg/vmx/yousufi-1.c  -O2  compilation failed to produce executable
FAIL: gcc.dg/vmx/yousufi-1.c  -O3 -fomit-frame-pointer  (test for excess errors)
WARNING: gcc.dg/vmx/yousufi-1.c  -O3 -fomit-frame-pointer  compilation failed to produce executable
FAIL: gcc.dg/vmx/yousufi-1.c  -O3 -g  (test for excess errors)
WARNING: gcc.dg/vmx/yousufi-1.c  -O3 -g  compilation failed to produce executable
FAIL: gcc.dg/vmx/yousufi-1.c  -Os  (test for excess errors)
WARNING: gcc.dg/vmx/yousufi-1.c  -Os  compilation failed to produce executable
FAIL: gcc.dg/vmx/zero-1.c  -O0  (test for excess errors)
WARNING: gcc.dg/vmx/zero-1.c  -O0  compilation failed to produce executable
FAIL: gcc.dg/vmx/zero-1.c  -O1  (test for excess errors)
WARNING: gcc.dg/vmx/zero-1.c  -O1  compilation failed to produce executable
FAIL: gcc.dg/vmx/zero-1.c  -O2  (test for excess errors)
WARNING: gcc.dg/vmx/zero-1.c  -O2  compilation failed to produce executable
FAIL: gcc.dg/vmx/zero-1.c  -O3 -fomit-frame-pointer  (test for excess errors)
WARNING: gcc.dg/vmx/zero-1.c  -O3 -fomit-frame-pointer  compilation failed to produce executable
FAIL: gcc.dg/vmx/zero-1.c  -O3 -g  (test for excess errors)
WARNING: gcc.dg/vmx/zero-1.c  -O3 -g  compilation failed to produce executable
FAIL: gcc.dg/vmx/zero-1.c  -Os  (test for excess errors)
WARNING: gcc.dg/vmx/zero-1.c  -Os  compilation failed to produce executable
FAIL: gcc.dg/vmx/zero.c  -O0  (test for excess errors)
WARNING: gcc.dg/vmx/zero.c  -O0  compilation failed to produce executable
FAIL: gcc.dg/vmx/zero.c  -O1  (test for excess errors)
WARNING: gcc.dg/vmx/zero.c  -O1  compilation failed to produce executable
FAIL: gcc.dg/vmx/zero.c  -O2  (test for excess errors)
WARNING: gcc.dg/vmx/zero.c  -O2  compilation failed to produce executable
FAIL: gcc.dg/vmx/zero.c  -O3 -fomit-frame-pointer  (test for excess errors)
WARNING: gcc.dg/vmx/zero.c  -O3 -fomit-frame-pointer  compilation failed to produce executable
FAIL: gcc.dg/vmx/zero.c  -O3 -g  (test for excess errors)
WARNING: gcc.dg/vmx/zero.c  -O3 -g  compilation failed to produce executable
FAIL: gcc.dg/vmx/zero.c  -Os  (test for excess errors)
WARNING: gcc.dg/vmx/zero.c  -Os  compilation failed to produce executable
FAIL: gcc.target/powerpc/altivec-1.c (test for excess errors)
WARNING: gcc.target/powerpc/altivec-1.c compilation failed to produce executable
FAIL: gcc.target/powerpc/altivec-10.c (test for excess errors)
FAIL: gcc.target/powerpc/altivec-11.c (test for excess errors)
ERROR: gcc.target/powerpc/altivec-11.c: error executing dg-final: couldn't open "altivec-11.s": no such file or directory
UNRESOLVED: gcc.target/powerpc/altivec-11.c: error executing dg-final: couldn't open "altivec-11.s": no such file or directory
FAIL: gcc.target/powerpc/altivec-12.c (test for excess errors)
WARNING: gcc.target/powerpc/altivec-12.c compilation failed to produce executable
FAIL: gcc.target/powerpc/altivec-13.c (test for excess errors)
FAIL: gcc.target/powerpc/altivec-18.c (test for excess errors)
ERROR: gcc.target/powerpc/altivec-18.c: error executing dg-final: couldn't open "altivec-18.s": no such file or directory
UNRESOLVED: gcc.target/powerpc/altivec-18.c: error executing dg-final: couldn't open "altivec-18.s": no such file or directory
FAIL: gcc.target/powerpc/altivec-20.c (test for excess errors)
FAIL: gcc.target/powerpc/altivec-21.c (test for excess errors)
FAIL: gcc.target/powerpc/altivec-3.c (test for excess errors)
WARNING: gcc.target/powerpc/altivec-3.c compilation failed to produce executable
FAIL: gcc.target/powerpc/altivec-4.c (test for excess errors)
FAIL: gcc.target/powerpc/altivec-7.c (test for excess errors)
FAIL: gcc.target/powerpc/altivec-8.c (test for excess errors)
FAIL: gcc.target/powerpc/altivec-consts.c (test for excess errors)
WARNING: gcc.target/powerpc/altivec-consts.c compilation failed to produce executable
FAIL: gcc.target/powerpc/altivec-pr22085.c (test for excess errors)
FAIL: gcc.target/powerpc/altivec-splat.c (test for excess errors)
FAIL: gcc.target/powerpc/altivec-varargs-1.c (test for excess errors)
WARNING: gcc.target/powerpc/altivec-varargs-1.c compilation failed to produce executable
FAIL: gcc.target/powerpc/altivec-vec-merge.c (test for excess errors)
WARNING: gcc.target/powerpc/altivec-vec-merge.c compilation failed to produce executable
FAIL: gcc.target/powerpc/ppc-vector-memcpy.c (test for excess errors)
ERROR: gcc.target/powerpc/ppc-vector-memcpy.c: error executing dg-final: couldn't open "ppc-vector-memcpy.s": no such file or directory
UNRESOLVED: gcc.target/powerpc/ppc-vector-memcpy.c: error executing dg-final: couldn't open "ppc-vector-memcpy.s": no such file or directory
FAIL: gcc.target/powerpc/ppc-vector-memset.c (test for excess errors)
ERROR: gcc.target/powerpc/ppc-vector-memset.c: error executing dg-final: couldn't open "ppc-vector-memset.s": no such file or directory
UNRESOLVED: gcc.target/powerpc/ppc-vector-memset.c: error executing dg-final: couldn't open "ppc-vector-memset.s": no such file or directory
FAIL: gcc.target/powerpc/ppc64-abi-2.c (test for excess errors)
WARNING: gcc.target/powerpc/ppc64-abi-2.c compilation failed to produce executable
FAIL: gcc.target/powerpc/pr16155.c (test for excess errors)
FAIL: gcc.target/powerpc/pr16286.c (test for excess errors)

		=== gcc Summary for unix/-m64 ===

# of expected passes		37526
# of unexpected failures	572
# of unexpected successes	1
# of expected failures		95
# of unresolved testcases	4
# of untested testcases		28
# of unsupported tests		339

Running target unix
FAIL: gcc.dg/cleanup-10.c execution test
FAIL: gcc.dg/cleanup-11.c execution test
FAIL: gcc.dg/cleanup-8.c execution test
FAIL: gcc.dg/cleanup-9.c execution test
FAIL: gcc.dg/vect/pr20122.c scan-tree-dump-times vectorized 1 loops 2
FAIL: gcc.dg/vect/pr22506.c (test for excess errors)
FAIL: gcc.dg/vect/vect-111.c (test for excess errors)
WARNING: gcc.dg/vect/vect-111.c compilation failed to produce executable
FAIL: gcc.dg/vmx/3c-01a.c  -O1  (test for excess errors)
FAIL: gcc.dg/vmx/7c-01.c  -O0  (test for excess errors)
FAIL: gcc.dg/vmx/7c-01.c  -O1  (test for excess errors)
FAIL: gcc.dg/vmx/7c-01.c  -O2  (test for excess errors)
FAIL: gcc.dg/vmx/7c-01.c  -O3 -fomit-frame-pointer  (test for excess errors)
FAIL: gcc.dg/vmx/7c-01.c  -O3 -g  (test for excess errors)
FAIL: gcc.dg/vmx/7c-01.c  -Os  (test for excess errors)
FAIL: gcc.dg/vmx/bug-1.c  -O0  (test for excess errors)
WARNING: gcc.dg/vmx/bug-1.c  -O0  compilation failed to produce executable
FAIL: gcc.dg/vmx/bug-1.c  -O1  (test for excess errors)
WARNING: gcc.dg/vmx/bug-1.c  -O1  compilation failed to produce executable
FAIL: gcc.dg/vmx/bug-1.c  -O2  (test for excess errors)
WARNING: gcc.dg/vmx/bug-1.c  -O2  compilation failed to produce executable
FAIL: gcc.dg/vmx/bug-1.c  -O3 -fomit-frame-pointer  (test for excess errors)
WARNING: gcc.dg/vmx/bug-1.c  -O3 -fomit-frame-pointer  compilation failed to produce executable
FAIL: gcc.dg/vmx/bug-1.c  -O3 -fomit-frame-pointer -funroll-loops  (test for excess errors)
WARNING: gcc.dg/vmx/bug-1.c  -O3 -fomit-frame-pointer -funroll-loops  compilation failed to produce executable
FAIL: gcc.dg/vmx/bug-1.c  -O3 -fomit-frame-pointer -funroll-all-loops -finline-functions  (test for excess errors)
WARNING: gcc.dg/vmx/bug-1.c  -O3 -fomit-frame-pointer -funroll-all-loops -finline-functions  compilation failed to produce executable
FAIL: gcc.dg/vmx/bug-1.c  -O3 -g  (test for excess errors)
WARNING: gcc.dg/vmx/bug-1.c  -O3 -g  compilation failed to produce executable
FAIL: gcc.dg/vmx/bug-1.c  -Os  (test for excess errors)
WARNING: gcc.dg/vmx/bug-1.c  -Os  compilation failed to produce executable
FAIL: gcc.dg/vmx/eg-5.c  -O0  (test for excess errors)
WARNING: gcc.dg/vmx/eg-5.c  -O0  compilation failed to produce executable
FAIL: gcc.dg/vmx/eg-5.c  -O1  (test for excess errors)
WARNING: gcc.dg/vmx/eg-5.c  -O1  compilation failed to produce executable
FAIL: gcc.dg/vmx/eg-5.c  -O2  (test for excess errors)
WARNING: gcc.dg/vmx/eg-5.c  -O2  compilation failed to produce executable
FAIL: gcc.dg/vmx/eg-5.c  -O3 -fomit-frame-pointer  (test for excess errors)
WARNING: gcc.dg/vmx/eg-5.c  -O3 -fomit-frame-pointer  compilation failed to produce executable
FAIL: gcc.dg/vmx/eg-5.c  -O3 -g  (test for excess errors)
WARNING: gcc.dg/vmx/eg-5.c  -O3 -g  compilation failed to produce executable
FAIL: gcc.dg/vmx/eg-5.c  -Os  (test for excess errors)
WARNING: gcc.dg/vmx/eg-5.c  -Os  compilation failed to produce executable
FAIL: gcc.dg/vmx/gcc-bug-b.c  -O1  (test for excess errors)
FAIL: gcc.dg/vmx/gcc-bug-b.c  -O2  (test for excess errors)
FAIL: gcc.dg/vmx/gcc-bug-b.c  -O3 -fomit-frame-pointer  (test for excess errors)
FAIL: gcc.dg/vmx/gcc-bug-b.c  -O3 -g  (test for excess errors)
FAIL: gcc.dg/vmx/gcc-bug-b.c  -Os  (test for excess errors)
FAIL: gcc.dg/vmx/ira2.c  -O1  (test for excess errors)
FAIL: gcc.dg/vmx/ira2.c  -O2  (test for excess errors)
FAIL: gcc.dg/vmx/ira2.c  -O3 -fomit-frame-pointer  (test for excess errors)
FAIL: gcc.dg/vmx/ira2.c  -O3 -g  (test for excess errors)
FAIL: gcc.dg/vmx/ira2.c  -Os  (test for excess errors)
FAIL: gcc.dg/vmx/ops.c  -O1  (test for excess errors)
FAIL: gcc.dg/vmx/ops.c  -O2  (test for excess errors)
FAIL: gcc.dg/vmx/ops.c  -O3 -fomit-frame-pointer  (test for excess errors)
FAIL: gcc.dg/vmx/ops.c  -O3 -g  (test for excess errors)
FAIL: gcc.dg/vmx/ops.c  -Os  (test for excess errors)
FAIL: gcc.dg/vmx/varargs-4.c  -O0  (test for excess errors)
WARNING: gcc.dg/vmx/varargs-4.c  -O0  compilation failed to produce executable
FAIL: gcc.dg/vmx/varargs-4.c  -O1  (test for excess errors)
WARNING: gcc.dg/vmx/varargs-4.c  -O1  compilation failed to produce executable
FAIL: gcc.dg/vmx/varargs-4.c  -O2  (test for excess errors)
WARNING: gcc.dg/vmx/varargs-4.c  -O2  compilation failed to produce executable
FAIL: gcc.dg/vmx/varargs-4.c  -O3 -fomit-frame-pointer  (test for excess errors)
WARNING: gcc.dg/vmx/varargs-4.c  -O3 -fomit-frame-pointer  compilation failed to produce executable
FAIL: gcc.dg/vmx/varargs-4.c  -O3 -fomit-frame-pointer -funroll-loops  (test for excess errors)
WARNING: gcc.dg/vmx/varargs-4.c  -O3 -fomit-frame-pointer -funroll-loops  compilation failed to produce executable
FAIL: gcc.dg/vmx/varargs-4.c  -O3 -fomit-frame-pointer -funroll-all-loops -finline-functions  (test for excess errors)
WARNING: gcc.dg/vmx/varargs-4.c  -O3 -fomit-frame-pointer -funroll-all-loops -finline-functions  compilation failed to produce executable
FAIL: gcc.dg/vmx/varargs-4.c  -O3 -g  (test for excess errors)
WARNING: gcc.dg/vmx/varargs-4.c  -O3 -g  compilation failed to produce executable
FAIL: gcc.dg/vmx/varargs-4.c  -Os  (test for excess errors)
WARNING: gcc.dg/vmx/varargs-4.c  -Os  compilation failed to produce executable
FAIL: gcc.target/powerpc/altivec-20.c (test for excess errors)
FAIL: gcc.target/powerpc/altivec-consts.c (test for excess errors)
WARNING: gcc.target/powerpc/altivec-consts.c compilation failed to produce executable

		=== gcc Summary for unix ===

# of expected passes		38420
# of unexpected failures	53
# of expected failures		94
# of untested testcases		28
# of unsupported tests		341

		=== gcc Summary ===

# of expected passes		75946
# of unexpected failures	625
# of unexpected successes	1
# of expected failures		189
# of unresolved testcases	4
# of untested testcases		56
# of unsupported tests		680
/abuild/aj/gcc/gcc/xgcc  version 4.1.0 20051113 (experimental)

		=== gfortran tests ===


Running target unix/-m64
FAIL: gfortran.dg/vect/vect-1.f90  -O  (test for excess errors)
FAIL: gfortran.dg/vect/vect-2.f90  -O  (test for excess errors)
FAIL: gfortran.dg/vect/vect-4.f90  -O  (test for excess errors)
FAIL: gfortran.dg/vect/vect-5.f90  -O  (test for excess errors)
WARNING: gfortran.dg/vect/vect-5.f90  -O  compilation failed to produce executable

		=== gfortran Summary for unix/-m64 ===

# of expected passes		10517
# of unexpected failures	4
# of expected failures		18
# of unsupported tests		42

Running target unix

		=== gfortran Summary for unix ===

# of expected passes		10493
# of expected failures		15
# of unsupported tests		58

		=== gfortran Summary ===

# of expected passes		21010
# of unexpected failures	4
# of expected failures		33
# of unsupported tests		100
/abuild/aj/gcc/gcc/testsuite/../gfortran  version 4.1.0 20051113 (experimental)

		=== g++ tests ===


Running target unix/-m64
FAIL: g++.dg/ext/altivec-2.C (test for excess errors)
FAIL: g++.dg/ext/altivec-3.C (test for excess errors)
WARNING: g++.dg/ext/altivec-3.C compilation failed to produce executable
FAIL: g++.dg/ext/altivec-4.C (test for excess errors)
FAIL: g++.dg/ext/altivec-5.C (test for excess errors)
FAIL: g++.dg/ext/altivec-6.C (test for excess errors)
FAIL: g++.dg/ext/altivec-8.C (test for excess errors)
FAIL: g++.dg/ext/altivec-9.C (test for excess errors)
FAIL: g++.dg/vect/pr21734_1.cc (test for excess errors)
FAIL: g++.dg/vect/pr21734_2.cc (test for excess errors)
FAIL: g++.dg/vect/pr22543.cc (test for excess errors)

		=== g++ Summary for unix/-m64 ===

# of expected passes		11616
# of unexpected failures	10
# of expected failures		66
# of unsupported tests		91

Running target unix

		=== g++ Summary for unix ===

# of expected passes		11665
# of expected failures		66
# of unsupported tests		88

		=== g++ Summary ===

# of expected passes		23281
# of unexpected failures	10
# of expected failures		132
# of unsupported tests		179
/abuild/aj/gcc/gcc/testsuite/../g++  version 4.1.0 20051113 (experimental)

		=== objc tests ===


Running target unix/-m64
FAIL: objc/execute/exceptions/foward-1.m execution,  -O3 -fomit-frame-pointer -funroll-loops  -fgnu-runtime
FAIL: objc/execute/exceptions/foward-1.m execution,  -O3 -fomit-frame-pointer -funroll-all-loops -finline-functions  -fgnu-runtime

		=== objc Summary for unix/-m64 ===

# of expected passes		1670
# of unexpected failures	2
# of unsupported tests		22

Running target unix

		=== objc Summary for unix ===

# of expected passes		1672
# of unsupported tests		22

		=== objc Summary ===

# of expected passes		3342
# of unexpected failures	2
# of unsupported tests		44
/abuild/aj/gcc/gcc/xgcc  version 4.1.0 20051113 (experimental)

		=== treelang tests ===


Running target unix/-m64
FAIL: treelang/compile/badreturn.tree  (test for errors, line 13)
FAIL: treelang/compile/badreturn.tree (test for excess errors)
FAIL: treelang/compile/exit.tree (test for excess errors)
FAIL: treelang/compile/extrafunc.tree  (test for warnings, line 14)
FAIL: treelang/compile/extrafunc.tree (test for excess errors)
FAIL: treelang/compile/extravar.tree  (test for warnings, line 5)
FAIL: treelang/compile/extravar.tree (test for excess errors)
FAIL: treelang/compile/extref.tree (test for excess errors)
FAIL: treelang/compile/full_unit.tree (test for excess errors)
ERROR: treelang/compile/full_unit.tree: error executing dg-final: couldn't open "full_unit.s": no such file or directory
UNRESOLVED: treelang/compile/full_unit.tree: error executing dg-final: couldn't open "full_unit.s": no such file or directory
FAIL: treelang/compile/function-1.tree (test for excess errors)
FAIL: treelang/compile/memory.tree (test for excess errors)
FAIL: treelang/compile/tabs.tree (test for excess errors)
FAIL: treelang/compile/unsigned.tree (test for excess errors)
FAIL: treelang/compile/var_defs.tree  (test for warnings, line 17)
FAIL: treelang/compile/var_defs.tree  (test for warnings, line 22)
FAIL: treelang/compile/var_defs.tree (test for excess errors)
FAIL: treelang/execute/funccall-2.tree (test for excess errors)
WARNING: treelang/execute/funccall-2.tree compilation failed to produce executable
FAIL: treelang/execute/funccall.tree (test for excess errors)
WARNING: treelang/execute/funccall.tree compilation failed to produce executable
FAIL: treelang/execute/initial.tree (test for excess errors)
WARNING: treelang/execute/initial.tree compilation failed to produce executable
FAIL: treelang/execute/main.tree (test for excess errors)
WARNING: treelang/execute/main.tree compilation failed to produce executable
FAIL: treelang/execute/static.tree (test for excess errors)
WARNING: treelang/execute/static.tree compilation failed to produce executable
FAIL: treelang/output-1, {}

		=== treelang Summary for unix/-m64 ===

# of expected passes		20
# of unexpected failures	22
# of unresolved testcases	1

Running target unix

		=== treelang Summary for unix ===

# of expected passes		50

		=== treelang Summary ===

# of expected passes		70
# of unexpected failures	22
# of unresolved testcases	1
		=== libffi tests ===


Running target unix/-m64

		=== libffi Summary for unix/-m64 ===

# of expected passes		228
# of unsupported tests		2

Running target unix

		=== libffi Summary for unix ===

# of expected passes		228
# of unsupported tests		2

		=== libffi Summary ===

# of expected passes		456
# of unsupported tests		4
		=== libjava tests ===


Running target unix/-m64
FAIL: Array_3 -O3 execution - bytecode->native test
FAIL: ExtraClassLoader execution - gij test
FAIL: ExtraClassLoader execution - gij test

		=== libjava Summary for unix/-m64 ===

# of expected passes		3980
# of unexpected failures	3
# of expected failures		10
# of untested testcases		11

Running target unix

		=== libjava Summary for unix ===

# of expected passes		3986
# of expected failures		10
# of untested testcases		8

		=== libjava Summary ===

# of expected passes		7966
# of unexpected failures	3
# of expected failures		20
# of untested testcases		19
		=== libmudflap tests ===


Running target unix/-m64
FAIL: libmudflap.c/fail27-frag.c output pattern test
FAIL: libmudflap.c/fail27-frag.c (-O2) output pattern test
FAIL: libmudflap.c/fail27-frag.c (-O3) output pattern test

		=== libmudflap Summary for unix/-m64 ===

# of expected passes		1786
# of unexpected failures	3

Running target unix

		=== libmudflap Summary for unix ===

# of expected passes		1789

		=== libmudflap Summary ===

# of expected passes		3575
# of unexpected failures	3
		=== libstdc++ tests ===


Running target unix/-m64
FAIL: abi_check
FAIL: 22_locale/messages/members/char/1.cc execution test
FAIL: 22_locale/messages/members/char/2.cc execution test
FAIL: 22_locale/messages/members/char/wrapped_env.cc execution test
FAIL: 22_locale/messages/members/char/wrapped_locale.cc execution test
FAIL: 22_locale/messages_byname/named_equivalence.cc execution test
XPASS: 26_numerics/cmath/c99_classification_macros_c.cc (test for excess errors)
XPASS: 27_io/fpos/14320-1.cc execution test
XPASS: ext/array_allocator/2.cc execution test

		=== libstdc++ Summary for unix/-m64 ===

# of expected passes		4017
# of unexpected failures	6
# of unexpected successes	3
# of expected failures		11

Running target unix
FAIL: abi_check
XPASS: 26_numerics/cmath/c99_classification_macros_c.cc (test for excess errors)
XPASS: ext/array_allocator/2.cc execution test

		=== libstdc++ Summary for unix ===

# of expected passes		4022
# of unexpected failures	1
# of unexpected successes	2
# of expected failures		12

		=== libstdc++ Summary ===

# of expected passes		8039
# of unexpected failures	7
# of unexpected successes	5
# of expected failures		23

Compiler version: 4.1.0 20051113 (experimental) 
Platform: powerpc64-suse-linux-gnu
configure flags: --prefix=/opt/gcc/4.1-devel --enable-checking=misc,tree,gc,rtl,rtlflag,assert --enable-threads=posix --enable-clocale=gnu --enable-__cxa_atexit --enable-shared --with-system-zlib --with-cpu=default32 powerpc64-suse-linux-gnu --enable-languages=c,c++,fortran,java,objc,treelang
Version of binutils: GNU ld version 2.16.91.0.2 20050720 (SuSE Linux)
Version of glibc (/lib/libc.so.6): 2.3.5 (20050802)


Index Nav: [Date Index] [Subject Index] [Author Index] [Thread Index]
Message Nav: [Date Prev] [Date Next] [Thread Prev] [Thread Next]