This is the mail archive of the gcc-testresults@gcc.gnu.org mailing list for the GCC project.


Index Nav: [Date Index] [Subject Index] [Author Index] [Thread Index]
Message Nav: [Date Prev] [Date Next] [Thread Prev] [Thread Next]
Other format: [Raw text]

Results for 4.1.0 20050519 (experimental) testsuite on powerpc64-suse-linux-gnu


Bootstrap and regtesting on powerpc64-suse-linux-gnu.
CVS sources: mainline.
LAST_UPDATED: Thu May 19 20:45:25 UTC 2005

Native configuration is powerpc64-suse-linux-gnu

		=== gcc tests ===


Running target unix/-m64
UNRESOLVED: gcc.c-torture/execute/20020720-1.c execution,  -O1 
UNRESOLVED: gcc.c-torture/execute/20020720-1.c execution,  -O2 
UNRESOLVED: gcc.c-torture/execute/20020720-1.c execution,  -O3 -fomit-frame-pointer 
UNRESOLVED: gcc.c-torture/execute/20020720-1.c execution,  -O3 -g 
UNRESOLVED: gcc.c-torture/execute/20020720-1.c execution,  -Os 
XPASS: gcc.dg/cpp/cmdlne-dI-M.c scan-file (^|\\\\n)cmdlne-dI-M.*:[^\\\\n]*cmdlne-dI-M.c
XPASS: gcc.dg/cpp/cmdlne-dM-M.c scan-file (^|\\\\n)cmdlne-dM-M[^\\\\n]*:[^\\\\n]*cmdlne-dM-M.c
FAIL: gcc.dg/altivec-1.c (test for excess errors)
WARNING: gcc.dg/altivec-1.c compilation failed to produce executable
FAIL: gcc.dg/altivec-10.c (test for excess errors)
FAIL: gcc.dg/altivec-11.c (test for excess errors)
ERROR: gcc.dg/altivec-11.c: error executing dg-final: couldn't open "altivec-11.s": no such file or directory
UNRESOLVED: gcc.dg/altivec-11.c: error executing dg-final: couldn't open "altivec-11.s": no such file or directory
FAIL: gcc.dg/altivec-12.c (test for excess errors)
WARNING: gcc.dg/altivec-12.c compilation failed to produce executable
FAIL: gcc.dg/altivec-13.c (test for excess errors)
FAIL: gcc.dg/altivec-18.c (test for excess errors)
ERROR: gcc.dg/altivec-18.c: error executing dg-final: couldn't open "altivec-18.s": no such file or directory
UNRESOLVED: gcc.dg/altivec-18.c: error executing dg-final: couldn't open "altivec-18.s": no such file or directory
FAIL: gcc.dg/altivec-20.c (test for excess errors)
FAIL: gcc.dg/altivec-21.c  (test for errors, line 13)
FAIL: gcc.dg/altivec-21.c  (test for errors, line 14)
FAIL: gcc.dg/altivec-21.c (test for excess errors)
FAIL: gcc.dg/altivec-3.c (test for excess errors)
WARNING: gcc.dg/altivec-3.c compilation failed to produce executable
FAIL: gcc.dg/altivec-4.c (test for excess errors)
FAIL: gcc.dg/altivec-7.c (test for excess errors)
FAIL: gcc.dg/altivec-8.c (test for excess errors)
FAIL: gcc.dg/altivec-varargs-1.c (test for excess errors)
WARNING: gcc.dg/altivec-varargs-1.c compilation failed to produce executable
FAIL: gcc.dg/cleanup-8.c execution test
FAIL: gcc.dg/cleanup-9.c execution test
FAIL: gcc.dg/ppc-vec-merge.c (test for excess errors)
WARNING: gcc.dg/ppc-vec-merge.c compilation failed to produce executable
FAIL: gcc.dg/ppc-vector-memcpy.c (test for excess errors)
ERROR: gcc.dg/ppc-vector-memcpy.c: error executing dg-final: couldn't open "ppc-vector-memcpy.s": no such file or directory
UNRESOLVED: gcc.dg/ppc-vector-memcpy.c: error executing dg-final: couldn't open "ppc-vector-memcpy.s": no such file or directory
FAIL: gcc.dg/ppc-vector-memset.c (test for excess errors)
ERROR: gcc.dg/ppc-vector-memset.c: error executing dg-final: couldn't open "ppc-vector-memset.s": no such file or directory
UNRESOLVED: gcc.dg/ppc-vector-memset.c: error executing dg-final: couldn't open "ppc-vector-memset.s": no such file or directory
FAIL: gcc.dg/ppc64-abi-2.c (test for excess errors)
WARNING: gcc.dg/ppc64-abi-2.c compilation failed to produce executable
FAIL: gcc.dg/pr16155.c (test for excess errors)
FAIL: gcc.dg/pr16286.c (test for excess errors)
FAIL: gcc.dg/rs6000-fpint.c scan-assembler-not stfiwx
XPASS: gcc.dg/uninit-4.c uninitialized variable warning PR19833 (test for bogus messages, line 26)
XPASS: gcc.dg/uninit-9.c uninitialized variable warning (test for bogus messages, line 26)
FAIL: gcc.dg/pch/inline-4.c -O0 -g (test for excess errors)
FAIL: gcc.dg/pch/inline-4.c  -O0  (test for excess errors)
XPASS: gcc.dg/tree-ssa/sra-2.c scan-tree-dump-times link_error 0
FAIL: gcc.dg/vect/pr16105.c (test for excess errors)
FAIL: gcc.dg/vect/pr18400.c (test for excess errors)
WARNING: gcc.dg/vect/pr18400.c compilation failed to produce executable
FAIL: gcc.dg/vect/pr18536.c (test for excess errors)
WARNING: gcc.dg/vect/pr18536.c compilation failed to produce executable
FAIL: gcc.dg/vect/pr20122.c (test for excess errors)
WARNING: gcc.dg/vect/pr20122.c compilation failed to produce executable
FAIL: gcc.dg/vect/pr20122.c scan-tree-dump-times vectorized 1 loops 2
FAIL: gcc.dg/vect/vect-1.c (test for excess errors)
FAIL: gcc.dg/vect/vect-11.c (test for excess errors)
WARNING: gcc.dg/vect/vect-11.c compilation failed to produce executable
FAIL: gcc.dg/vect/vect-11a.c (test for excess errors)
WARNING: gcc.dg/vect/vect-11a.c compilation failed to produce executable
FAIL: gcc.dg/vect/vect-11a.c scan-tree-dump-times vectorized 1 loops 2
FAIL: gcc.dg/vect/vect-13.c (test for excess errors)
WARNING: gcc.dg/vect/vect-13.c compilation failed to produce executable
FAIL: gcc.dg/vect/vect-17.c (test for excess errors)
WARNING: gcc.dg/vect/vect-17.c compilation failed to produce executable
FAIL: gcc.dg/vect/vect-18.c (test for excess errors)
WARNING: gcc.dg/vect/vect-18.c compilation failed to produce executable
FAIL: gcc.dg/vect/vect-19.c (test for excess errors)
WARNING: gcc.dg/vect/vect-19.c compilation failed to produce executable
FAIL: gcc.dg/vect/vect-2.c (test for excess errors)
WARNING: gcc.dg/vect/vect-2.c compilation failed to produce executable
FAIL: gcc.dg/vect/vect-20.c (test for excess errors)
WARNING: gcc.dg/vect/vect-20.c compilation failed to produce executable
FAIL: gcc.dg/vect/vect-25.c (test for excess errors)
WARNING: gcc.dg/vect/vect-25.c compilation failed to produce executable
FAIL: gcc.dg/vect/vect-26.c (test for excess errors)
WARNING: gcc.dg/vect/vect-26.c compilation failed to produce executable
FAIL: gcc.dg/vect/vect-27.c (test for excess errors)
WARNING: gcc.dg/vect/vect-27.c compilation failed to produce executable
FAIL: gcc.dg/vect/vect-28.c (test for excess errors)
WARNING: gcc.dg/vect/vect-28.c compilation failed to produce executable
FAIL: gcc.dg/vect/vect-29.c (test for excess errors)
WARNING: gcc.dg/vect/vect-29.c compilation failed to produce executable
FAIL: gcc.dg/vect/vect-3.c (test for excess errors)
WARNING: gcc.dg/vect/vect-3.c compilation failed to produce executable
FAIL: gcc.dg/vect/vect-30.c (test for excess errors)
WARNING: gcc.dg/vect/vect-30.c compilation failed to produce executable
FAIL: gcc.dg/vect/vect-30.c scan-tree-dump-times vectorized 1 loops 2
FAIL: gcc.dg/vect/vect-31.c (test for excess errors)
WARNING: gcc.dg/vect/vect-31.c compilation failed to produce executable
FAIL: gcc.dg/vect/vect-32.c (test for excess errors)
WARNING: gcc.dg/vect/vect-32.c compilation failed to produce executable
FAIL: gcc.dg/vect/vect-33.c (test for excess errors)
FAIL: gcc.dg/vect/vect-34.c (test for excess errors)
WARNING: gcc.dg/vect/vect-34.c compilation failed to produce executable
FAIL: gcc.dg/vect/vect-36.c (test for excess errors)
WARNING: gcc.dg/vect/vect-36.c compilation failed to produce executable
FAIL: gcc.dg/vect/vect-4.c (test for excess errors)
WARNING: gcc.dg/vect/vect-4.c compilation failed to produce executable
FAIL: gcc.dg/vect/vect-40.c (test for excess errors)
WARNING: gcc.dg/vect/vect-40.c compilation failed to produce executable
FAIL: gcc.dg/vect/vect-42.c (test for excess errors)
WARNING: gcc.dg/vect/vect-42.c compilation failed to produce executable
FAIL: gcc.dg/vect/vect-43.c (test for excess errors)
WARNING: gcc.dg/vect/vect-43.c compilation failed to produce executable
FAIL: gcc.dg/vect/vect-44.c (test for excess errors)
WARNING: gcc.dg/vect/vect-44.c compilation failed to produce executable
FAIL: gcc.dg/vect/vect-46.c (test for excess errors)
WARNING: gcc.dg/vect/vect-46.c compilation failed to produce executable
FAIL: gcc.dg/vect/vect-48.c (test for excess errors)
WARNING: gcc.dg/vect/vect-48.c compilation failed to produce executable
FAIL: gcc.dg/vect/vect-5.c (test for excess errors)
WARNING: gcc.dg/vect/vect-5.c compilation failed to produce executable
FAIL: gcc.dg/vect/vect-50.c (test for excess errors)
WARNING: gcc.dg/vect/vect-50.c compilation failed to produce executable
FAIL: gcc.dg/vect/vect-52.c (test for excess errors)
WARNING: gcc.dg/vect/vect-52.c compilation failed to produce executable
FAIL: gcc.dg/vect/vect-54.c (test for excess errors)
WARNING: gcc.dg/vect/vect-54.c compilation failed to produce executable
FAIL: gcc.dg/vect/vect-56.c (test for excess errors)
WARNING: gcc.dg/vect/vect-56.c compilation failed to produce executable
FAIL: gcc.dg/vect/vect-58.c (test for excess errors)
WARNING: gcc.dg/vect/vect-58.c compilation failed to produce executable
FAIL: gcc.dg/vect/vect-6.c (test for excess errors)
WARNING: gcc.dg/vect/vect-6.c compilation failed to produce executable
FAIL: gcc.dg/vect/vect-60.c (test for excess errors)
WARNING: gcc.dg/vect/vect-60.c compilation failed to produce executable
FAIL: gcc.dg/vect/vect-62.c (test for excess errors)
WARNING: gcc.dg/vect/vect-62.c compilation failed to produce executable
FAIL: gcc.dg/vect/vect-64.c (test for excess errors)
WARNING: gcc.dg/vect/vect-64.c compilation failed to produce executable
FAIL: gcc.dg/vect/vect-65.c (test for excess errors)
WARNING: gcc.dg/vect/vect-65.c compilation failed to produce executable
FAIL: gcc.dg/vect/vect-66.c (test for excess errors)
WARNING: gcc.dg/vect/vect-66.c compilation failed to produce executable
FAIL: gcc.dg/vect/vect-67.c (test for excess errors)
WARNING: gcc.dg/vect/vect-67.c compilation failed to produce executable
XPASS: gcc.dg/vect/vect-67.c scan-tree-dump-times vectorized 1 loops 1
FAIL: gcc.dg/vect/vect-68.c (test for excess errors)
WARNING: gcc.dg/vect/vect-68.c compilation failed to produce executable
FAIL: gcc.dg/vect/vect-69.c (test for excess errors)
WARNING: gcc.dg/vect/vect-69.c compilation failed to produce executable
FAIL: gcc.dg/vect/vect-7.c (test for excess errors)
WARNING: gcc.dg/vect/vect-7.c compilation failed to produce executable
FAIL: gcc.dg/vect/vect-70.c (test for excess errors)
WARNING: gcc.dg/vect/vect-70.c compilation failed to produce executable
FAIL: gcc.dg/vect/vect-72.c (test for excess errors)
WARNING: gcc.dg/vect/vect-72.c compilation failed to produce executable
FAIL: gcc.dg/vect/vect-73.c (test for excess errors)
WARNING: gcc.dg/vect/vect-73.c compilation failed to produce executable
FAIL: gcc.dg/vect/vect-74.c (test for excess errors)
WARNING: gcc.dg/vect/vect-74.c compilation failed to produce executable
FAIL: gcc.dg/vect/vect-75.c (test for excess errors)
WARNING: gcc.dg/vect/vect-75.c compilation failed to produce executable
FAIL: gcc.dg/vect/vect-76.c (test for excess errors)
WARNING: gcc.dg/vect/vect-76.c compilation failed to produce executable
FAIL: gcc.dg/vect/vect-8.c (test for excess errors)
WARNING: gcc.dg/vect/vect-8.c compilation failed to produce executable
FAIL: gcc.dg/vect/vect-80.c (test for excess errors)
WARNING: gcc.dg/vect/vect-80.c compilation failed to produce executable
FAIL: gcc.dg/vect/vect-85.c (test for excess errors)
WARNING: gcc.dg/vect/vect-85.c compilation failed to produce executable
FAIL: gcc.dg/vect/vect-86.c (test for excess errors)
WARNING: gcc.dg/vect/vect-86.c compilation failed to produce executable
FAIL: gcc.dg/vect/vect-87.c (test for excess errors)
WARNING: gcc.dg/vect/vect-87.c compilation failed to produce executable
FAIL: gcc.dg/vect/vect-88.c (test for excess errors)
WARNING: gcc.dg/vect/vect-88.c compilation failed to produce executable
FAIL: gcc.dg/vect/vect-89.c (test for excess errors)
WARNING: gcc.dg/vect/vect-89.c compilation failed to produce executable
FAIL: gcc.dg/vect/vect-92.c (test for excess errors)
WARNING: gcc.dg/vect/vect-92.c compilation failed to produce executable
FAIL: gcc.dg/vect/vect-93.c (test for excess errors)
WARNING: gcc.dg/vect/vect-93.c compilation failed to produce executable
FAIL: gcc.dg/vect/vect-93.c scan-tree-dump-times Alignment of access forced using peeling 3
FAIL: gcc.dg/vect/vect-93.c scan-tree-dump-times vectorized 1 loops 1
FAIL: gcc.dg/vect/vect-93.c scan-tree-dump-times Vectorizing an unaligned access 1
FAIL: gcc.dg/vect/vect-96.c (test for excess errors)
WARNING: gcc.dg/vect/vect-96.c compilation failed to produce executable
FAIL: gcc.dg/vect/vect-97.c (test for excess errors)
WARNING: gcc.dg/vect/vect-97.c compilation failed to produce executable
FAIL: gcc.dg/vect/vect-99.c (test for excess errors)
WARNING: gcc.dg/vect/vect-99.c compilation failed to produce executable
FAIL: gcc.dg/vect/vect-all.c (test for excess errors)
WARNING: gcc.dg/vect/vect-all.c compilation failed to produce executable
FAIL: gcc.dg/vect/vect-dv-2.c (test for excess errors)
WARNING: gcc.dg/vect/vect-dv-2.c compilation failed to produce executable
FAIL: gcc.dg/vect/vect-ifcvt-1.c (test for excess errors)
WARNING: gcc.dg/vect/vect-ifcvt-1.c compilation failed to produce executable
FAIL: gcc.dg/vect/vect-ifcvt-2.c (test for excess errors)
WARNING: gcc.dg/vect/vect-ifcvt-2.c compilation failed to produce executable
FAIL: gcc.dg/vect/vect-ifcvt-3.c (test for excess errors)
WARNING: gcc.dg/vect/vect-ifcvt-3.c compilation failed to produce executable
FAIL: gcc.dg/vect/vect-ifcvt-4.c (test for excess errors)
WARNING: gcc.dg/vect/vect-ifcvt-4.c compilation failed to produce executable
FAIL: gcc.dg/vect/vect-ifcvt-5.c (test for excess errors)
WARNING: gcc.dg/vect/vect-ifcvt-5.c compilation failed to produce executable
FAIL: gcc.dg/vect/vect-ifcvt-6.c (test for excess errors)
WARNING: gcc.dg/vect/vect-ifcvt-6.c compilation failed to produce executable
FAIL: gcc.dg/vect/vect-ifcvt-7.c (test for excess errors)
WARNING: gcc.dg/vect/vect-ifcvt-7.c compilation failed to produce executable
FAIL: gcc.dg/vect/vect-ifcvt-9.c (test for excess errors)
WARNING: gcc.dg/vect/vect-ifcvt-9.c compilation failed to produce executable
FAIL: gcc.dg/vect/vect-ifcvt-9.c scan-tree-dump-times vectorized 1 loops 2
FAIL: gcc.dg/vect/vect-none.c (test for excess errors)
FAIL: gcc.dg/vect/vect-shift-1.c (test for excess errors)
WARNING: gcc.dg/vect/vect-shift-1.c compilation failed to produce executable
FAIL: gcc.dg/vmx/1b-01.c  -O0  (test for excess errors)
WARNING: gcc.dg/vmx/1b-01.c  -O0  compilation failed to produce executable
FAIL: gcc.dg/vmx/1b-01.c  -O1  (test for excess errors)
WARNING: gcc.dg/vmx/1b-01.c  -O1  compilation failed to produce executable
FAIL: gcc.dg/vmx/1b-01.c  -O2  (test for excess errors)
WARNING: gcc.dg/vmx/1b-01.c  -O2  compilation failed to produce executable
FAIL: gcc.dg/vmx/1b-01.c  -O3 -fomit-frame-pointer  (test for excess errors)
WARNING: gcc.dg/vmx/1b-01.c  -O3 -fomit-frame-pointer  compilation failed to produce executable
FAIL: gcc.dg/vmx/1b-01.c  -O3 -g  (test for excess errors)
WARNING: gcc.dg/vmx/1b-01.c  -O3 -g  compilation failed to produce executable
FAIL: gcc.dg/vmx/1b-01.c  -Os  (test for excess errors)
WARNING: gcc.dg/vmx/1b-01.c  -Os  compilation failed to produce executable
FAIL: gcc.dg/vmx/1b-04.c  -O0  (test for excess errors)
WARNING: gcc.dg/vmx/1b-04.c  -O0  compilation failed to produce executable
FAIL: gcc.dg/vmx/3a-01.c  -O0  (test for excess errors)
WARNING: gcc.dg/vmx/3a-01.c  -O0  compilation failed to produce executable
FAIL: gcc.dg/vmx/3a-01.c  -O1  (test for excess errors)
WARNING: gcc.dg/vmx/3a-01.c  -O1  compilation failed to produce executable
FAIL: gcc.dg/vmx/3a-01.c  -O2  (test for excess errors)
WARNING: gcc.dg/vmx/3a-01.c  -O2  compilation failed to produce executable
FAIL: gcc.dg/vmx/3a-01.c  -O3 -fomit-frame-pointer  (test for excess errors)
WARNING: gcc.dg/vmx/3a-01.c  -O3 -fomit-frame-pointer  compilation failed to produce executable
FAIL: gcc.dg/vmx/3a-01.c  -O3 -g  (test for excess errors)
WARNING: gcc.dg/vmx/3a-01.c  -O3 -g  compilation failed to produce executable
FAIL: gcc.dg/vmx/3a-01.c  -Os  (test for excess errors)
WARNING: gcc.dg/vmx/3a-01.c  -Os  compilation failed to produce executable
FAIL: gcc.dg/vmx/3a-01a.c  -O0  (test for excess errors)
WARNING: gcc.dg/vmx/3a-01a.c  -O0  compilation failed to produce executable
FAIL: gcc.dg/vmx/3a-01a.c  -O1  (test for excess errors)
WARNING: gcc.dg/vmx/3a-01a.c  -O1  compilation failed to produce executable
FAIL: gcc.dg/vmx/3a-01a.c  -O2  (test for excess errors)
WARNING: gcc.dg/vmx/3a-01a.c  -O2  compilation failed to produce executable
FAIL: gcc.dg/vmx/3a-01a.c  -O3 -fomit-frame-pointer  (test for excess errors)
WARNING: gcc.dg/vmx/3a-01a.c  -O3 -fomit-frame-pointer  compilation failed to produce executable
FAIL: gcc.dg/vmx/3a-01a.c  -O3 -g  (test for excess errors)
WARNING: gcc.dg/vmx/3a-01a.c  -O3 -g  compilation failed to produce executable
FAIL: gcc.dg/vmx/3a-01a.c  -Os  (test for excess errors)
WARNING: gcc.dg/vmx/3a-01a.c  -Os  compilation failed to produce executable
FAIL: gcc.dg/vmx/3a-01m.c  -O0  (test for excess errors)
WARNING: gcc.dg/vmx/3a-01m.c  -O0  compilation failed to produce executable
FAIL: gcc.dg/vmx/3a-01m.c  -O1  (test for excess errors)
WARNING: gcc.dg/vmx/3a-01m.c  -O1  compilation failed to produce executable
FAIL: gcc.dg/vmx/3a-01m.c  -O2  (test for excess errors)
WARNING: gcc.dg/vmx/3a-01m.c  -O2  compilation failed to produce executable
FAIL: gcc.dg/vmx/3a-01m.c  -O3 -fomit-frame-pointer  (test for excess errors)
WARNING: gcc.dg/vmx/3a-01m.c  -O3 -fomit-frame-pointer  compilation failed to produce executable
FAIL: gcc.dg/vmx/3a-01m.c  -O3 -g  (test for excess errors)
WARNING: gcc.dg/vmx/3a-01m.c  -O3 -g  compilation failed to produce executable
FAIL: gcc.dg/vmx/3a-01m.c  -Os  (test for excess errors)
WARNING: gcc.dg/vmx/3a-01m.c  -Os  compilation failed to produce executable
FAIL: gcc.dg/vmx/3a-03.c  -O0  (test for excess errors)
WARNING: gcc.dg/vmx/3a-03.c  -O0  compilation failed to produce executable
FAIL: gcc.dg/vmx/3a-03.c  -O1  (test for excess errors)
WARNING: gcc.dg/vmx/3a-03.c  -O1  compilation failed to produce executable
FAIL: gcc.dg/vmx/3a-03.c  -O2  (test for excess errors)
WARNING: gcc.dg/vmx/3a-03.c  -O2  compilation failed to produce executable
FAIL: gcc.dg/vmx/3a-03.c  -O3 -fomit-frame-pointer  (test for excess errors)
WARNING: gcc.dg/vmx/3a-03.c  -O3 -fomit-frame-pointer  compilation failed to produce executable
FAIL: gcc.dg/vmx/3a-03.c  -O3 -g  (test for excess errors)
WARNING: gcc.dg/vmx/3a-03.c  -O3 -g  compilation failed to produce executable
FAIL: gcc.dg/vmx/3a-03.c  -Os  (test for excess errors)
WARNING: gcc.dg/vmx/3a-03.c  -Os  compilation failed to produce executable
FAIL: gcc.dg/vmx/3a-03m.c  -O0  (test for excess errors)
WARNING: gcc.dg/vmx/3a-03m.c  -O0  compilation failed to produce executable
FAIL: gcc.dg/vmx/3a-03m.c  -O1  (test for excess errors)
WARNING: gcc.dg/vmx/3a-03m.c  -O1  compilation failed to produce executable
FAIL: gcc.dg/vmx/3a-03m.c  -O2  (test for excess errors)
WARNING: gcc.dg/vmx/3a-03m.c  -O2  compilation failed to produce executable
FAIL: gcc.dg/vmx/3a-03m.c  -O3 -fomit-frame-pointer  (test for excess errors)
WARNING: gcc.dg/vmx/3a-03m.c  -O3 -fomit-frame-pointer  compilation failed to produce executable
FAIL: gcc.dg/vmx/3a-03m.c  -O3 -g  (test for excess errors)
WARNING: gcc.dg/vmx/3a-03m.c  -O3 -g  compilation failed to produce executable
FAIL: gcc.dg/vmx/3a-03m.c  -Os  (test for excess errors)
WARNING: gcc.dg/vmx/3a-03m.c  -Os  compilation failed to produce executable
FAIL: gcc.dg/vmx/3a-04.c  -O0  (test for excess errors)
WARNING: gcc.dg/vmx/3a-04.c  -O0  compilation failed to produce executable
FAIL: gcc.dg/vmx/3a-04.c  -O1  (test for excess errors)
WARNING: gcc.dg/vmx/3a-04.c  -O1  compilation failed to produce executable
FAIL: gcc.dg/vmx/3a-04.c  -O2  (test for excess errors)
WARNING: gcc.dg/vmx/3a-04.c  -O2  compilation failed to produce executable
FAIL: gcc.dg/vmx/3a-04.c  -O3 -fomit-frame-pointer  (test for excess errors)
WARNING: gcc.dg/vmx/3a-04.c  -O3 -fomit-frame-pointer  compilation failed to produce executable
FAIL: gcc.dg/vmx/3a-04.c  -O3 -g  (test for excess errors)
WARNING: gcc.dg/vmx/3a-04.c  -O3 -g  compilation failed to produce executable
FAIL: gcc.dg/vmx/3a-04.c  -Os  (test for excess errors)
WARNING: gcc.dg/vmx/3a-04.c  -Os  compilation failed to produce executable
FAIL: gcc.dg/vmx/3a-04m.c  -O0  (test for excess errors)
WARNING: gcc.dg/vmx/3a-04m.c  -O0  compilation failed to produce executable
FAIL: gcc.dg/vmx/3a-04m.c  -O1  (test for excess errors)
WARNING: gcc.dg/vmx/3a-04m.c  -O1  compilation failed to produce executable
FAIL: gcc.dg/vmx/3a-04m.c  -O2  (test for excess errors)
WARNING: gcc.dg/vmx/3a-04m.c  -O2  compilation failed to produce executable
FAIL: gcc.dg/vmx/3a-04m.c  -O3 -fomit-frame-pointer  (test for excess errors)
WARNING: gcc.dg/vmx/3a-04m.c  -O3 -fomit-frame-pointer  compilation failed to produce executable
FAIL: gcc.dg/vmx/3a-04m.c  -O3 -g  (test for excess errors)
WARNING: gcc.dg/vmx/3a-04m.c  -O3 -g  compilation failed to produce executable
FAIL: gcc.dg/vmx/3a-04m.c  -Os  (test for excess errors)
WARNING: gcc.dg/vmx/3a-04m.c  -Os  compilation failed to produce executable
FAIL: gcc.dg/vmx/3a-05.c  -O0  (test for excess errors)
WARNING: gcc.dg/vmx/3a-05.c  -O0  compilation failed to produce executable
FAIL: gcc.dg/vmx/3a-05.c  -O1  (test for excess errors)
WARNING: gcc.dg/vmx/3a-05.c  -O1  compilation failed to produce executable
FAIL: gcc.dg/vmx/3a-05.c  -O2  (test for excess errors)
WARNING: gcc.dg/vmx/3a-05.c  -O2  compilation failed to produce executable
FAIL: gcc.dg/vmx/3a-05.c  -O3 -fomit-frame-pointer  (test for excess errors)
WARNING: gcc.dg/vmx/3a-05.c  -O3 -fomit-frame-pointer  compilation failed to produce executable
FAIL: gcc.dg/vmx/3a-05.c  -O3 -g  (test for excess errors)
WARNING: gcc.dg/vmx/3a-05.c  -O3 -g  compilation failed to produce executable
FAIL: gcc.dg/vmx/3a-05.c  -Os  (test for excess errors)
WARNING: gcc.dg/vmx/3a-05.c  -Os  compilation failed to produce executable
FAIL: gcc.dg/vmx/3a-06.c  -O0  (test for excess errors)
WARNING: gcc.dg/vmx/3a-06.c  -O0  compilation failed to produce executable
FAIL: gcc.dg/vmx/3a-06.c  -O1  (test for excess errors)
WARNING: gcc.dg/vmx/3a-06.c  -O1  compilation failed to produce executable
FAIL: gcc.dg/vmx/3a-06.c  -O2  (test for excess errors)
WARNING: gcc.dg/vmx/3a-06.c  -O2  compilation failed to produce executable
FAIL: gcc.dg/vmx/3a-06.c  -O3 -fomit-frame-pointer  (test for excess errors)
WARNING: gcc.dg/vmx/3a-06.c  -O3 -fomit-frame-pointer  compilation failed to produce executable
FAIL: gcc.dg/vmx/3a-06.c  -O3 -g  (test for excess errors)
WARNING: gcc.dg/vmx/3a-06.c  -O3 -g  compilation failed to produce executable
FAIL: gcc.dg/vmx/3a-06.c  -Os  (test for excess errors)
WARNING: gcc.dg/vmx/3a-06.c  -Os  compilation failed to produce executable
FAIL: gcc.dg/vmx/3a-06m.c  -O0  (test for excess errors)
WARNING: gcc.dg/vmx/3a-06m.c  -O0  compilation failed to produce executable
FAIL: gcc.dg/vmx/3a-06m.c  -O1  (test for excess errors)
WARNING: gcc.dg/vmx/3a-06m.c  -O1  compilation failed to produce executable
FAIL: gcc.dg/vmx/3a-06m.c  -O2  (test for excess errors)
WARNING: gcc.dg/vmx/3a-06m.c  -O2  compilation failed to produce executable
FAIL: gcc.dg/vmx/3a-06m.c  -O3 -fomit-frame-pointer  (test for excess errors)
WARNING: gcc.dg/vmx/3a-06m.c  -O3 -fomit-frame-pointer  compilation failed to produce executable
FAIL: gcc.dg/vmx/3a-06m.c  -O3 -g  (test for excess errors)
WARNING: gcc.dg/vmx/3a-06m.c  -O3 -g  compilation failed to produce executable
FAIL: gcc.dg/vmx/3a-06m.c  -Os  (test for excess errors)
WARNING: gcc.dg/vmx/3a-06m.c  -Os  compilation failed to produce executable
FAIL: gcc.dg/vmx/3a-07.c  -O0  (test for excess errors)
WARNING: gcc.dg/vmx/3a-07.c  -O0  compilation failed to produce executable
FAIL: gcc.dg/vmx/3a-07.c  -O1  (test for excess errors)
WARNING: gcc.dg/vmx/3a-07.c  -O1  compilation failed to produce executable
FAIL: gcc.dg/vmx/3a-07.c  -O2  (test for excess errors)
WARNING: gcc.dg/vmx/3a-07.c  -O2  compilation failed to produce executable
FAIL: gcc.dg/vmx/3a-07.c  -O3 -fomit-frame-pointer  (test for excess errors)
WARNING: gcc.dg/vmx/3a-07.c  -O3 -fomit-frame-pointer  compilation failed to produce executable
FAIL: gcc.dg/vmx/3a-07.c  -O3 -g  (test for excess errors)
WARNING: gcc.dg/vmx/3a-07.c  -O3 -g  compilation failed to produce executable
FAIL: gcc.dg/vmx/3a-07.c  -Os  (test for excess errors)
WARNING: gcc.dg/vmx/3a-07.c  -Os  compilation failed to produce executable
FAIL: gcc.dg/vmx/3b-01.c  -O0  (test for excess errors)
WARNING: gcc.dg/vmx/3b-01.c  -O0  compilation failed to produce executable
FAIL: gcc.dg/vmx/3b-01.c  -O1  (test for excess errors)
WARNING: gcc.dg/vmx/3b-01.c  -O1  compilation failed to produce executable
FAIL: gcc.dg/vmx/3b-01.c  -O2  (test for excess errors)
WARNING: gcc.dg/vmx/3b-01.c  -O2  compilation failed to produce executable
FAIL: gcc.dg/vmx/3b-01.c  -O3 -fomit-frame-pointer  (test for excess errors)
WARNING: gcc.dg/vmx/3b-01.c  -O3 -fomit-frame-pointer  compilation failed to produce executable
FAIL: gcc.dg/vmx/3b-01.c  -O3 -g  (test for excess errors)
WARNING: gcc.dg/vmx/3b-01.c  -O3 -g  compilation failed to produce executable
FAIL: gcc.dg/vmx/3b-01.c  -Os  (test for excess errors)
WARNING: gcc.dg/vmx/3b-01.c  -Os  compilation failed to produce executable
FAIL: gcc.dg/vmx/3b-02.c  -O0  (test for excess errors)
WARNING: gcc.dg/vmx/3b-02.c  -O0  compilation failed to produce executable
FAIL: gcc.dg/vmx/3b-02.c  -O1  (test for excess errors)
WARNING: gcc.dg/vmx/3b-02.c  -O1  compilation failed to produce executable
FAIL: gcc.dg/vmx/3b-02.c  -O2  (test for excess errors)
WARNING: gcc.dg/vmx/3b-02.c  -O2  compilation failed to produce executable
FAIL: gcc.dg/vmx/3b-02.c  -O3 -fomit-frame-pointer  (test for excess errors)
WARNING: gcc.dg/vmx/3b-02.c  -O3 -fomit-frame-pointer  compilation failed to produce executable
FAIL: gcc.dg/vmx/3b-02.c  -O3 -g  (test for excess errors)
WARNING: gcc.dg/vmx/3b-02.c  -O3 -g  compilation failed to produce executable
FAIL: gcc.dg/vmx/3b-02.c  -Os  (test for excess errors)
WARNING: gcc.dg/vmx/3b-02.c  -Os  compilation failed to produce executable
FAIL: gcc.dg/vmx/3b-10.c  -O0  (test for excess errors)
WARNING: gcc.dg/vmx/3b-10.c  -O0  compilation failed to produce executable
FAIL: gcc.dg/vmx/3b-10.c  -O1  (test for excess errors)
WARNING: gcc.dg/vmx/3b-10.c  -O1  compilation failed to produce executable
FAIL: gcc.dg/vmx/3b-10.c  -O2  (test for excess errors)
WARNING: gcc.dg/vmx/3b-10.c  -O2  compilation failed to produce executable
FAIL: gcc.dg/vmx/3b-10.c  -O3 -fomit-frame-pointer  (test for excess errors)
WARNING: gcc.dg/vmx/3b-10.c  -O3 -fomit-frame-pointer  compilation failed to produce executable
FAIL: gcc.dg/vmx/3b-10.c  -O3 -g  (test for excess errors)
WARNING: gcc.dg/vmx/3b-10.c  -O3 -g  compilation failed to produce executable
FAIL: gcc.dg/vmx/3b-10.c  -Os  (test for excess errors)
WARNING: gcc.dg/vmx/3b-10.c  -Os  compilation failed to produce executable
FAIL: gcc.dg/vmx/3b-13.c  -O0  (test for excess errors)
WARNING: gcc.dg/vmx/3b-13.c  -O0  compilation failed to produce executable
FAIL: gcc.dg/vmx/3b-13.c  -O1  (test for excess errors)
WARNING: gcc.dg/vmx/3b-13.c  -O1  compilation failed to produce executable
FAIL: gcc.dg/vmx/3b-13.c  -O2  (test for excess errors)
WARNING: gcc.dg/vmx/3b-13.c  -O2  compilation failed to produce executable
FAIL: gcc.dg/vmx/3b-13.c  -O3 -fomit-frame-pointer  (test for excess errors)
WARNING: gcc.dg/vmx/3b-13.c  -O3 -fomit-frame-pointer  compilation failed to produce executable
FAIL: gcc.dg/vmx/3b-13.c  -O3 -g  (test for excess errors)
WARNING: gcc.dg/vmx/3b-13.c  -O3 -g  compilation failed to produce executable
FAIL: gcc.dg/vmx/3b-13.c  -Os  (test for excess errors)
WARNING: gcc.dg/vmx/3b-13.c  -Os  compilation failed to produce executable
FAIL: gcc.dg/vmx/3b-14.c  -O0  (test for excess errors)
WARNING: gcc.dg/vmx/3b-14.c  -O0  compilation failed to produce executable
FAIL: gcc.dg/vmx/3b-14.c  -O1  (test for excess errors)
WARNING: gcc.dg/vmx/3b-14.c  -O1  compilation failed to produce executable
FAIL: gcc.dg/vmx/3b-14.c  -O2  (test for excess errors)
WARNING: gcc.dg/vmx/3b-14.c  -O2  compilation failed to produce executable
FAIL: gcc.dg/vmx/3b-14.c  -O3 -fomit-frame-pointer  (test for excess errors)
WARNING: gcc.dg/vmx/3b-14.c  -O3 -fomit-frame-pointer  compilation failed to produce executable
FAIL: gcc.dg/vmx/3b-14.c  -O3 -g  (test for excess errors)
WARNING: gcc.dg/vmx/3b-14.c  -O3 -g  compilation failed to produce executable
FAIL: gcc.dg/vmx/3b-14.c  -Os  (test for excess errors)
WARNING: gcc.dg/vmx/3b-14.c  -Os  compilation failed to produce executable
FAIL: gcc.dg/vmx/3b-15.c  -O0  (test for excess errors)
WARNING: gcc.dg/vmx/3b-15.c  -O0  compilation failed to produce executable
FAIL: gcc.dg/vmx/3b-15.c  -O1  (test for excess errors)
WARNING: gcc.dg/vmx/3b-15.c  -O1  compilation failed to produce executable
FAIL: gcc.dg/vmx/3b-15.c  -O2  (test for excess errors)
WARNING: gcc.dg/vmx/3b-15.c  -O2  compilation failed to produce executable
FAIL: gcc.dg/vmx/3b-15.c  -O3 -fomit-frame-pointer  (test for excess errors)
WARNING: gcc.dg/vmx/3b-15.c  -O3 -fomit-frame-pointer  compilation failed to produce executable
FAIL: gcc.dg/vmx/3b-15.c  -O3 -g  (test for excess errors)
WARNING: gcc.dg/vmx/3b-15.c  -O3 -g  compilation failed to produce executable
FAIL: gcc.dg/vmx/3b-15.c  -Os  (test for excess errors)
WARNING: gcc.dg/vmx/3b-15.c  -Os  compilation failed to produce executable
FAIL: gcc.dg/vmx/3c-01.c  -O0  (test for excess errors)
WARNING: gcc.dg/vmx/3c-01.c  -O0  compilation failed to produce executable
FAIL: gcc.dg/vmx/3c-01.c  -O1  (test for excess errors)
WARNING: gcc.dg/vmx/3c-01.c  -O1  compilation failed to produce executable
FAIL: gcc.dg/vmx/3c-01.c  -O2  (test for excess errors)
WARNING: gcc.dg/vmx/3c-01.c  -O2  compilation failed to produce executable
FAIL: gcc.dg/vmx/3c-01.c  -O3 -fomit-frame-pointer  (test for excess errors)
WARNING: gcc.dg/vmx/3c-01.c  -O3 -fomit-frame-pointer  compilation failed to produce executable
FAIL: gcc.dg/vmx/3c-01.c  -O3 -g  (test for excess errors)
WARNING: gcc.dg/vmx/3c-01.c  -O3 -g  compilation failed to produce executable
FAIL: gcc.dg/vmx/3c-01.c  -Os  (test for excess errors)
WARNING: gcc.dg/vmx/3c-01.c  -Os  compilation failed to produce executable
FAIL: gcc.dg/vmx/3c-01a.c  -O0  (test for excess errors)
FAIL: gcc.dg/vmx/3c-01a.c  -O1  (test for excess errors)
FAIL: gcc.dg/vmx/3c-01a.c  -O2  (test for excess errors)
FAIL: gcc.dg/vmx/3c-01a.c  -O3 -fomit-frame-pointer  (test for excess errors)
FAIL: gcc.dg/vmx/3c-01a.c  -O3 -g  (test for excess errors)
FAIL: gcc.dg/vmx/3c-01a.c  -Os  (test for excess errors)
FAIL: gcc.dg/vmx/3c-02.c  -O0  (test for excess errors)
WARNING: gcc.dg/vmx/3c-02.c  -O0  compilation failed to produce executable
FAIL: gcc.dg/vmx/3c-02.c  -O1  (test for excess errors)
WARNING: gcc.dg/vmx/3c-02.c  -O1  compilation failed to produce executable
FAIL: gcc.dg/vmx/3c-02.c  -O2  (test for excess errors)
WARNING: gcc.dg/vmx/3c-02.c  -O2  compilation failed to produce executable
FAIL: gcc.dg/vmx/3c-02.c  -O3 -fomit-frame-pointer  (test for excess errors)
WARNING: gcc.dg/vmx/3c-02.c  -O3 -fomit-frame-pointer  compilation failed to produce executable
FAIL: gcc.dg/vmx/3c-02.c  -O3 -g  (test for excess errors)
WARNING: gcc.dg/vmx/3c-02.c  -O3 -g  compilation failed to produce executable
FAIL: gcc.dg/vmx/3c-02.c  -Os  (test for excess errors)
WARNING: gcc.dg/vmx/3c-02.c  -Os  compilation failed to produce executable
FAIL: gcc.dg/vmx/3c-03.c  -O0  (test for excess errors)
WARNING: gcc.dg/vmx/3c-03.c  -O0  compilation failed to produce executable
FAIL: gcc.dg/vmx/3c-03.c  -O1  (test for excess errors)
WARNING: gcc.dg/vmx/3c-03.c  -O1  compilation failed to produce executable
FAIL: gcc.dg/vmx/3c-03.c  -O2  (test for excess errors)
WARNING: gcc.dg/vmx/3c-03.c  -O2  compilation failed to produce executable
FAIL: gcc.dg/vmx/3c-03.c  -O3 -fomit-frame-pointer  (test for excess errors)
WARNING: gcc.dg/vmx/3c-03.c  -O3 -fomit-frame-pointer  compilation failed to produce executable
FAIL: gcc.dg/vmx/3c-03.c  -O3 -g  (test for excess errors)
WARNING: gcc.dg/vmx/3c-03.c  -O3 -g  compilation failed to produce executable
FAIL: gcc.dg/vmx/3c-03.c  -Os  (test for excess errors)
WARNING: gcc.dg/vmx/3c-03.c  -Os  compilation failed to produce executable
FAIL: gcc.dg/vmx/3d-01.c  -O0  (test for excess errors)
FAIL: gcc.dg/vmx/4-01.c  -O0  (test for excess errors)
FAIL: gcc.dg/vmx/4-03.c  -O0  (test for excess errors)
FAIL: gcc.dg/vmx/5-04.c  -O0  (test for excess errors)
FAIL: gcc.dg/vmx/5-04.c  -O1  (test for excess errors)
FAIL: gcc.dg/vmx/5-04.c  -O2  (test for excess errors)
FAIL: gcc.dg/vmx/5-04.c  -O3 -fomit-frame-pointer  (test for excess errors)
FAIL: gcc.dg/vmx/5-04.c  -O3 -g  (test for excess errors)
FAIL: gcc.dg/vmx/5-04.c  -Os  (test for excess errors)
FAIL: gcc.dg/vmx/5-10.c  -O0  (test for excess errors)
FAIL: gcc.dg/vmx/5-10.c  -O1  (test for excess errors)
FAIL: gcc.dg/vmx/5-10.c  -O2  (test for excess errors)
FAIL: gcc.dg/vmx/5-10.c  -O3 -fomit-frame-pointer  (test for excess errors)
FAIL: gcc.dg/vmx/5-10.c  -O3 -g  (test for excess errors)
FAIL: gcc.dg/vmx/5-10.c  -Os  (test for excess errors)
FAIL: gcc.dg/vmx/5-11.c  -O0  (test for excess errors)
FAIL: gcc.dg/vmx/5-11.c  -O1  (test for excess errors)
FAIL: gcc.dg/vmx/7-01.c  -O0  (test for excess errors)
FAIL: gcc.dg/vmx/7-01.c  -O1  (test for excess errors)
FAIL: gcc.dg/vmx/7-01.c  -O2  (test for excess errors)
FAIL: gcc.dg/vmx/7-01.c  -O3 -fomit-frame-pointer  (test for excess errors)
FAIL: gcc.dg/vmx/7-01.c  -O3 -fomit-frame-pointer -funroll-loops  (test for excess errors)
FAIL: gcc.dg/vmx/7-01.c  -O3 -fomit-frame-pointer -funroll-all-loops -finline-functions  (test for excess errors)
FAIL: gcc.dg/vmx/7-01.c  -O3 -g  (test for excess errors)
FAIL: gcc.dg/vmx/7-01.c  -Os  (test for excess errors)
FAIL: gcc.dg/vmx/7-01a.c  -O0  (test for excess errors)
FAIL: gcc.dg/vmx/7-01a.c  -O1  (test for excess errors)
FAIL: gcc.dg/vmx/7-01a.c  -O2  (test for excess errors)
FAIL: gcc.dg/vmx/7-01a.c  -O3 -fomit-frame-pointer  (test for excess errors)
FAIL: gcc.dg/vmx/7-01a.c  -O3 -fomit-frame-pointer -funroll-loops  (test for excess errors)
FAIL: gcc.dg/vmx/7-01a.c  -O3 -fomit-frame-pointer -funroll-all-loops -finline-functions  (test for excess errors)
FAIL: gcc.dg/vmx/7-01a.c  -O3 -g  (test for excess errors)
FAIL: gcc.dg/vmx/7-01a.c  -Os  (test for excess errors)
FAIL: gcc.dg/vmx/7c-01.c  -O0  (test for excess errors)
FAIL: gcc.dg/vmx/7c-01.c  -O1  (test for excess errors)
FAIL: gcc.dg/vmx/7c-01.c  -O2  (test for excess errors)
FAIL: gcc.dg/vmx/7c-01.c  -O3 -fomit-frame-pointer  (test for excess errors)
FAIL: gcc.dg/vmx/7c-01.c  -O3 -g  (test for excess errors)
FAIL: gcc.dg/vmx/7c-01.c  -Os  (test for excess errors)
FAIL: gcc.dg/vmx/7d-01.c  -O0  (test for excess errors)
FAIL: gcc.dg/vmx/7d-02.c  -O0  (test for excess errors)
FAIL: gcc.dg/vmx/brode-1.c  -O0  (test for excess errors)
WARNING: gcc.dg/vmx/brode-1.c  -O0  compilation failed to produce executable
FAIL: gcc.dg/vmx/brode-1.c  -O1  (test for excess errors)
WARNING: gcc.dg/vmx/brode-1.c  -O1  compilation failed to produce executable
FAIL: gcc.dg/vmx/brode-1.c  -O2  (test for excess errors)
WARNING: gcc.dg/vmx/brode-1.c  -O2  compilation failed to produce executable
FAIL: gcc.dg/vmx/brode-1.c  -O3 -fomit-frame-pointer  (test for excess errors)
WARNING: gcc.dg/vmx/brode-1.c  -O3 -fomit-frame-pointer  compilation failed to produce executable
FAIL: gcc.dg/vmx/brode-1.c  -O3 -g  (test for excess errors)
WARNING: gcc.dg/vmx/brode-1.c  -O3 -g  compilation failed to produce executable
FAIL: gcc.dg/vmx/brode-1.c  -Os  (test for excess errors)
WARNING: gcc.dg/vmx/brode-1.c  -Os  compilation failed to produce executable
FAIL: gcc.dg/vmx/bug-1.c  -O0  (test for excess errors)
WARNING: gcc.dg/vmx/bug-1.c  -O0  compilation failed to produce executable
FAIL: gcc.dg/vmx/bug-1.c  -O1  (test for excess errors)
WARNING: gcc.dg/vmx/bug-1.c  -O1  compilation failed to produce executable
FAIL: gcc.dg/vmx/bug-1.c  -O2  (test for excess errors)
WARNING: gcc.dg/vmx/bug-1.c  -O2  compilation failed to produce executable
FAIL: gcc.dg/vmx/bug-1.c  -O3 -fomit-frame-pointer  (test for excess errors)
WARNING: gcc.dg/vmx/bug-1.c  -O3 -fomit-frame-pointer  compilation failed to produce executable
FAIL: gcc.dg/vmx/bug-1.c  -O3 -fomit-frame-pointer -funroll-loops  (test for excess errors)
WARNING: gcc.dg/vmx/bug-1.c  -O3 -fomit-frame-pointer -funroll-loops  compilation failed to produce executable
FAIL: gcc.dg/vmx/bug-1.c  -O3 -fomit-frame-pointer -funroll-all-loops -finline-functions  (test for excess errors)
WARNING: gcc.dg/vmx/bug-1.c  -O3 -fomit-frame-pointer -funroll-all-loops -finline-functions  compilation failed to produce executable
FAIL: gcc.dg/vmx/bug-1.c  -O3 -g  (test for excess errors)
WARNING: gcc.dg/vmx/bug-1.c  -O3 -g  compilation failed to produce executable
FAIL: gcc.dg/vmx/bug-1.c  -Os  (test for excess errors)
WARNING: gcc.dg/vmx/bug-1.c  -Os  compilation failed to produce executable
FAIL: gcc.dg/vmx/bug-2.c  -O0  (test for excess errors)
WARNING: gcc.dg/vmx/bug-2.c  -O0  compilation failed to produce executable
FAIL: gcc.dg/vmx/bug-2.c  -O1  (test for excess errors)
WARNING: gcc.dg/vmx/bug-2.c  -O1  compilation failed to produce executable
FAIL: gcc.dg/vmx/bug-2.c  -O2  (test for excess errors)
WARNING: gcc.dg/vmx/bug-2.c  -O2  compilation failed to produce executable
FAIL: gcc.dg/vmx/bug-2.c  -O3 -fomit-frame-pointer  (test for excess errors)
WARNING: gcc.dg/vmx/bug-2.c  -O3 -fomit-frame-pointer  compilation failed to produce executable
FAIL: gcc.dg/vmx/bug-2.c  -O3 -g  (test for excess errors)
WARNING: gcc.dg/vmx/bug-2.c  -O3 -g  compilation failed to produce executable
FAIL: gcc.dg/vmx/bug-2.c  -Os  (test for excess errors)
WARNING: gcc.dg/vmx/bug-2.c  -Os  compilation failed to produce executable
FAIL: gcc.dg/vmx/bug-3.c  -O0  (test for excess errors)
WARNING: gcc.dg/vmx/bug-3.c  -O0  compilation failed to produce executable
FAIL: gcc.dg/vmx/bug-3.c  -O1  (test for excess errors)
WARNING: gcc.dg/vmx/bug-3.c  -O1  compilation failed to produce executable
FAIL: gcc.dg/vmx/bug-3.c  -O2  (test for excess errors)
WARNING: gcc.dg/vmx/bug-3.c  -O2  compilation failed to produce executable
FAIL: gcc.dg/vmx/bug-3.c  -O3 -fomit-frame-pointer  (test for excess errors)
WARNING: gcc.dg/vmx/bug-3.c  -O3 -fomit-frame-pointer  compilation failed to produce executable
FAIL: gcc.dg/vmx/bug-3.c  -O3 -g  (test for excess errors)
WARNING: gcc.dg/vmx/bug-3.c  -O3 -g  compilation failed to produce executable
FAIL: gcc.dg/vmx/bug-3.c  -Os  (test for excess errors)
WARNING: gcc.dg/vmx/bug-3.c  -Os  compilation failed to produce executable
FAIL: gcc.dg/vmx/cw-bug-1.c  -O0  (test for excess errors)
WARNING: gcc.dg/vmx/cw-bug-1.c  -O0  compilation failed to produce executable
FAIL: gcc.dg/vmx/cw-bug-1.c  -O1  (test for excess errors)
WARNING: gcc.dg/vmx/cw-bug-1.c  -O1  compilation failed to produce executable
FAIL: gcc.dg/vmx/cw-bug-1.c  -O2  (test for excess errors)
WARNING: gcc.dg/vmx/cw-bug-1.c  -O2  compilation failed to produce executable
FAIL: gcc.dg/vmx/cw-bug-1.c  -O3 -fomit-frame-pointer  (test for excess errors)
WARNING: gcc.dg/vmx/cw-bug-1.c  -O3 -fomit-frame-pointer  compilation failed to produce executable
FAIL: gcc.dg/vmx/cw-bug-1.c  -O3 -g  (test for excess errors)
WARNING: gcc.dg/vmx/cw-bug-1.c  -O3 -g  compilation failed to produce executable
FAIL: gcc.dg/vmx/cw-bug-1.c  -Os  (test for excess errors)
WARNING: gcc.dg/vmx/cw-bug-1.c  -Os  compilation failed to produce executable
FAIL: gcc.dg/vmx/dct.c  -O0  (test for excess errors)
FAIL: gcc.dg/vmx/dct.c  -O1  (test for excess errors)
FAIL: gcc.dg/vmx/dct.c  -O2  (test for excess errors)
FAIL: gcc.dg/vmx/dct.c  -O3 -fomit-frame-pointer  (test for excess errors)
FAIL: gcc.dg/vmx/dct.c  -O3 -g  (test for excess errors)
FAIL: gcc.dg/vmx/dct.c  -Os  (test for excess errors)
FAIL: gcc.dg/vmx/debug-3.c  -O0  (test for excess errors)
WARNING: gcc.dg/vmx/debug-3.c  -O0  compilation failed to produce executable
FAIL: gcc.dg/vmx/debug-3.c  -O1  (test for excess errors)
WARNING: gcc.dg/vmx/debug-3.c  -O1  compilation failed to produce executable
FAIL: gcc.dg/vmx/debug-3.c  -O2  (test for excess errors)
WARNING: gcc.dg/vmx/debug-3.c  -O2  compilation failed to produce executable
FAIL: gcc.dg/vmx/debug-3.c  -O3 -fomit-frame-pointer  (test for excess errors)
WARNING: gcc.dg/vmx/debug-3.c  -O3 -fomit-frame-pointer  compilation failed to produce executable
FAIL: gcc.dg/vmx/debug-3.c  -O3 -g  (test for excess errors)
WARNING: gcc.dg/vmx/debug-3.c  -O3 -g  compilation failed to produce executable
FAIL: gcc.dg/vmx/debug-3.c  -Os  (test for excess errors)
WARNING: gcc.dg/vmx/debug-3.c  -Os  compilation failed to produce executable
FAIL: gcc.dg/vmx/debug-4.c  -O0  (test for excess errors)
WARNING: gcc.dg/vmx/debug-4.c  -O0  compilation failed to produce executable
FAIL: gcc.dg/vmx/debug-4.c  -O1  (test for excess errors)
WARNING: gcc.dg/vmx/debug-4.c  -O1  compilation failed to produce executable
FAIL: gcc.dg/vmx/debug-4.c  -O2  (test for excess errors)
WARNING: gcc.dg/vmx/debug-4.c  -O2  compilation failed to produce executable
FAIL: gcc.dg/vmx/debug-4.c  -O3 -fomit-frame-pointer  (test for excess errors)
WARNING: gcc.dg/vmx/debug-4.c  -O3 -fomit-frame-pointer  compilation failed to produce executable
FAIL: gcc.dg/vmx/debug-4.c  -O3 -g  (test for excess errors)
WARNING: gcc.dg/vmx/debug-4.c  -O3 -g  compilation failed to produce executable
FAIL: gcc.dg/vmx/debug-4.c  -Os  (test for excess errors)
WARNING: gcc.dg/vmx/debug-4.c  -Os  compilation failed to produce executable
FAIL: gcc.dg/vmx/dos-bug-1-gdb.c  -O0  (test for excess errors)
WARNING: gcc.dg/vmx/dos-bug-1-gdb.c  -O0  compilation failed to produce executable
FAIL: gcc.dg/vmx/dos-bug-2-gdb.c  -O0  (test for excess errors)
WARNING: gcc.dg/vmx/dos-bug-2-gdb.c  -O0  compilation failed to produce executable
FAIL: gcc.dg/vmx/eg-5.c  -O0  (test for excess errors)
WARNING: gcc.dg/vmx/eg-5.c  -O0  compilation failed to produce executable
FAIL: gcc.dg/vmx/eg-5.c  -O1  (test for excess errors)
WARNING: gcc.dg/vmx/eg-5.c  -O1  compilation failed to produce executable
FAIL: gcc.dg/vmx/eg-5.c  -O2  (test for excess errors)
WARNING: gcc.dg/vmx/eg-5.c  -O2  compilation failed to produce executable
FAIL: gcc.dg/vmx/eg-5.c  -O3 -fomit-frame-pointer  (test for excess errors)
WARNING: gcc.dg/vmx/eg-5.c  -O3 -fomit-frame-pointer  compilation failed to produce executable
FAIL: gcc.dg/vmx/eg-5.c  -O3 -g  (test for excess errors)
WARNING: gcc.dg/vmx/eg-5.c  -O3 -g  compilation failed to produce executable
FAIL: gcc.dg/vmx/eg-5.c  -Os  (test for excess errors)
WARNING: gcc.dg/vmx/eg-5.c  -Os  compilation failed to produce executable
FAIL: gcc.dg/vmx/fft.c  -O0  (test for excess errors)
FAIL: gcc.dg/vmx/fft.c  -O1  (test for excess errors)
FAIL: gcc.dg/vmx/fft.c  -O2  (test for excess errors)
FAIL: gcc.dg/vmx/fft.c  -O3 -fomit-frame-pointer  (test for excess errors)
FAIL: gcc.dg/vmx/fft.c  -O3 -fomit-frame-pointer -funroll-loops  (test for excess errors)
FAIL: gcc.dg/vmx/fft.c  -O3 -fomit-frame-pointer -funroll-all-loops -finline-functions  (test for excess errors)
FAIL: gcc.dg/vmx/fft.c  -O3 -g  (test for excess errors)
FAIL: gcc.dg/vmx/fft.c  -Os  (test for excess errors)
FAIL: gcc.dg/vmx/gcc-bug-1.c  -O0  (test for excess errors)
FAIL: gcc.dg/vmx/gcc-bug-1.c  -O1  (test for excess errors)
FAIL: gcc.dg/vmx/gcc-bug-1.c  -O2  (test for excess errors)
FAIL: gcc.dg/vmx/gcc-bug-1.c  -O3 -fomit-frame-pointer  (test for excess errors)
FAIL: gcc.dg/vmx/gcc-bug-1.c  -O3 -g  (test for excess errors)
FAIL: gcc.dg/vmx/gcc-bug-1.c  -Os  (test for excess errors)
FAIL: gcc.dg/vmx/gcc-bug-3.c  -O0  (test for excess errors)
FAIL: gcc.dg/vmx/gcc-bug-5.c  -O0  (test for excess errors)
FAIL: gcc.dg/vmx/gcc-bug-6.c  -O0  (test for excess errors)
FAIL: gcc.dg/vmx/gcc-bug-7.c  -O0  (test for excess errors)
FAIL: gcc.dg/vmx/gcc-bug-7.c  -O1  (test for excess errors)
FAIL: gcc.dg/vmx/gcc-bug-7.c  -O2  (test for excess errors)
FAIL: gcc.dg/vmx/gcc-bug-7.c  -O3 -fomit-frame-pointer  (test for excess errors)
FAIL: gcc.dg/vmx/gcc-bug-7.c  -O3 -g  (test for excess errors)
FAIL: gcc.dg/vmx/gcc-bug-7.c  -Os  (test for excess errors)
FAIL: gcc.dg/vmx/gcc-bug-b.c  -O0  (test for excess errors)
FAIL: gcc.dg/vmx/gcc-bug-b.c  -O1  (test for excess errors)
FAIL: gcc.dg/vmx/gcc-bug-b.c  -O2  (test for excess errors)
FAIL: gcc.dg/vmx/gcc-bug-b.c  -O3 -fomit-frame-pointer  (test for excess errors)
FAIL: gcc.dg/vmx/gcc-bug-b.c  -O3 -g  (test for excess errors)
FAIL: gcc.dg/vmx/gcc-bug-b.c  -Os  (test for excess errors)
FAIL: gcc.dg/vmx/gcc-bug-c.c  -O0  (test for excess errors)
FAIL: gcc.dg/vmx/gcc-bug-c.c  -O1  (test for excess errors)
FAIL: gcc.dg/vmx/gcc-bug-c.c  -O2  (test for excess errors)
FAIL: gcc.dg/vmx/gcc-bug-c.c  -O3 -fomit-frame-pointer  (test for excess errors)
FAIL: gcc.dg/vmx/gcc-bug-c.c  -O3 -g  (test for excess errors)
FAIL: gcc.dg/vmx/gcc-bug-c.c  -Os  (test for excess errors)
FAIL: gcc.dg/vmx/gcc-bug-d.c  -O0  (test for excess errors)
FAIL: gcc.dg/vmx/gcc-bug-d.c  -O1  (test for excess errors)
FAIL: gcc.dg/vmx/gcc-bug-d.c  -O2  (test for excess errors)
FAIL: gcc.dg/vmx/gcc-bug-d.c  -O3 -fomit-frame-pointer  (test for excess errors)
FAIL: gcc.dg/vmx/gcc-bug-d.c  -O3 -g  (test for excess errors)
FAIL: gcc.dg/vmx/gcc-bug-d.c  -Os  (test for excess errors)
FAIL: gcc.dg/vmx/gcc-bug-e.c  -O0  (test for excess errors)
WARNING: gcc.dg/vmx/gcc-bug-e.c  -O0  compilation failed to produce executable
FAIL: gcc.dg/vmx/gcc-bug-e.c  -O1  (test for excess errors)
WARNING: gcc.dg/vmx/gcc-bug-e.c  -O1  compilation failed to produce executable
FAIL: gcc.dg/vmx/gcc-bug-e.c  -O2  (test for excess errors)
WARNING: gcc.dg/vmx/gcc-bug-e.c  -O2  compilation failed to produce executable
FAIL: gcc.dg/vmx/gcc-bug-e.c  -O3 -fomit-frame-pointer  (test for excess errors)
WARNING: gcc.dg/vmx/gcc-bug-e.c  -O3 -fomit-frame-pointer  compilation failed to produce executable
FAIL: gcc.dg/vmx/gcc-bug-e.c  -O3 -g  (test for excess errors)
WARNING: gcc.dg/vmx/gcc-bug-e.c  -O3 -g  compilation failed to produce executable
FAIL: gcc.dg/vmx/gcc-bug-e.c  -Os  (test for excess errors)
WARNING: gcc.dg/vmx/gcc-bug-e.c  -Os  compilation failed to produce executable
FAIL: gcc.dg/vmx/gcc-bug-f.c  -O0  (test for excess errors)
FAIL: gcc.dg/vmx/gcc-bug-f.c  -O1  (test for excess errors)
FAIL: gcc.dg/vmx/gcc-bug-f.c  -O2  (test for excess errors)
FAIL: gcc.dg/vmx/gcc-bug-f.c  -O3 -fomit-frame-pointer  (test for excess errors)
FAIL: gcc.dg/vmx/gcc-bug-f.c  -O3 -g  (test for excess errors)
FAIL: gcc.dg/vmx/gcc-bug-f.c  -Os  (test for excess errors)
FAIL: gcc.dg/vmx/gcc-bug-g.c  -O0  (test for excess errors)
FAIL: gcc.dg/vmx/gcc-bug-g.c  -O1  (test for excess errors)
FAIL: gcc.dg/vmx/gcc-bug-g.c  -O2  (test for excess errors)
FAIL: gcc.dg/vmx/gcc-bug-g.c  -O3 -fomit-frame-pointer  (test for excess errors)
FAIL: gcc.dg/vmx/gcc-bug-g.c  -O3 -g  (test for excess errors)
FAIL: gcc.dg/vmx/gcc-bug-g.c  -Os  (test for excess errors)
FAIL: gcc.dg/vmx/gcc-bug-i.c  -O0  (test for excess errors)
WARNING: gcc.dg/vmx/gcc-bug-i.c  -O0  compilation failed to produce executable
FAIL: gcc.dg/vmx/gcc-bug-i.c  -O1  (test for excess errors)
WARNING: gcc.dg/vmx/gcc-bug-i.c  -O1  compilation failed to produce executable
FAIL: gcc.dg/vmx/gcc-bug-i.c  -O2  (test for excess errors)
WARNING: gcc.dg/vmx/gcc-bug-i.c  -O2  compilation failed to produce executable
FAIL: gcc.dg/vmx/gcc-bug-i.c  -O3 -fomit-frame-pointer  (test for excess errors)
WARNING: gcc.dg/vmx/gcc-bug-i.c  -O3 -fomit-frame-pointer  compilation failed to produce executable
FAIL: gcc.dg/vmx/gcc-bug-i.c  -O3 -fomit-frame-pointer -funroll-loops  (test for excess errors)
WARNING: gcc.dg/vmx/gcc-bug-i.c  -O3 -fomit-frame-pointer -funroll-loops  compilation failed to produce executable
FAIL: gcc.dg/vmx/gcc-bug-i.c  -O3 -fomit-frame-pointer -funroll-all-loops -finline-functions  (test for excess errors)
WARNING: gcc.dg/vmx/gcc-bug-i.c  -O3 -fomit-frame-pointer -funroll-all-loops -finline-functions  compilation failed to produce executable
FAIL: gcc.dg/vmx/gcc-bug-i.c  -O3 -g  (test for excess errors)
WARNING: gcc.dg/vmx/gcc-bug-i.c  -O3 -g  compilation failed to produce executable
FAIL: gcc.dg/vmx/gcc-bug-i.c  -Os  (test for excess errors)
WARNING: gcc.dg/vmx/gcc-bug-i.c  -Os  compilation failed to produce executable
FAIL: gcc.dg/vmx/ira1.c  -O0  (test for excess errors)
WARNING: gcc.dg/vmx/ira1.c  -O0  compilation failed to produce executable
FAIL: gcc.dg/vmx/ira1.c  -O1  (test for excess errors)
WARNING: gcc.dg/vmx/ira1.c  -O1  compilation failed to produce executable
FAIL: gcc.dg/vmx/ira1.c  -O2  (test for excess errors)
WARNING: gcc.dg/vmx/ira1.c  -O2  compilation failed to produce executable
FAIL: gcc.dg/vmx/ira1.c  -O3 -fomit-frame-pointer  (test for excess errors)
WARNING: gcc.dg/vmx/ira1.c  -O3 -fomit-frame-pointer  compilation failed to produce executable
FAIL: gcc.dg/vmx/ira1.c  -O3 -g  (test for excess errors)
WARNING: gcc.dg/vmx/ira1.c  -O3 -g  compilation failed to produce executable
FAIL: gcc.dg/vmx/ira1.c  -Os  (test for excess errors)
WARNING: gcc.dg/vmx/ira1.c  -Os  compilation failed to produce executable
FAIL: gcc.dg/vmx/ira2.c  -O0  (test for excess errors)
FAIL: gcc.dg/vmx/ira2.c  -O1  (test for excess errors)
FAIL: gcc.dg/vmx/ira2.c  -O2  (test for excess errors)
FAIL: gcc.dg/vmx/ira2.c  -O3 -fomit-frame-pointer  (test for excess errors)
FAIL: gcc.dg/vmx/ira2.c  -O3 -g  (test for excess errors)
FAIL: gcc.dg/vmx/ira2.c  -Os  (test for excess errors)
FAIL: gcc.dg/vmx/ira2b.c  -O0  (test for excess errors)
WARNING: gcc.dg/vmx/ira2b.c  -O0  compilation failed to produce executable
FAIL: gcc.dg/vmx/ira2b.c  -O1  (test for excess errors)
WARNING: gcc.dg/vmx/ira2b.c  -O1  compilation failed to produce executable
FAIL: gcc.dg/vmx/ira2b.c  -O2  (test for excess errors)
WARNING: gcc.dg/vmx/ira2b.c  -O2  compilation failed to produce executable
FAIL: gcc.dg/vmx/ira2b.c  -O3 -fomit-frame-pointer  (test for excess errors)
WARNING: gcc.dg/vmx/ira2b.c  -O3 -fomit-frame-pointer  compilation failed to produce executable
FAIL: gcc.dg/vmx/ira2b.c  -O3 -g  (test for excess errors)
WARNING: gcc.dg/vmx/ira2b.c  -O3 -g  compilation failed to produce executable
FAIL: gcc.dg/vmx/ira2b.c  -Os  (test for excess errors)
WARNING: gcc.dg/vmx/ira2b.c  -Os  compilation failed to produce executable
FAIL: gcc.dg/vmx/mem.c  -O0  (test for excess errors)
FAIL: gcc.dg/vmx/mem.c  -O1  (test for excess errors)
FAIL: gcc.dg/vmx/mem.c  -O2  (test for excess errors)
FAIL: gcc.dg/vmx/mem.c  -O3 -fomit-frame-pointer  (test for excess errors)
FAIL: gcc.dg/vmx/mem.c  -O3 -fomit-frame-pointer -funroll-loops  (test for excess errors)
FAIL: gcc.dg/vmx/mem.c  -O3 -fomit-frame-pointer -funroll-all-loops -finline-functions  (test for excess errors)
FAIL: gcc.dg/vmx/mem.c  -O3 -g  (test for excess errors)
FAIL: gcc.dg/vmx/mem.c  -Os  (test for excess errors)
FAIL: gcc.dg/vmx/newton-1.c  -O0  (test for excess errors)
FAIL: gcc.dg/vmx/newton-1.c  -O1  (test for excess errors)
FAIL: gcc.dg/vmx/newton-1.c  -O2  (test for excess errors)
FAIL: gcc.dg/vmx/newton-1.c  -O3 -fomit-frame-pointer  (test for excess errors)
FAIL: gcc.dg/vmx/newton-1.c  -O3 -fomit-frame-pointer -funroll-loops  (test for excess errors)
FAIL: gcc.dg/vmx/newton-1.c  -O3 -fomit-frame-pointer -funroll-all-loops -finline-functions  (test for excess errors)
FAIL: gcc.dg/vmx/newton-1.c  -O3 -g  (test for excess errors)
FAIL: gcc.dg/vmx/newton-1.c  -Os  (test for excess errors)
FAIL: gcc.dg/vmx/ops-long-1.c  -O0  (test for excess errors)
FAIL: gcc.dg/vmx/ops-long-1.c  -O1  (test for excess errors)
FAIL: gcc.dg/vmx/ops-long-1.c  -O2  (test for excess errors)
FAIL: gcc.dg/vmx/ops-long-1.c  -O3 -fomit-frame-pointer  (test for excess errors)
FAIL: gcc.dg/vmx/ops-long-1.c  -O3 -g  (test for excess errors)
FAIL: gcc.dg/vmx/ops-long-1.c  -Os  (test for excess errors)
FAIL: gcc.dg/vmx/ops.c  -O0  (test for excess errors)
FAIL: gcc.dg/vmx/ops.c  -O1  (test for excess errors)
FAIL: gcc.dg/vmx/ops.c  -O2  (test for excess errors)
FAIL: gcc.dg/vmx/ops.c  -O3 -fomit-frame-pointer  (test for excess errors)
FAIL: gcc.dg/vmx/ops.c  -O3 -g  (test for excess errors)
FAIL: gcc.dg/vmx/ops.c  -Os  (test for excess errors)
FAIL: gcc.dg/vmx/sn7153.c  -O0  (test for excess errors)
WARNING: gcc.dg/vmx/sn7153.c  -O0  compilation failed to produce executable
FAIL: gcc.dg/vmx/sn7153.c  -O1  (test for excess errors)
WARNING: gcc.dg/vmx/sn7153.c  -O1  compilation failed to produce executable
FAIL: gcc.dg/vmx/sn7153.c  -O2  (test for excess errors)
WARNING: gcc.dg/vmx/sn7153.c  -O2  compilation failed to produce executable
FAIL: gcc.dg/vmx/sn7153.c  -O3 -fomit-frame-pointer  (test for excess errors)
WARNING: gcc.dg/vmx/sn7153.c  -O3 -fomit-frame-pointer  compilation failed to produce executable
FAIL: gcc.dg/vmx/sn7153.c  -O3 -fomit-frame-pointer -funroll-loops  (test for excess errors)
WARNING: gcc.dg/vmx/sn7153.c  -O3 -fomit-frame-pointer -funroll-loops  compilation failed to produce executable
FAIL: gcc.dg/vmx/sn7153.c  -O3 -fomit-frame-pointer -funroll-all-loops -finline-functions  (test for excess errors)
WARNING: gcc.dg/vmx/sn7153.c  -O3 -fomit-frame-pointer -funroll-all-loops -finline-functions  compilation failed to produce executable
FAIL: gcc.dg/vmx/sn7153.c  -O3 -g  (test for excess errors)
WARNING: gcc.dg/vmx/sn7153.c  -O3 -g  compilation failed to produce executable
FAIL: gcc.dg/vmx/sn7153.c  -Os  (test for excess errors)
WARNING: gcc.dg/vmx/sn7153.c  -Os  compilation failed to produce executable
FAIL: gcc.dg/vmx/spill.c  -O0  (test for excess errors)
WARNING: gcc.dg/vmx/spill.c  -O0  compilation failed to produce executable
FAIL: gcc.dg/vmx/spill.c  -O1  (test for excess errors)
WARNING: gcc.dg/vmx/spill.c  -O1  compilation failed to produce executable
FAIL: gcc.dg/vmx/spill2.c  -O0  (test for excess errors)
WARNING: gcc.dg/vmx/spill2.c  -O0  compilation failed to produce executable
FAIL: gcc.dg/vmx/spill2.c  -O1  (test for excess errors)
WARNING: gcc.dg/vmx/spill2.c  -O1  compilation failed to produce executable
FAIL: gcc.dg/vmx/spill3.c  -O0  (test for excess errors)
WARNING: gcc.dg/vmx/spill3.c  -O0  compilation failed to produce executable
FAIL: gcc.dg/vmx/spill3.c  -O1  (test for excess errors)
WARNING: gcc.dg/vmx/spill3.c  -O1  compilation failed to produce executable
FAIL: gcc.dg/vmx/varargs-1.c  -O0  (test for excess errors)
WARNING: gcc.dg/vmx/varargs-1.c  -O0  compilation failed to produce executable
FAIL: gcc.dg/vmx/varargs-1.c  -O1  (test for excess errors)
WARNING: gcc.dg/vmx/varargs-1.c  -O1  compilation failed to produce executable
FAIL: gcc.dg/vmx/varargs-1.c  -O2  (test for excess errors)
WARNING: gcc.dg/vmx/varargs-1.c  -O2  compilation failed to produce executable
FAIL: gcc.dg/vmx/varargs-1.c  -O3 -fomit-frame-pointer  (test for excess errors)
WARNING: gcc.dg/vmx/varargs-1.c  -O3 -fomit-frame-pointer  compilation failed to produce executable
FAIL: gcc.dg/vmx/varargs-1.c  -O3 -fomit-frame-pointer -funroll-loops  (test for excess errors)
WARNING: gcc.dg/vmx/varargs-1.c  -O3 -fomit-frame-pointer -funroll-loops  compilation failed to produce executable
FAIL: gcc.dg/vmx/varargs-1.c  -O3 -fomit-frame-pointer -funroll-all-loops -finline-functions  (test for excess errors)
WARNING: gcc.dg/vmx/varargs-1.c  -O3 -fomit-frame-pointer -funroll-all-loops -finline-functions  compilation failed to produce executable
FAIL: gcc.dg/vmx/varargs-1.c  -O3 -g  (test for excess errors)
WARNING: gcc.dg/vmx/varargs-1.c  -O3 -g  compilation failed to produce executable
FAIL: gcc.dg/vmx/varargs-1.c  -Os  (test for excess errors)
WARNING: gcc.dg/vmx/varargs-1.c  -Os  compilation failed to produce executable
FAIL: gcc.dg/vmx/varargs-2.c  -O0  (test for excess errors)
WARNING: gcc.dg/vmx/varargs-2.c  -O0  compilation failed to produce executable
FAIL: gcc.dg/vmx/varargs-2.c  -O1  (test for excess errors)
WARNING: gcc.dg/vmx/varargs-2.c  -O1  compilation failed to produce executable
FAIL: gcc.dg/vmx/varargs-2.c  -O2  (test for excess errors)
WARNING: gcc.dg/vmx/varargs-2.c  -O2  compilation failed to produce executable
FAIL: gcc.dg/vmx/varargs-2.c  -O3 -fomit-frame-pointer  (test for excess errors)
WARNING: gcc.dg/vmx/varargs-2.c  -O3 -fomit-frame-pointer  compilation failed to produce executable
FAIL: gcc.dg/vmx/varargs-2.c  -O3 -g  (test for excess errors)
WARNING: gcc.dg/vmx/varargs-2.c  -O3 -g  compilation failed to produce executable
FAIL: gcc.dg/vmx/varargs-2.c  -Os  (test for excess errors)
WARNING: gcc.dg/vmx/varargs-2.c  -Os  compilation failed to produce executable
FAIL: gcc.dg/vmx/varargs-3.c  -O0  (test for excess errors)
WARNING: gcc.dg/vmx/varargs-3.c  -O0  compilation failed to produce executable
FAIL: gcc.dg/vmx/varargs-3.c  -O1  (test for excess errors)
WARNING: gcc.dg/vmx/varargs-3.c  -O1  compilation failed to produce executable
FAIL: gcc.dg/vmx/varargs-3.c  -O2  (test for excess errors)
WARNING: gcc.dg/vmx/varargs-3.c  -O2  compilation failed to produce executable
FAIL: gcc.dg/vmx/varargs-3.c  -O3 -fomit-frame-pointer  (test for excess errors)
WARNING: gcc.dg/vmx/varargs-3.c  -O3 -fomit-frame-pointer  compilation failed to produce executable
FAIL: gcc.dg/vmx/varargs-3.c  -O3 -g  (test for excess errors)
WARNING: gcc.dg/vmx/varargs-3.c  -O3 -g  compilation failed to produce executable
FAIL: gcc.dg/vmx/varargs-3.c  -Os  (test for excess errors)
WARNING: gcc.dg/vmx/varargs-3.c  -Os  compilation failed to produce executable
FAIL: gcc.dg/vmx/varargs-4.c  -O0  (test for excess errors)
WARNING: gcc.dg/vmx/varargs-4.c  -O0  compilation failed to produce executable
FAIL: gcc.dg/vmx/varargs-4.c  -O1  (test for excess errors)
WARNING: gcc.dg/vmx/varargs-4.c  -O1  compilation failed to produce executable
FAIL: gcc.dg/vmx/varargs-4.c  -O2  (test for excess errors)
WARNING: gcc.dg/vmx/varargs-4.c  -O2  compilation failed to produce executable
FAIL: gcc.dg/vmx/varargs-4.c  -O3 -fomit-frame-pointer  (test for excess errors)
WARNING: gcc.dg/vmx/varargs-4.c  -O3 -fomit-frame-pointer  compilation failed to produce executable
FAIL: gcc.dg/vmx/varargs-4.c  -O3 -fomit-frame-pointer -funroll-loops  (test for excess errors)
WARNING: gcc.dg/vmx/varargs-4.c  -O3 -fomit-frame-pointer -funroll-loops  compilation failed to produce executable
FAIL: gcc.dg/vmx/varargs-4.c  -O3 -fomit-frame-pointer -funroll-all-loops -finline-functions  (test for excess errors)
WARNING: gcc.dg/vmx/varargs-4.c  -O3 -fomit-frame-pointer -funroll-all-loops -finline-functions  compilation failed to produce executable
FAIL: gcc.dg/vmx/varargs-4.c  -O3 -g  (test for excess errors)
WARNING: gcc.dg/vmx/varargs-4.c  -O3 -g  compilation failed to produce executable
FAIL: gcc.dg/vmx/varargs-4.c  -Os  (test for excess errors)
WARNING: gcc.dg/vmx/varargs-4.c  -Os  compilation failed to produce executable
FAIL: gcc.dg/vmx/varargs-5.c  -O0  (test for excess errors)
WARNING: gcc.dg/vmx/varargs-5.c  -O0  compilation failed to produce executable
FAIL: gcc.dg/vmx/varargs-5.c  -O1  (test for excess errors)
WARNING: gcc.dg/vmx/varargs-5.c  -O1  compilation failed to produce executable
FAIL: gcc.dg/vmx/varargs-5.c  -O2  (test for excess errors)
WARNING: gcc.dg/vmx/varargs-5.c  -O2  compilation failed to produce executable
FAIL: gcc.dg/vmx/varargs-5.c  -O3 -fomit-frame-pointer  (test for excess errors)
WARNING: gcc.dg/vmx/varargs-5.c  -O3 -fomit-frame-pointer  compilation failed to produce executable
FAIL: gcc.dg/vmx/varargs-5.c  -O3 -g  (test for excess errors)
WARNING: gcc.dg/vmx/varargs-5.c  -O3 -g  compilation failed to produce executable
FAIL: gcc.dg/vmx/varargs-5.c  -Os  (test for excess errors)
WARNING: gcc.dg/vmx/varargs-5.c  -Os  compilation failed to produce executable
FAIL: gcc.dg/vmx/varargs-6.c  -O0  (test for excess errors)
WARNING: gcc.dg/vmx/varargs-6.c  -O0  compilation failed to produce executable
FAIL: gcc.dg/vmx/varargs-6.c  -O1  (test for excess errors)
WARNING: gcc.dg/vmx/varargs-6.c  -O1  compilation failed to produce executable
FAIL: gcc.dg/vmx/varargs-6.c  -O2  (test for excess errors)
WARNING: gcc.dg/vmx/varargs-6.c  -O2  compilation failed to produce executable
FAIL: gcc.dg/vmx/varargs-6.c  -O3 -fomit-frame-pointer  (test for excess errors)
WARNING: gcc.dg/vmx/varargs-6.c  -O3 -fomit-frame-pointer  compilation failed to produce executable
FAIL: gcc.dg/vmx/varargs-6.c  -O3 -g  (test for excess errors)
WARNING: gcc.dg/vmx/varargs-6.c  -O3 -g  compilation failed to produce executable
FAIL: gcc.dg/vmx/varargs-6.c  -Os  (test for excess errors)
WARNING: gcc.dg/vmx/varargs-6.c  -Os  compilation failed to produce executable
FAIL: gcc.dg/vmx/varargs-7.c  -O0  (test for excess errors)
WARNING: gcc.dg/vmx/varargs-7.c  -O0  compilation failed to produce executable
FAIL: gcc.dg/vmx/varargs-7.c  -O1  (test for excess errors)
WARNING: gcc.dg/vmx/varargs-7.c  -O1  compilation failed to produce executable
FAIL: gcc.dg/vmx/varargs-7.c  -O2  (test for excess errors)
WARNING: gcc.dg/vmx/varargs-7.c  -O2  compilation failed to produce executable
FAIL: gcc.dg/vmx/varargs-7.c  -O3 -fomit-frame-pointer  (test for excess errors)
WARNING: gcc.dg/vmx/varargs-7.c  -O3 -fomit-frame-pointer  compilation failed to produce executable
FAIL: gcc.dg/vmx/varargs-7.c  -O3 -g  (test for excess errors)
WARNING: gcc.dg/vmx/varargs-7.c  -O3 -g  compilation failed to produce executable
FAIL: gcc.dg/vmx/varargs-7.c  -Os  (test for excess errors)
WARNING: gcc.dg/vmx/varargs-7.c  -Os  compilation failed to produce executable
FAIL: gcc.dg/vmx/x-01.c  -O0  (test for excess errors)
WARNING: gcc.dg/vmx/x-01.c  -O0  compilation failed to produce executable
FAIL: gcc.dg/vmx/x-01.c  -O1  (test for excess errors)
WARNING: gcc.dg/vmx/x-01.c  -O1  compilation failed to produce executable
FAIL: gcc.dg/vmx/x-01.c  -O2  (test for excess errors)
WARNING: gcc.dg/vmx/x-01.c  -O2  compilation failed to produce executable
FAIL: gcc.dg/vmx/x-02.c  -O0  (test for excess errors)
WARNING: gcc.dg/vmx/x-02.c  -O0  compilation failed to produce executable
FAIL: gcc.dg/vmx/x-02.c  -O1  (test for excess errors)
WARNING: gcc.dg/vmx/x-02.c  -O1  compilation failed to produce executable
FAIL: gcc.dg/vmx/x-03.c  -O0  (test for excess errors)
WARNING: gcc.dg/vmx/x-03.c  -O0  compilation failed to produce executable
FAIL: gcc.dg/vmx/x-03.c  -O1  (test for excess errors)
WARNING: gcc.dg/vmx/x-03.c  -O1  compilation failed to produce executable
FAIL: gcc.dg/vmx/x-04.c  -O0  (test for excess errors)
WARNING: gcc.dg/vmx/x-04.c  -O0  compilation failed to produce executable
FAIL: gcc.dg/vmx/x-04.c  -O1  (test for excess errors)
WARNING: gcc.dg/vmx/x-04.c  -O1  compilation failed to produce executable
FAIL: gcc.dg/vmx/x-04.c  -O2  (test for excess errors)
WARNING: gcc.dg/vmx/x-04.c  -O2  compilation failed to produce executable
FAIL: gcc.dg/vmx/x-04.c  -O3 -fomit-frame-pointer  (test for excess errors)
WARNING: gcc.dg/vmx/x-04.c  -O3 -fomit-frame-pointer  compilation failed to produce executable
FAIL: gcc.dg/vmx/x-04.c  -O3 -g  (test for excess errors)
WARNING: gcc.dg/vmx/x-04.c  -O3 -g  compilation failed to produce executable
FAIL: gcc.dg/vmx/x-04.c  -Os  (test for excess errors)
WARNING: gcc.dg/vmx/x-04.c  -Os  compilation failed to produce executable
FAIL: gcc.dg/vmx/x-05.c  -O0  (test for excess errors)
WARNING: gcc.dg/vmx/x-05.c  -O0  compilation failed to produce executable
FAIL: gcc.dg/vmx/x-05.c  -O1  (test for excess errors)
WARNING: gcc.dg/vmx/x-05.c  -O1  compilation failed to produce executable
FAIL: gcc.dg/vmx/yousufi-1.c  -O0  (test for excess errors)
WARNING: gcc.dg/vmx/yousufi-1.c  -O0  compilation failed to produce executable
FAIL: gcc.dg/vmx/yousufi-1.c  -O1  (test for excess errors)
WARNING: gcc.dg/vmx/yousufi-1.c  -O1  compilation failed to produce executable
FAIL: gcc.dg/vmx/yousufi-1.c  -O2  (test for excess errors)
WARNING: gcc.dg/vmx/yousufi-1.c  -O2  compilation failed to produce executable
FAIL: gcc.dg/vmx/yousufi-1.c  -O3 -fomit-frame-pointer  (test for excess errors)
WARNING: gcc.dg/vmx/yousufi-1.c  -O3 -fomit-frame-pointer  compilation failed to produce executable
FAIL: gcc.dg/vmx/yousufi-1.c  -O3 -g  (test for excess errors)
WARNING: gcc.dg/vmx/yousufi-1.c  -O3 -g  compilation failed to produce executable
FAIL: gcc.dg/vmx/yousufi-1.c  -Os  (test for excess errors)
WARNING: gcc.dg/vmx/yousufi-1.c  -Os  compilation failed to produce executable
FAIL: gcc.dg/vmx/zero-1.c  -O0  (test for excess errors)
WARNING: gcc.dg/vmx/zero-1.c  -O0  compilation failed to produce executable
FAIL: gcc.dg/vmx/zero-1.c  -O1  (test for excess errors)
WARNING: gcc.dg/vmx/zero-1.c  -O1  compilation failed to produce executable
FAIL: gcc.dg/vmx/zero-1.c  -O2  (test for excess errors)
WARNING: gcc.dg/vmx/zero-1.c  -O2  compilation failed to produce executable
FAIL: gcc.dg/vmx/zero-1.c  -O3 -fomit-frame-pointer  (test for excess errors)
WARNING: gcc.dg/vmx/zero-1.c  -O3 -fomit-frame-pointer  compilation failed to produce executable
FAIL: gcc.dg/vmx/zero-1.c  -O3 -g  (test for excess errors)
WARNING: gcc.dg/vmx/zero-1.c  -O3 -g  compilation failed to produce executable
FAIL: gcc.dg/vmx/zero-1.c  -Os  (test for excess errors)
WARNING: gcc.dg/vmx/zero-1.c  -Os  compilation failed to produce executable
FAIL: gcc.dg/vmx/zero.c  -O0  (test for excess errors)
WARNING: gcc.dg/vmx/zero.c  -O0  compilation failed to produce executable
FAIL: gcc.dg/vmx/zero.c  -O1  (test for excess errors)
WARNING: gcc.dg/vmx/zero.c  -O1  compilation failed to produce executable
FAIL: gcc.dg/vmx/zero.c  -O2  (test for excess errors)
WARNING: gcc.dg/vmx/zero.c  -O2  compilation failed to produce executable
FAIL: gcc.dg/vmx/zero.c  -O3 -fomit-frame-pointer  (test for excess errors)
WARNING: gcc.dg/vmx/zero.c  -O3 -fomit-frame-pointer  compilation failed to produce executable
FAIL: gcc.dg/vmx/zero.c  -O3 -g  (test for excess errors)
WARNING: gcc.dg/vmx/zero.c  -O3 -g  compilation failed to produce executable
FAIL: gcc.dg/vmx/zero.c  -Os  (test for excess errors)
WARNING: gcc.dg/vmx/zero.c  -Os  compilation failed to produce executable

		=== gcc Summary for unix/-m64 ===

# of expected passes		35433
# of unexpected failures	549
# of unexpected successes	6
# of expected failures		110
# of unresolved testcases	9
# of untested testcases		30
# of unsupported tests		442

Running target unix
XPASS: gcc.c-torture/execute/20020720-1.c compilation,  -O1 
UNRESOLVED: gcc.c-torture/execute/20020720-1.c execution,  -O2 
UNRESOLVED: gcc.c-torture/execute/20020720-1.c execution,  -O3 -fomit-frame-pointer 
UNRESOLVED: gcc.c-torture/execute/20020720-1.c execution,  -O3 -g 
UNRESOLVED: gcc.c-torture/execute/20020720-1.c execution,  -Os 
XPASS: gcc.dg/cpp/cmdlne-dI-M.c scan-file (^|\\\\n)cmdlne-dI-M.*:[^\\\\n]*cmdlne-dI-M.c
XPASS: gcc.dg/cpp/cmdlne-dM-M.c scan-file (^|\\\\n)cmdlne-dM-M[^\\\\n]*:[^\\\\n]*cmdlne-dM-M.c
FAIL: gcc.dg/altivec-20.c (test for excess errors)
FAIL: gcc.dg/ppc-vec-merge.c (test for excess errors)
WARNING: gcc.dg/ppc-vec-merge.c compilation failed to produce executable
XPASS: gcc.dg/uninit-9.c uninitialized variable warning (test for bogus messages, line 26)
FAIL: gcc.dg/pch/inline-4.c -O0 -g (test for excess errors)
FAIL: gcc.dg/pch/inline-4.c  -O0  (test for excess errors)
FAIL: gcc.dg/vect/pr18400.c (test for excess errors)
WARNING: gcc.dg/vect/pr18400.c compilation failed to produce executable
FAIL: gcc.dg/vect/vect-11a.c (test for excess errors)
WARNING: gcc.dg/vect/vect-11a.c compilation failed to produce executable
FAIL: gcc.dg/vect/vect-11a.c scan-tree-dump-times vectorized 1 loops 2
FAIL: gcc.dg/vect/vect-2.c (test for excess errors)
WARNING: gcc.dg/vect/vect-2.c compilation failed to produce executable
FAIL: gcc.dg/vect/vect-34.c (test for excess errors)
WARNING: gcc.dg/vect/vect-34.c compilation failed to produce executable
FAIL: gcc.dg/vect/vect-66.c (test for excess errors)
WARNING: gcc.dg/vect/vect-66.c compilation failed to produce executable
XPASS: gcc.dg/vect/vect-67.c scan-tree-dump-times vectorized 1 loops 1
FAIL: gcc.dg/vect/vect-92.c execution test
FAIL: gcc.dg/vect/vect-93.c (test for excess errors)
WARNING: gcc.dg/vect/vect-93.c compilation failed to produce executable
FAIL: gcc.dg/vect/vect-all.c (test for excess errors)
WARNING: gcc.dg/vect/vect-all.c compilation failed to produce executable
FAIL: gcc.dg/vect/vect-none.c (test for excess errors)
FAIL: gcc.dg/vect/vect-shift-1.c (test for excess errors)
WARNING: gcc.dg/vect/vect-shift-1.c compilation failed to produce executable
FAIL: gcc.dg/vmx/7c-01.c  -O0  (test for excess errors)
FAIL: gcc.dg/vmx/7c-01.c  -O1  (test for excess errors)
FAIL: gcc.dg/vmx/7c-01.c  -O2  (test for excess errors)
FAIL: gcc.dg/vmx/7c-01.c  -O3 -fomit-frame-pointer  (test for excess errors)
FAIL: gcc.dg/vmx/7c-01.c  -O3 -g  (test for excess errors)
FAIL: gcc.dg/vmx/7c-01.c  -Os  (test for excess errors)
FAIL: gcc.dg/vmx/bug-1.c  -O0  (test for excess errors)
WARNING: gcc.dg/vmx/bug-1.c  -O0  compilation failed to produce executable
FAIL: gcc.dg/vmx/bug-1.c  -O1  (test for excess errors)
WARNING: gcc.dg/vmx/bug-1.c  -O1  compilation failed to produce executable
FAIL: gcc.dg/vmx/bug-1.c  -O2  (test for excess errors)
WARNING: gcc.dg/vmx/bug-1.c  -O2  compilation failed to produce executable
FAIL: gcc.dg/vmx/bug-1.c  -O3 -fomit-frame-pointer  (test for excess errors)
WARNING: gcc.dg/vmx/bug-1.c  -O3 -fomit-frame-pointer  compilation failed to produce executable
FAIL: gcc.dg/vmx/bug-1.c  -O3 -fomit-frame-pointer -funroll-loops  (test for excess errors)
WARNING: gcc.dg/vmx/bug-1.c  -O3 -fomit-frame-pointer -funroll-loops  compilation failed to produce executable
FAIL: gcc.dg/vmx/bug-1.c  -O3 -fomit-frame-pointer -funroll-all-loops -finline-functions  (test for excess errors)
WARNING: gcc.dg/vmx/bug-1.c  -O3 -fomit-frame-pointer -funroll-all-loops -finline-functions  compilation failed to produce executable
FAIL: gcc.dg/vmx/bug-1.c  -O3 -g  (test for excess errors)
WARNING: gcc.dg/vmx/bug-1.c  -O3 -g  compilation failed to produce executable
FAIL: gcc.dg/vmx/bug-1.c  -Os  (test for excess errors)
WARNING: gcc.dg/vmx/bug-1.c  -Os  compilation failed to produce executable
FAIL: gcc.dg/vmx/eg-5.c  -O0  (test for excess errors)
WARNING: gcc.dg/vmx/eg-5.c  -O0  compilation failed to produce executable
FAIL: gcc.dg/vmx/eg-5.c  -O1  (test for excess errors)
WARNING: gcc.dg/vmx/eg-5.c  -O1  compilation failed to produce executable
FAIL: gcc.dg/vmx/eg-5.c  -O2  (test for excess errors)
WARNING: gcc.dg/vmx/eg-5.c  -O2  compilation failed to produce executable
FAIL: gcc.dg/vmx/eg-5.c  -O3 -fomit-frame-pointer  (test for excess errors)
WARNING: gcc.dg/vmx/eg-5.c  -O3 -fomit-frame-pointer  compilation failed to produce executable
FAIL: gcc.dg/vmx/eg-5.c  -O3 -g  (test for excess errors)
WARNING: gcc.dg/vmx/eg-5.c  -O3 -g  compilation failed to produce executable
FAIL: gcc.dg/vmx/eg-5.c  -Os  (test for excess errors)
WARNING: gcc.dg/vmx/eg-5.c  -Os  compilation failed to produce executable
FAIL: gcc.dg/vmx/gcc-bug-b.c  -O1  (test for excess errors)
FAIL: gcc.dg/vmx/gcc-bug-b.c  -O2  (test for excess errors)
FAIL: gcc.dg/vmx/gcc-bug-b.c  -O3 -fomit-frame-pointer  (test for excess errors)
FAIL: gcc.dg/vmx/gcc-bug-b.c  -O3 -g  (test for excess errors)
FAIL: gcc.dg/vmx/gcc-bug-b.c  -Os  (test for excess errors)
FAIL: gcc.dg/vmx/ira2.c  -O1  (test for excess errors)
FAIL: gcc.dg/vmx/ira2.c  -O2  (test for excess errors)
FAIL: gcc.dg/vmx/ira2.c  -O3 -fomit-frame-pointer  (test for excess errors)
FAIL: gcc.dg/vmx/ira2.c  -O3 -g  (test for excess errors)
FAIL: gcc.dg/vmx/ira2.c  -Os  (test for excess errors)
FAIL: gcc.dg/vmx/ops.c  -O1  (test for excess errors)
FAIL: gcc.dg/vmx/ops.c  -O2  (test for excess errors)
FAIL: gcc.dg/vmx/ops.c  -O3 -fomit-frame-pointer  (test for excess errors)
FAIL: gcc.dg/vmx/ops.c  -O3 -g  (test for excess errors)
FAIL: gcc.dg/vmx/ops.c  -Os  (test for excess errors)
FAIL: gcc.dg/vmx/varargs-4.c  -O0  (test for excess errors)
WARNING: gcc.dg/vmx/varargs-4.c  -O0  compilation failed to produce executable
FAIL: gcc.dg/vmx/varargs-4.c  -O1  (test for excess errors)
WARNING: gcc.dg/vmx/varargs-4.c  -O1  compilation failed to produce executable
FAIL: gcc.dg/vmx/varargs-4.c  -O2  (test for excess errors)
WARNING: gcc.dg/vmx/varargs-4.c  -O2  compilation failed to produce executable
FAIL: gcc.dg/vmx/varargs-4.c  -O3 -fomit-frame-pointer  (test for excess errors)
WARNING: gcc.dg/vmx/varargs-4.c  -O3 -fomit-frame-pointer  compilation failed to produce executable
FAIL: gcc.dg/vmx/varargs-4.c  -O3 -fomit-frame-pointer -funroll-loops  (test for excess errors)
WARNING: gcc.dg/vmx/varargs-4.c  -O3 -fomit-frame-pointer -funroll-loops  compilation failed to produce executable
FAIL: gcc.dg/vmx/varargs-4.c  -O3 -fomit-frame-pointer -funroll-all-loops -finline-functions  (test for excess errors)
WARNING: gcc.dg/vmx/varargs-4.c  -O3 -fomit-frame-pointer -funroll-all-loops -finline-functions  compilation failed to produce executable
FAIL: gcc.dg/vmx/varargs-4.c  -O3 -g  (test for excess errors)
WARNING: gcc.dg/vmx/varargs-4.c  -O3 -g  compilation failed to produce executable
FAIL: gcc.dg/vmx/varargs-4.c  -Os  (test for excess errors)
WARNING: gcc.dg/vmx/varargs-4.c  -Os  compilation failed to produce executable

		=== gcc Summary for unix ===

# of expected passes		36280
# of unexpected failures	58
# of unexpected successes	5
# of expected failures		104
# of unresolved testcases	4
# of untested testcases		30
# of unsupported tests		445

		=== gcc Summary ===

# of expected passes		71713
# of unexpected failures	607
# of unexpected successes	11
# of expected failures		214
# of unresolved testcases	13
# of untested testcases		60
# of unsupported tests		887
/abuild/aj/gcc/gcc/xgcc  version 4.1.0 20050519 (experimental)

		=== gfortran tests ===


Running target unix/-m64
FAIL: gfortran.dg/namelist_14.f90  -O0  (test for excess errors)
WARNING: gfortran.dg/namelist_14.f90  -O0  compilation failed to produce executable
XPASS: gfortran.dg/ret_pointer_1.f90  -O0  execution test
XPASS: gfortran.dg/ret_pointer_1.f90  -O1  execution test
XPASS: gfortran.dg/ret_pointer_1.f90  -O2  execution test
XPASS: gfortran.dg/ret_pointer_1.f90  -O3 -fomit-frame-pointer  execution test
XPASS: gfortran.dg/ret_pointer_1.f90  -O3 -fomit-frame-pointer -funroll-loops  execution test
XPASS: gfortran.dg/ret_pointer_1.f90  -O3 -fomit-frame-pointer -funroll-all-loops -finline-functions  execution test
XPASS: gfortran.dg/ret_pointer_1.f90  -O3 -g  execution test
XPASS: gfortran.dg/ret_pointer_1.f90  -Os  execution test
FAIL: gfortran.dg/vect/vect-1.f90  -O  (test for excess errors)
FAIL: gfortran.dg/vect/vect-2.f90  -O  (test for excess errors)
FAIL: gfortran.dg/vect/vect-5.f90  -O  (test for excess errors)
WARNING: gfortran.dg/vect/vect-5.f90  -O  compilation failed to produce executable

		=== gfortran Summary for unix/-m64 ===

# of expected passes		6852
# of unexpected failures	4
# of unexpected successes	8
# of expected failures		27
# of unsupported tests		17

Running target unix
FAIL: gfortran.dg/eoshift.f90  -O0  execution test
XPASS: gfortran.dg/ret_pointer_1.f90  -O0  execution test
XPASS: gfortran.dg/ret_pointer_1.f90  -O1  execution test
XPASS: gfortran.dg/ret_pointer_1.f90  -O2  execution test
XPASS: gfortran.dg/ret_pointer_1.f90  -O3 -fomit-frame-pointer  execution test
XPASS: gfortran.dg/ret_pointer_1.f90  -O3 -fomit-frame-pointer -funroll-loops  execution test
XPASS: gfortran.dg/ret_pointer_1.f90  -O3 -fomit-frame-pointer -funroll-all-loops -finline-functions  execution test
XPASS: gfortran.dg/ret_pointer_1.f90  -O3 -g  execution test
XPASS: gfortran.dg/ret_pointer_1.f90  -Os  execution test
FAIL: gfortran.dg/vect/vect-5.f90  -O  (test for excess errors)
WARNING: gfortran.dg/vect/vect-5.f90  -O  compilation failed to produce executable

		=== gfortran Summary for unix ===

# of expected passes		6858
# of unexpected failures	2
# of unexpected successes	8
# of expected failures		24
# of unsupported tests		17

		=== gfortran Summary ===

# of expected passes		13710
# of unexpected failures	6
# of unexpected successes	16
# of expected failures		51
# of unsupported tests		34
/abuild/aj/gcc/gcc/testsuite/../gfortran  version 4.1.0 20050519 (experimental)

		=== g++ tests ===


Running target unix/-m64
FAIL: g++.dg/ext/altivec-2.C (test for excess errors)
FAIL: g++.dg/ext/altivec-3.C (test for excess errors)
WARNING: g++.dg/ext/altivec-3.C compilation failed to produce executable
FAIL: g++.dg/ext/altivec-4.C (test for excess errors)
FAIL: g++.dg/ext/altivec-5.C (test for excess errors)
FAIL: g++.dg/ext/altivec-6.C (test for excess errors)
FAIL: g++.dg/ext/altivec-8.C (test for excess errors)
FAIL: g++.dg/ext/altivec-9.C (test for excess errors)
FAIL: g++.dg/tree-ssa/pr14814.C scan-tree-dump-times &this 0

		=== g++ Summary for unix/-m64 ===

# of expected passes		11051
# of unexpected failures	8
# of expected failures		65
# of unsupported tests		84

Running target unix
FAIL: g++.dg/tree-ssa/pr14814.C scan-tree-dump-times &this 0

		=== g++ Summary for unix ===

# of expected passes		11097
# of unexpected failures	1
# of expected failures		65
# of unsupported tests		81

		=== g++ Summary ===

# of expected passes		22148
# of unexpected failures	9
# of expected failures		130
# of unsupported tests		165
/abuild/aj/gcc/gcc/testsuite/../g++  version 4.1.0 20050519 (experimental)

		=== objc tests ===


Running target unix/-m64

		=== objc Summary for unix/-m64 ===

# of expected passes		1534
# of unsupported tests		12

Running target unix

		=== objc Summary for unix ===

# of expected passes		1534
# of unsupported tests		12

		=== objc Summary ===

# of expected passes		3068
# of unsupported tests		24
/abuild/aj/gcc/gcc/xgcc  version 4.1.0 20050519 (experimental)

		=== treelang tests ===


Running target unix/-m64
FAIL: treelang/compile/badreturn.tree  (test for errors, line 13)
FAIL: treelang/compile/badreturn.tree (test for excess errors)
FAIL: treelang/compile/exit.tree (test for excess errors)
FAIL: treelang/compile/extrafunc.tree  (test for warnings, line 14)
FAIL: treelang/compile/extrafunc.tree (test for excess errors)
FAIL: treelang/compile/extravar.tree  (test for warnings, line 5)
FAIL: treelang/compile/extravar.tree (test for excess errors)
FAIL: treelang/compile/extref.tree (test for excess errors)
FAIL: treelang/compile/full_unit.tree (test for excess errors)
ERROR: treelang/compile/full_unit.tree: error executing dg-final: couldn't open "full_unit.s": no such file or directory
UNRESOLVED: treelang/compile/full_unit.tree: error executing dg-final: couldn't open "full_unit.s": no such file or directory
FAIL: treelang/compile/function-1.tree (test for excess errors)
FAIL: treelang/compile/memory.tree (test for excess errors)
FAIL: treelang/compile/tabs.tree (test for excess errors)
FAIL: treelang/compile/unsigned.tree (test for excess errors)
ERROR: treelang/compile/unsigned.tree: error executing dg-final: no files matched glob pattern "unsigned.tree.t??.generic"
UNRESOLVED: treelang/compile/unsigned.tree: error executing dg-final: no files matched glob pattern "unsigned.tree.t??.generic"
FAIL: treelang/compile/var_defs.tree  (test for warnings, line 18)
FAIL: treelang/compile/var_defs.tree  (test for warnings, line 23)
FAIL: treelang/compile/var_defs.tree  (test for errors, line 30)
FAIL: treelang/compile/var_defs.tree (test for excess errors)
FAIL: treelang/execute/funccall-2.tree (test for excess errors)
WARNING: treelang/execute/funccall-2.tree compilation failed to produce executable
FAIL: treelang/execute/funccall.tree (test for excess errors)
WARNING: treelang/execute/funccall.tree compilation failed to produce executable
FAIL: treelang/execute/initial.tree (test for excess errors)
WARNING: treelang/execute/initial.tree compilation failed to produce executable
FAIL: treelang/execute/main.tree (test for excess errors)
WARNING: treelang/execute/main.tree compilation failed to produce executable
FAIL: treelang/execute/static.tree (test for excess errors)
WARNING: treelang/execute/static.tree compilation failed to produce executable

		=== treelang Summary for unix/-m64 ===

# of expected passes		18
# of unexpected failures	22
# of unresolved testcases	2

Running target unix

		=== treelang Summary for unix ===


		=== treelang Summary ===

# of expected passes		18
# of unexpected failures	22
# of unresolved testcases	2
		=== libffi tests ===


Running target unix/-m64
FAIL: libffi.call/float3.c execution test

		=== libffi Summary for unix/-m64 ===

# of expected passes		218
# of unexpected failures	1
# of unsupported tests		2

Running target unix

		=== libffi Summary for unix ===

# of expected passes		219
# of unsupported tests		2

		=== libffi Summary ===

# of expected passes		437
# of unexpected failures	1
# of unsupported tests		4
		=== libjava tests ===


Running target unix/-m64
FAIL: Array_3 -O3 execution - bytecode->native test
FAIL: Class_1 execution - source compiled test
FAIL: Class_1 execution - gij test
FAIL: Class_1 execution - bytecode->native test
FAIL: Class_1 -O3 execution - source compiled test
FAIL: Class_1 execution - gij test
FAIL: Class_1 -O3 execution - bytecode->native test
WARNING: program timed out.
FAIL: FileHandleGcTest execution - source compiled test
WARNING: program timed out.
FAIL: FileHandleGcTest execution - gij test
WARNING: program timed out.
FAIL: FileHandleGcTest execution - bytecode->native test
WARNING: program timed out.
FAIL: FileHandleGcTest -O3 execution - source compiled test
WARNING: program timed out.
FAIL: FileHandleGcTest execution - gij test
WARNING: program timed out.
FAIL: FileHandleGcTest -O3 execution - bytecode->native test
FAIL: InvokeInterface execution - gij test
FAIL: InvokeInterface execution - bytecode->native test
FAIL: InvokeInterface execution - gij test
FAIL: InvokeInterface -O3 execution - bytecode->native test
FAIL: PR12350 execution - gij test
FAIL: PR12350 execution - bytecode->native test
FAIL: PR12350 execution - gij test
FAIL: PR12350 -O3 execution - bytecode->native test
FAIL: PR12416 execution - gij test
FAIL: PR12416 execution - bytecode->native test
FAIL: PR12416 execution - gij test
FAIL: PR12416 -O3 execution - bytecode->native test
FAIL: PR18699 execution - source compiled test
WARNING: program timed out.
FAIL: PR18699 execution - gij test
WARNING: program timed out.
FAIL: PR18699 execution - bytecode->native test
FAIL: PR18699 -O3 execution - source compiled test
WARNING: program timed out.
FAIL: PR18699 execution - gij test
WARNING: program timed out.
FAIL: PR18699 -O3 execution - bytecode->native test
FAIL: PR260 execution - gij test
FAIL: PR260 execution - bytecode->native test
FAIL: PR260 execution - gij test
FAIL: PR260 -O3 execution - bytecode->native test
FAIL: Process_1 execution - source compiled test
FAIL: Process_1 execution - bytecode->native test
FAIL: Process_1 -O3 execution - source compiled test
FAIL: Process_1 -O3 execution - bytecode->native test
FAIL: Process_2 execution - source compiled test
FAIL: Process_2 execution - bytecode->native test
FAIL: Process_2 -O3 execution - source compiled test
FAIL: Process_2 -O3 execution - bytecode->native test
FAIL: Process_3 execution - source compiled test
FAIL: Process_3 execution - bytecode->native test
WARNING: program timed out.
FAIL: Process_3 -O3 execution - source compiled test
FAIL: Process_3 -O3 execution - bytecode->native test
FAIL: Process_4 execution - source compiled test
FAIL: Process_4 execution - bytecode->native test
FAIL: Process_4 -O3 execution - source compiled test
FAIL: Process_4 -O3 execution - bytecode->native test
FAIL: Process_5 execution - source compiled test
FAIL: Process_5 execution - bytecode->native test
FAIL: Process_5 -O3 execution - source compiled test
FAIL: Process_5 -O3 execution - bytecode->native test
FAIL: Process_6 execution - source compiled test
FAIL: Process_6 execution - bytecode->native test
FAIL: Process_6 -O3 execution - source compiled test
FAIL: Process_6 -O3 execution - bytecode->native test
FAIL: SyncTest execution - source compiled test
FAIL: SyncTest execution - gij test
FAIL: SyncTest execution - bytecode->native test
FAIL: SyncTest -O3 execution - source compiled test
FAIL: SyncTest execution - gij test
FAIL: SyncTest -O3 execution - bytecode->native test
FAIL: TLtest execution - source compiled test
FAIL: TLtest execution - bytecode->native test
FAIL: TLtest -O3 execution - source compiled test
FAIL: TLtest -O3 execution - bytecode->native test
FAIL: Thread_Alive execution - source compiled test
FAIL: Thread_Alive execution - bytecode->native test
FAIL: Thread_Alive -O3 execution - source compiled test
FAIL: Thread_Alive -O3 execution - bytecode->native test
FAIL: Thread_Interrupt execution - source compiled test
FAIL: Thread_Interrupt execution - bytecode->native test
FAIL: Thread_Interrupt -O3 execution - source compiled test
FAIL: Thread_Interrupt -O3 execution - bytecode->native test
FAIL: Thread_Join execution - source compiled test
FAIL: Thread_Join execution - bytecode->native test
FAIL: Thread_Join -O3 execution - source compiled test
FAIL: Thread_Join -O3 execution - bytecode->native test
FAIL: Thread_Monitor execution - source compiled test
FAIL: Thread_Monitor execution - bytecode->native test
FAIL: Thread_Monitor -O3 execution - source compiled test
FAIL: Thread_Monitor -O3 execution - bytecode->native test
FAIL: Thread_Wait execution - source compiled test
FAIL: Thread_Wait execution - bytecode->native test
FAIL: Thread_Wait -O3 execution - source compiled test
FAIL: Thread_Wait -O3 execution - bytecode->native test
FAIL: Thread_Wait_2 execution - source compiled test
FAIL: Thread_Wait_2 execution - bytecode->native test
FAIL: Thread_Wait_2 -O3 execution - source compiled test
FAIL: Thread_Wait_2 -O3 execution - bytecode->native test
FAIL: Thread_Wait_Interrupt execution - source compiled test
FAIL: Thread_Wait_Interrupt execution - bytecode->native test
FAIL: Thread_Wait_Interrupt -O3 execution - source compiled test
FAIL: Thread_Wait_Interrupt -O3 execution - bytecode->native test
FAIL: invokethrow execution - gij test
FAIL: invokethrow execution - bytecode->native test
FAIL: invokethrow execution - gij test
FAIL: invokethrow -O3 execution - bytecode->native test
FAIL: pr179 execution - gij test
FAIL: pr179 execution - bytecode->native test
FAIL: pr179 execution - gij test
FAIL: pr179 -O3 execution - bytecode->native test
FAIL: pr8415 execution - gij test
FAIL: pr8415 execution - bytecode->native test
FAIL: pr8415 execution - gij test
FAIL: pr8415 -O3 execution - bytecode->native test
FAIL: stringconst2 output - source compiled test
FAIL: stringconst2 output - gij test
FAIL: stringconst2 output - bytecode->native test
FAIL: stringconst2 -O3 output - source compiled test
FAIL: stringconst2 output - gij test
FAIL: stringconst2 -O3 output - bytecode->native test
WARNING: program timed out.
FAIL: /abuild/aj/gcc/powerpc64-suse-linux-gnu/libjava/testsuite/TestEarlyGC.exe execution - /abuild/aj/gcc/powerpc64-suse-linux-gnu/libjava/testsuite/TestEarlyGC.exe
WARNING: program timed out.
FAIL: /abuild/aj/gcc/powerpc64-suse-linux-gnu/libjava/testsuite/TestLeak.exe execution - /abuild/aj/gcc/powerpc64-suse-linux-gnu/libjava/testsuite/TestLeak.exe
FAIL: pr21115 run

		=== libjava Summary for unix/-m64 ===

# of expected passes		3586
# of unexpected failures	118
# of expected failures		10
# of untested testcases		120

Running target unix
FAIL: Class_1 execution - source compiled test
FAIL: Class_1 execution - bytecode->native test
FAIL: Class_1 -O3 execution - source compiled test
FAIL: Class_1 -O3 execution - bytecode->native test
FAIL: InvokeInterface execution - bytecode->native test
FAIL: InvokeInterface -O3 execution - bytecode->native test
FAIL: PR12416 execution - bytecode->native test
FAIL: PR12416 -O3 execution - bytecode->native test
FAIL: PR260 execution - bytecode->native test
FAIL: PR260 -O3 execution - bytecode->native test
FAIL: SyncTest execution - bytecode->native test
FAIL: SyncTest -O3 execution - bytecode->native test
FAIL: invokethrow execution - bytecode->native test
FAIL: invokethrow -O3 execution - bytecode->native test
FAIL: pr179 execution - bytecode->native test
FAIL: pr179 -O3 execution - bytecode->native test
FAIL: pr8415 execution - bytecode->native test
FAIL: pr8415 -O3 execution - bytecode->native test
FAIL: stringconst2 output - source compiled test
FAIL: stringconst2 output - bytecode->native test
FAIL: stringconst2 -O3 output - source compiled test
FAIL: stringconst2 -O3 output - bytecode->native test
FAIL: pr21115 run

		=== libjava Summary for unix ===

# of expected passes		3774
# of unexpected failures	23
# of expected failures		10
# of untested testcases		27

		=== libjava Summary ===

# of expected passes		7360
# of unexpected failures	141
# of expected failures		20
# of untested testcases		147
		=== libmudflap tests ===


Running target unix/-m64
FAIL: libmudflap.c/fail27-frag.c output pattern test
FAIL: libmudflap.c/fail27-frag.c (-O2) output pattern test
FAIL: libmudflap.c/fail27-frag.c (-O3) output pattern test

		=== libmudflap Summary for unix/-m64 ===

# of expected passes		1328
# of unexpected failures	3

Running target unix
FAIL: libmudflap.cth/pass40-frag.c execution test
FAIL: libmudflap.cth/pass40-frag.c output pattern test
FAIL: libmudflap.cth/pass40-frag.c (-O2) execution test
FAIL: libmudflap.cth/pass40-frag.c (-O2) output pattern test
FAIL: libmudflap.cth/pass40-frag.c (-O3) execution test
FAIL: libmudflap.cth/pass40-frag.c (-O3) output pattern test

		=== libmudflap Summary for unix ===

# of expected passes		1325
# of unexpected failures	6

		=== libmudflap Summary ===

# of expected passes		2653
# of unexpected failures	9
		=== libstdc++ tests ===


Running target unix/-m64
FAIL: 22_locale/messages/members/char/1.cc execution test
FAIL: 22_locale/messages/members/char/2.cc execution test
FAIL: 22_locale/messages/members/char/wrapped_env.cc execution test
FAIL: 22_locale/messages/members/char/wrapped_locale.cc execution test
FAIL: 22_locale/messages_byname/named_equivalence.cc execution test
XPASS: 26_numerics/cmath/c99_classification_macros_c.cc (test for excess errors)
XPASS: 27_io/fpos/14320-1.cc execution test

		=== libstdc++ Summary for unix/-m64 ===

# of expected passes		3636
# of unexpected failures	5
# of unexpected successes	2
# of expected failures		11

Running target unix
XPASS: 26_numerics/cmath/c99_classification_macros_c.cc (test for excess errors)

		=== libstdc++ Summary for unix ===

# of expected passes		3641
# of unexpected successes	1
# of expected failures		12

		=== libstdc++ Summary ===

# of expected passes		7277
# of unexpected failures	5
# of unexpected successes	3
# of expected failures		23

Compiler version: 4.1.0 20050519 (experimental) 
Platform: powerpc64-suse-linux-gnu
configure flags: --prefix=/opt/gcc/4.1-devel --enable-checking=misc,tree,gc,rtl,rtlflag,assert --enable-threads=posix --enable-clocale=gnu --enable-__cxa_atexit --enable-shared --with-system-zlib --with-cpu=default32 powerpc64-suse-linux-gnu --enable-languages=c,c++,f95,java,objc,treelang
Version of binutils: GNU ld version 2.16.90.0.3 20050510 (SuSE Linux)
Version of glibc (/lib/libc.so.6): 2.3.5 (20050428)


Index Nav: [Date Index] [Subject Index] [Author Index] [Thread Index]
Message Nav: [Date Prev] [Date Next] [Thread Prev] [Thread Next]