This is the mail archive of the gcc-testresults@gcc.gnu.org mailing list for the GCC project.


Index Nav: [Date Index] [Subject Index] [Author Index] [Thread Index]
Message Nav: [Date Prev] [Date Next] [Thread Prev] [Thread Next]
Other format: [Raw text]

Results for 3.4.0 20040210 (prerelease) testsuite on sparc64-unknown-freebsd5.2


Using gmake with objdir configuration on panther (see key)

LAST_UPDATED: Tue Feb 10 21:58:02 GMT 2004

Native configuration is sparc64-unknown-freebsd5.2

		=== g++ tests ===


Running target unix/-pthread
FAIL: g++.dg/abi/covariant2.C (test for excess errors)
FAIL: g++.dg/abi/covariant3.C (test for excess errors)
WARNING: g++.dg/abi/covariant3.C compilation failed to produce executable
WARNING: g++.dg/eh/simd-1.C compilation failed to produce executable
WARNING: g++.dg/eh/simd-2.C compilation failed to produce executable
FAIL: g++.dg/inherit/covariant11.C (test for excess errors)
FAIL: g++.dg/inherit/covariant3.C (test for excess errors)
WARNING: g++.dg/inherit/covariant3.C compilation failed to produce executable
FAIL: g++.dg/inherit/covariant4.C (test for excess errors)
WARNING: g++.dg/inherit/covariant4.C compilation failed to produce executable
FAIL: g++.dg/inherit/covariant6.C (test for excess errors)
FAIL: g++.dg/inherit/covariant8.C (test for excess errors)
FAIL: g++.dg/inherit/covariant9.C (test for excess errors)
XPASS: g++.dg/other/packed1.C execution test
FAIL: g++.dg/pch/system-1.C -g assembly comparison
FAIL: g++.dg/pch/system-2.C -g assembly comparison
FAIL: g++.old-deja/g++.eh/badalloc1.C execution test
FAIL: g++.old-deja/g++.law/profile1.C (test for excess errors)
WARNING: g++.old-deja/g++.law/profile1.C compilation failed to produce executable
WARNING: g++.old-deja/g++.mike/p10769a.C compilation failed to produce executable
WARNING: g++.old-deja/g++.other/enum5.C compilation failed to produce executable
WARNING: g++.old-deja/g++.pt/friend44.C compilation failed to produce executable
FAIL: g++.old-deja/g++.robertl/eb17.C (test for excess errors)
WARNING: g++.old-deja/g++.robertl/eb17.C compilation failed to produce executable

		=== g++ Summary ===

# of expected passes		9356
# of unexpected failures	13
# of unexpected successes	1
# of expected failures		59
# of unsupported tests		69
/s/scratch/ljrittle/gcc-build-panther-0210/gcc/testsuite/../g++ version 3.4.0 20040210 (prerelease)

		=== g77 tests ===


Running target unix/-pthread
FAIL: g77.dg/bprob/g77-bprob-1.f compilation,  -g  -fprofile-arcs
UNRESOLVED: g77.dg/bprob/g77-bprob-1.f execution,    -g  -fprofile-arcs
UNRESOLVED: g77.dg/bprob/g77-bprob-1.f compilation,  -g  -fbranch-probabilities
UNRESOLVED: g77.dg/bprob/g77-bprob-1.f execution,    -g  -fbranch-probabilities
FAIL: g77.dg/bprob/g77-bprob-1.f compilation,  -O0  -fprofile-arcs
UNRESOLVED: g77.dg/bprob/g77-bprob-1.f execution,    -O0  -fprofile-arcs
UNRESOLVED: g77.dg/bprob/g77-bprob-1.f compilation,  -O0  -fbranch-probabilities
UNRESOLVED: g77.dg/bprob/g77-bprob-1.f execution,    -O0  -fbranch-probabilities
FAIL: g77.dg/bprob/g77-bprob-1.f compilation,  -O1  -fprofile-arcs
UNRESOLVED: g77.dg/bprob/g77-bprob-1.f execution,    -O1  -fprofile-arcs
UNRESOLVED: g77.dg/bprob/g77-bprob-1.f compilation,  -O1  -fbranch-probabilities
UNRESOLVED: g77.dg/bprob/g77-bprob-1.f execution,    -O1  -fbranch-probabilities
FAIL: g77.dg/bprob/g77-bprob-1.f compilation,  -O2  -fprofile-arcs
UNRESOLVED: g77.dg/bprob/g77-bprob-1.f execution,    -O2  -fprofile-arcs
UNRESOLVED: g77.dg/bprob/g77-bprob-1.f compilation,  -O2  -fbranch-probabilities
UNRESOLVED: g77.dg/bprob/g77-bprob-1.f execution,    -O2  -fbranch-probabilities
FAIL: g77.dg/bprob/g77-bprob-1.f compilation,  -O3  -fprofile-arcs
UNRESOLVED: g77.dg/bprob/g77-bprob-1.f execution,    -O3  -fprofile-arcs
UNRESOLVED: g77.dg/bprob/g77-bprob-1.f compilation,  -O3  -fbranch-probabilities
UNRESOLVED: g77.dg/bprob/g77-bprob-1.f execution,    -O3  -fbranch-probabilities
FAIL: g77.dg/bprob/g77-bprob-1.f compilation,  -O3 -g  -fprofile-arcs
UNRESOLVED: g77.dg/bprob/g77-bprob-1.f execution,    -O3 -g  -fprofile-arcs
UNRESOLVED: g77.dg/bprob/g77-bprob-1.f compilation,  -O3 -g  -fbranch-probabilities
UNRESOLVED: g77.dg/bprob/g77-bprob-1.f execution,    -O3 -g  -fbranch-probabilities
FAIL: g77.dg/bprob/g77-bprob-1.f compilation,  -Os  -fprofile-arcs
UNRESOLVED: g77.dg/bprob/g77-bprob-1.f execution,    -Os  -fprofile-arcs
UNRESOLVED: g77.dg/bprob/g77-bprob-1.f compilation,  -Os  -fbranch-probabilities
UNRESOLVED: g77.dg/bprob/g77-bprob-1.f execution,    -Os  -fbranch-probabilities
FAIL: g77.dg/12632.f  -O0  out of defined range (test for errors, line 4)
FAIL: g77.dg/12632.f  -O0  (test for excess errors)
FAIL: g77.dg/12632.f  -O1  out of defined range (test for errors, line 4)
FAIL: g77.dg/12632.f  -O1  (test for excess errors)
FAIL: g77.dg/12632.f  -O2  out of defined range (test for errors, line 4)
FAIL: g77.dg/12632.f  -O2  (test for excess errors)
FAIL: g77.dg/12632.f  -O3 -fomit-frame-pointer  out of defined range (test for errors, line 4)
FAIL: g77.dg/12632.f  -O3 -fomit-frame-pointer  (test for excess errors)
FAIL: g77.dg/12632.f  -O3 -g  out of defined range (test for errors, line 4)
FAIL: g77.dg/12632.f  -O3 -g  (test for excess errors)
FAIL: g77.dg/12632.f  -Os  out of defined range (test for errors, line 4)
FAIL: g77.dg/12632.f  -Os  (test for excess errors)
FAIL: g77.dg/7388.f  -O0  (test for excess errors)
WARNING: g77.dg/7388.f  -O0  compilation failed to produce executable
FAIL: g77.dg/7388.f  -O1  (test for excess errors)
WARNING: g77.dg/7388.f  -O1  compilation failed to produce executable
FAIL: g77.dg/7388.f  -O2  (test for excess errors)
WARNING: g77.dg/7388.f  -O2  compilation failed to produce executable
FAIL: g77.dg/7388.f  -O3 -fomit-frame-pointer  (test for excess errors)
WARNING: g77.dg/7388.f  -O3 -fomit-frame-pointer  compilation failed to produce executable
FAIL: g77.dg/7388.f  -O3 -g  (test for excess errors)
WARNING: g77.dg/7388.f  -O3 -g  compilation failed to produce executable
FAIL: g77.dg/7388.f  -Os  (test for excess errors)
WARNING: g77.dg/7388.f  -Os  compilation failed to produce executable
FAIL: g77.dg/f77-edit-apostrophe-out.f  -O0  (test for excess errors)
WARNING: g77.dg/f77-edit-apostrophe-out.f  -O0  compilation failed to produce executable
FAIL: g77.dg/f77-edit-apostrophe-out.f  -O1  (test for excess errors)
WARNING: g77.dg/f77-edit-apostrophe-out.f  -O1  compilation failed to produce executable
FAIL: g77.dg/f77-edit-apostrophe-out.f  -O2  (test for excess errors)
WARNING: g77.dg/f77-edit-apostrophe-out.f  -O2  compilation failed to produce executable
FAIL: g77.dg/f77-edit-apostrophe-out.f  -O3 -fomit-frame-pointer  (test for excess errors)
WARNING: g77.dg/f77-edit-apostrophe-out.f  -O3 -fomit-frame-pointer  compilation failed to produce executable
FAIL: g77.dg/f77-edit-apostrophe-out.f  -O3 -fomit-frame-pointer -funroll-loops  (test for excess errors)
WARNING: g77.dg/f77-edit-apostrophe-out.f  -O3 -fomit-frame-pointer -funroll-loops  compilation failed to produce executable
FAIL: g77.dg/f77-edit-apostrophe-out.f  -O3 -fomit-frame-pointer -funroll-all-loops -finline-functions  (test for excess errors)
WARNING: g77.dg/f77-edit-apostrophe-out.f  -O3 -fomit-frame-pointer -funroll-all-loops -finline-functions  compilation failed to produce executable
FAIL: g77.dg/f77-edit-apostrophe-out.f  -O3 -g  (test for excess errors)
WARNING: g77.dg/f77-edit-apostrophe-out.f  -O3 -g  compilation failed to produce executable
FAIL: g77.dg/f77-edit-apostrophe-out.f  -Os  (test for excess errors)
WARNING: g77.dg/f77-edit-apostrophe-out.f  -Os  compilation failed to produce executable
FAIL: g77.dg/f77-edit-colon-out.f  -O0  (test for excess errors)
WARNING: g77.dg/f77-edit-colon-out.f  -O0  compilation failed to produce executable
FAIL: g77.dg/f77-edit-colon-out.f  -O1  (test for excess errors)
WARNING: g77.dg/f77-edit-colon-out.f  -O1  compilation failed to produce executable
FAIL: g77.dg/f77-edit-colon-out.f  -O2  (test for excess errors)
WARNING: g77.dg/f77-edit-colon-out.f  -O2  compilation failed to produce executable
FAIL: g77.dg/f77-edit-colon-out.f  -O3 -fomit-frame-pointer  (test for excess errors)
WARNING: g77.dg/f77-edit-colon-out.f  -O3 -fomit-frame-pointer  compilation failed to produce executable
FAIL: g77.dg/f77-edit-colon-out.f  -O3 -g  (test for excess errors)
WARNING: g77.dg/f77-edit-colon-out.f  -O3 -g  compilation failed to produce executable
FAIL: g77.dg/f77-edit-colon-out.f  -Os  (test for excess errors)
WARNING: g77.dg/f77-edit-colon-out.f  -Os  compilation failed to produce executable
FAIL: g77.dg/f77-edit-h-out.f  -O0  (test for excess errors)
WARNING: g77.dg/f77-edit-h-out.f  -O0  compilation failed to produce executable
FAIL: g77.dg/f77-edit-h-out.f  -O1  (test for excess errors)
WARNING: g77.dg/f77-edit-h-out.f  -O1  compilation failed to produce executable
FAIL: g77.dg/f77-edit-h-out.f  -O2  (test for excess errors)
WARNING: g77.dg/f77-edit-h-out.f  -O2  compilation failed to produce executable
FAIL: g77.dg/f77-edit-h-out.f  -O3 -fomit-frame-pointer  (test for excess errors)
WARNING: g77.dg/f77-edit-h-out.f  -O3 -fomit-frame-pointer  compilation failed to produce executable
FAIL: g77.dg/f77-edit-h-out.f  -O3 -fomit-frame-pointer -funroll-loops  (test for excess errors)
WARNING: g77.dg/f77-edit-h-out.f  -O3 -fomit-frame-pointer -funroll-loops  compilation failed to produce executable
FAIL: g77.dg/f77-edit-h-out.f  -O3 -fomit-frame-pointer -funroll-all-loops -finline-functions  (test for excess errors)
WARNING: g77.dg/f77-edit-h-out.f  -O3 -fomit-frame-pointer -funroll-all-loops -finline-functions  compilation failed to produce executable
FAIL: g77.dg/f77-edit-h-out.f  -O3 -g  (test for excess errors)
WARNING: g77.dg/f77-edit-h-out.f  -O3 -g  compilation failed to produce executable
FAIL: g77.dg/f77-edit-h-out.f  -Os  (test for excess errors)
WARNING: g77.dg/f77-edit-h-out.f  -Os  compilation failed to produce executable
FAIL: g77.dg/f77-edit-i-in.f  -O0  (test for excess errors)
WARNING: g77.dg/f77-edit-i-in.f  -O0  compilation failed to produce executable
FAIL: g77.dg/f77-edit-i-in.f  -O1  (test for excess errors)
WARNING: g77.dg/f77-edit-i-in.f  -O1  compilation failed to produce executable
FAIL: g77.dg/f77-edit-i-in.f  -O2  (test for excess errors)
WARNING: g77.dg/f77-edit-i-in.f  -O2  compilation failed to produce executable
FAIL: g77.dg/f77-edit-i-in.f  -O3 -fomit-frame-pointer  (test for excess errors)
WARNING: g77.dg/f77-edit-i-in.f  -O3 -fomit-frame-pointer  compilation failed to produce executable
FAIL: g77.dg/f77-edit-i-in.f  -O3 -g  (test for excess errors)
WARNING: g77.dg/f77-edit-i-in.f  -O3 -g  compilation failed to produce executable
FAIL: g77.dg/f77-edit-i-in.f  -Os  (test for excess errors)
WARNING: g77.dg/f77-edit-i-in.f  -Os  compilation failed to produce executable
FAIL: g77.dg/f77-edit-i-out.f  -O0  (test for excess errors)
WARNING: g77.dg/f77-edit-i-out.f  -O0  compilation failed to produce executable
FAIL: g77.dg/f77-edit-i-out.f  -O1  (test for excess errors)
WARNING: g77.dg/f77-edit-i-out.f  -O1  compilation failed to produce executable
FAIL: g77.dg/f77-edit-i-out.f  -O2  (test for excess errors)
WARNING: g77.dg/f77-edit-i-out.f  -O2  compilation failed to produce executable
FAIL: g77.dg/f77-edit-i-out.f  -O3 -fomit-frame-pointer  (test for excess errors)
WARNING: g77.dg/f77-edit-i-out.f  -O3 -fomit-frame-pointer  compilation failed to produce executable
FAIL: g77.dg/f77-edit-i-out.f  -O3 -g  (test for excess errors)
WARNING: g77.dg/f77-edit-i-out.f  -O3 -g  compilation failed to produce executable
FAIL: g77.dg/f77-edit-i-out.f  -Os  (test for excess errors)
WARNING: g77.dg/f77-edit-i-out.f  -Os  compilation failed to produce executable
FAIL: g77.dg/f77-edit-s-out.f  -O0  (test for excess errors)
WARNING: g77.dg/f77-edit-s-out.f  -O0  compilation failed to produce executable
FAIL: g77.dg/f77-edit-s-out.f  -O1  (test for excess errors)
WARNING: g77.dg/f77-edit-s-out.f  -O1  compilation failed to produce executable
FAIL: g77.dg/f77-edit-s-out.f  -O2  (test for excess errors)
WARNING: g77.dg/f77-edit-s-out.f  -O2  compilation failed to produce executable
FAIL: g77.dg/f77-edit-s-out.f  -O3 -fomit-frame-pointer  (test for excess errors)
WARNING: g77.dg/f77-edit-s-out.f  -O3 -fomit-frame-pointer  compilation failed to produce executable
FAIL: g77.dg/f77-edit-s-out.f  -O3 -fomit-frame-pointer -funroll-loops  (test for excess errors)
WARNING: g77.dg/f77-edit-s-out.f  -O3 -fomit-frame-pointer -funroll-loops  compilation failed to produce executable
FAIL: g77.dg/f77-edit-s-out.f  -O3 -fomit-frame-pointer -funroll-all-loops -finline-functions  (test for excess errors)
WARNING: g77.dg/f77-edit-s-out.f  -O3 -fomit-frame-pointer -funroll-all-loops -finline-functions  compilation failed to produce executable
FAIL: g77.dg/f77-edit-s-out.f  -O3 -g  (test for excess errors)
WARNING: g77.dg/f77-edit-s-out.f  -O3 -g  compilation failed to produce executable
FAIL: g77.dg/f77-edit-s-out.f  -Os  (test for excess errors)
WARNING: g77.dg/f77-edit-s-out.f  -Os  compilation failed to produce executable
FAIL: g77.dg/f77-edit-slash-out.f  -O0  (test for excess errors)
WARNING: g77.dg/f77-edit-slash-out.f  -O0  compilation failed to produce executable
FAIL: g77.dg/f77-edit-slash-out.f  -O1  (test for excess errors)
WARNING: g77.dg/f77-edit-slash-out.f  -O1  compilation failed to produce executable
FAIL: g77.dg/f77-edit-slash-out.f  -O2  (test for excess errors)
WARNING: g77.dg/f77-edit-slash-out.f  -O2  compilation failed to produce executable
FAIL: g77.dg/f77-edit-slash-out.f  -O3 -fomit-frame-pointer  (test for excess errors)
WARNING: g77.dg/f77-edit-slash-out.f  -O3 -fomit-frame-pointer  compilation failed to produce executable
FAIL: g77.dg/f77-edit-slash-out.f  -O3 -g  (test for excess errors)
WARNING: g77.dg/f77-edit-slash-out.f  -O3 -g  compilation failed to produce executable
FAIL: g77.dg/f77-edit-slash-out.f  -Os  (test for excess errors)
WARNING: g77.dg/f77-edit-slash-out.f  -Os  compilation failed to produce executable
FAIL: g77.dg/f77-edit-t-in.f  -O0  (test for excess errors)
WARNING: g77.dg/f77-edit-t-in.f  -O0  compilation failed to produce executable
FAIL: g77.dg/f77-edit-t-in.f  -O1  (test for excess errors)
WARNING: g77.dg/f77-edit-t-in.f  -O1  compilation failed to produce executable
FAIL: g77.dg/f77-edit-t-in.f  -O2  (test for excess errors)
WARNING: g77.dg/f77-edit-t-in.f  -O2  compilation failed to produce executable
FAIL: g77.dg/f77-edit-t-in.f  -O3 -fomit-frame-pointer  (test for excess errors)
WARNING: g77.dg/f77-edit-t-in.f  -O3 -fomit-frame-pointer  compilation failed to produce executable
FAIL: g77.dg/f77-edit-t-in.f  -O3 -fomit-frame-pointer -funroll-loops  (test for excess errors)
WARNING: g77.dg/f77-edit-t-in.f  -O3 -fomit-frame-pointer -funroll-loops  compilation failed to produce executable
FAIL: g77.dg/f77-edit-t-in.f  -O3 -fomit-frame-pointer -funroll-all-loops -finline-functions  (test for excess errors)
WARNING: g77.dg/f77-edit-t-in.f  -O3 -fomit-frame-pointer -funroll-all-loops -finline-functions  compilation failed to produce executable
FAIL: g77.dg/f77-edit-t-in.f  -O3 -g  (test for excess errors)
WARNING: g77.dg/f77-edit-t-in.f  -O3 -g  compilation failed to produce executable
FAIL: g77.dg/f77-edit-t-in.f  -Os  (test for excess errors)
WARNING: g77.dg/f77-edit-t-in.f  -Os  compilation failed to produce executable
FAIL: g77.dg/f77-edit-t-out.f  -O0  (test for excess errors)
WARNING: g77.dg/f77-edit-t-out.f  -O0  compilation failed to produce executable
FAIL: g77.dg/f77-edit-t-out.f  -O1  (test for excess errors)
WARNING: g77.dg/f77-edit-t-out.f  -O1  compilation failed to produce executable
FAIL: g77.dg/f77-edit-t-out.f  -O2  (test for excess errors)
WARNING: g77.dg/f77-edit-t-out.f  -O2  compilation failed to produce executable
FAIL: g77.dg/f77-edit-t-out.f  -O3 -fomit-frame-pointer  (test for excess errors)
WARNING: g77.dg/f77-edit-t-out.f  -O3 -fomit-frame-pointer  compilation failed to produce executable
FAIL: g77.dg/f77-edit-t-out.f  -O3 -g  (test for excess errors)
WARNING: g77.dg/f77-edit-t-out.f  -O3 -g  compilation failed to produce executable
FAIL: g77.dg/f77-edit-t-out.f  -Os  (test for excess errors)
WARNING: g77.dg/f77-edit-t-out.f  -Os  compilation failed to produce executable
FAIL: g77.dg/f77-edit-x-out.f  -O0  (test for excess errors)
WARNING: g77.dg/f77-edit-x-out.f  -O0  compilation failed to produce executable
FAIL: g77.dg/f77-edit-x-out.f  -O1  (test for excess errors)
WARNING: g77.dg/f77-edit-x-out.f  -O1  compilation failed to produce executable
FAIL: g77.dg/f77-edit-x-out.f  -O2  (test for excess errors)
WARNING: g77.dg/f77-edit-x-out.f  -O2  compilation failed to produce executable
FAIL: g77.dg/f77-edit-x-out.f  -O3 -fomit-frame-pointer  (test for excess errors)
WARNING: g77.dg/f77-edit-x-out.f  -O3 -fomit-frame-pointer  compilation failed to produce executable
FAIL: g77.dg/f77-edit-x-out.f  -O3 -g  (test for excess errors)
WARNING: g77.dg/f77-edit-x-out.f  -O3 -g  compilation failed to produce executable
FAIL: g77.dg/f77-edit-x-out.f  -Os  (test for excess errors)
WARNING: g77.dg/f77-edit-x-out.f  -Os  compilation failed to produce executable
FAIL: g77.dg/fbackslash.f  -O0  (test for excess errors)
WARNING: g77.dg/fbackslash.f  -O0  compilation failed to produce executable
FAIL: g77.dg/fbackslash.f  -O1  (test for excess errors)
WARNING: g77.dg/fbackslash.f  -O1  compilation failed to produce executable
FAIL: g77.dg/fbackslash.f  -O2  (test for excess errors)
WARNING: g77.dg/fbackslash.f  -O2  compilation failed to produce executable
FAIL: g77.dg/fbackslash.f  -O3 -fomit-frame-pointer  (test for excess errors)
WARNING: g77.dg/fbackslash.f  -O3 -fomit-frame-pointer  compilation failed to produce executable
FAIL: g77.dg/fbackslash.f  -O3 -g  (test for excess errors)
WARNING: g77.dg/fbackslash.f  -O3 -g  compilation failed to produce executable
FAIL: g77.dg/fbackslash.f  -Os  (test for excess errors)
WARNING: g77.dg/fbackslash.f  -Os  compilation failed to produce executable
FAIL: g77.dg/fcase-preserve.f  -O0  (test for excess errors)
WARNING: g77.dg/fcase-preserve.f  -O0  compilation failed to produce executable
FAIL: g77.dg/fcase-preserve.f  -O1  (test for excess errors)
WARNING: g77.dg/fcase-preserve.f  -O1  compilation failed to produce executable
FAIL: g77.dg/fcase-preserve.f  -O2  (test for excess errors)
WARNING: g77.dg/fcase-preserve.f  -O2  compilation failed to produce executable
FAIL: g77.dg/fcase-preserve.f  -O3 -fomit-frame-pointer  (test for excess errors)
WARNING: g77.dg/fcase-preserve.f  -O3 -fomit-frame-pointer  compilation failed to produce executable
FAIL: g77.dg/fcase-preserve.f  -O3 -g  (test for excess errors)
WARNING: g77.dg/fcase-preserve.f  -O3 -g  compilation failed to produce executable
FAIL: g77.dg/fcase-preserve.f  -Os  (test for excess errors)
WARNING: g77.dg/fcase-preserve.f  -Os  compilation failed to produce executable
FAIL: g77.dg/ff90-1.f  -O0  (test for excess errors)
WARNING: g77.dg/ff90-1.f  -O0  compilation failed to produce executable
FAIL: g77.dg/ff90-1.f  -O1  (test for excess errors)
WARNING: g77.dg/ff90-1.f  -O1  compilation failed to produce executable
FAIL: g77.dg/ff90-1.f  -O2  (test for excess errors)
WARNING: g77.dg/ff90-1.f  -O2  compilation failed to produce executable
FAIL: g77.dg/ff90-1.f  -O3 -fomit-frame-pointer  (test for excess errors)
WARNING: g77.dg/ff90-1.f  -O3 -fomit-frame-pointer  compilation failed to produce executable
FAIL: g77.dg/ff90-1.f  -O3 -g  (test for excess errors)
WARNING: g77.dg/ff90-1.f  -O3 -g  compilation failed to produce executable
FAIL: g77.dg/ff90-1.f  -Os  (test for excess errors)
WARNING: g77.dg/ff90-1.f  -Os  compilation failed to produce executable
FAIL: g77.dg/ffixed-form-1.f  -O0  (test for excess errors)
FAIL: g77.dg/ffixed-form-1.f  -O1  (test for excess errors)
FAIL: g77.dg/ffixed-form-1.f  -O2  (test for excess errors)
FAIL: g77.dg/ffixed-form-1.f  -O3 -fomit-frame-pointer  (test for excess errors)
FAIL: g77.dg/ffixed-form-1.f  -O3 -g  (test for excess errors)
FAIL: g77.dg/ffixed-form-1.f  -Os  (test for excess errors)
FAIL: g77.dg/ffixed-form-2.f  -O0  (test for excess errors)
FAIL: g77.dg/ffixed-form-2.f  -O1  (test for excess errors)
FAIL: g77.dg/ffixed-form-2.f  -O2  (test for excess errors)
FAIL: g77.dg/ffixed-form-2.f  -O3 -fomit-frame-pointer  (test for excess errors)
FAIL: g77.dg/ffixed-form-2.f  -O3 -g  (test for excess errors)
FAIL: g77.dg/ffixed-form-2.f  -Os  (test for excess errors)
FAIL: g77.dg/ffixed-line-length-0.f  -O0  (test for excess errors)
FAIL: g77.dg/ffixed-line-length-0.f  -O1  (test for excess errors)
FAIL: g77.dg/ffixed-line-length-0.f  -O2  (test for excess errors)
FAIL: g77.dg/ffixed-line-length-0.f  -O3 -fomit-frame-pointer  (test for excess errors)
FAIL: g77.dg/ffixed-line-length-0.f  -O3 -g  (test for excess errors)
FAIL: g77.dg/ffixed-line-length-0.f  -Os  (test for excess errors)
FAIL: g77.dg/ffixed-line-length-132.f  -O0  (test for excess errors)
FAIL: g77.dg/ffixed-line-length-132.f  -O1  (test for excess errors)
FAIL: g77.dg/ffixed-line-length-132.f  -O2  (test for excess errors)
FAIL: g77.dg/ffixed-line-length-132.f  -O3 -fomit-frame-pointer  (test for excess errors)
FAIL: g77.dg/ffixed-line-length-132.f  -O3 -g  (test for excess errors)
FAIL: g77.dg/ffixed-line-length-132.f  -Os  (test for excess errors)
FAIL: g77.dg/ffixed-line-length-7.f  -O0  (test for excess errors)
FAIL: g77.dg/ffixed-line-length-7.f  -O1  (test for excess errors)
FAIL: g77.dg/ffixed-line-length-7.f  -O2  (test for excess errors)
FAIL: g77.dg/ffixed-line-length-7.f  -O3 -fomit-frame-pointer  (test for excess errors)
FAIL: g77.dg/ffixed-line-length-7.f  -O3 -g  (test for excess errors)
FAIL: g77.dg/ffixed-line-length-7.f  -Os  (test for excess errors)
FAIL: g77.dg/ffixed-line-length-72.f  -O0  (test for excess errors)
FAIL: g77.dg/ffixed-line-length-72.f  -O1  (test for excess errors)
FAIL: g77.dg/ffixed-line-length-72.f  -O2  (test for excess errors)
FAIL: g77.dg/ffixed-line-length-72.f  -O3 -fomit-frame-pointer  (test for excess errors)
FAIL: g77.dg/ffixed-line-length-72.f  -O3 -g  (test for excess errors)
FAIL: g77.dg/ffixed-line-length-72.f  -Os  (test for excess errors)
FAIL: g77.dg/ffixed-line-length-none.f  -O0  (test for excess errors)
FAIL: g77.dg/ffixed-line-length-none.f  -O1  (test for excess errors)
FAIL: g77.dg/ffixed-line-length-none.f  -O2  (test for excess errors)
FAIL: g77.dg/ffixed-line-length-none.f  -O3 -fomit-frame-pointer  (test for excess errors)
FAIL: g77.dg/ffixed-line-length-none.f  -O3 -g  (test for excess errors)
FAIL: g77.dg/ffixed-line-length-none.f  -Os  (test for excess errors)
FAIL: g77.dg/ffree-form-1.f  -O0  (test for excess errors)
FAIL: g77.dg/ffree-form-1.f  -O1  (test for excess errors)
FAIL: g77.dg/ffree-form-1.f  -O2  (test for excess errors)
FAIL: g77.dg/ffree-form-1.f  -O3 -fomit-frame-pointer  (test for excess errors)
FAIL: g77.dg/ffree-form-1.f  -O3 -g  (test for excess errors)
FAIL: g77.dg/ffree-form-1.f  -Os  (test for excess errors)
FAIL: g77.dg/ffree-form-2.f  -O0  (test for excess errors)
FAIL: g77.dg/ffree-form-2.f  -O1  (test for excess errors)
FAIL: g77.dg/ffree-form-2.f  -O2  (test for excess errors)
FAIL: g77.dg/ffree-form-2.f  -O3 -fomit-frame-pointer  (test for excess errors)
FAIL: g77.dg/ffree-form-2.f  -O3 -g  (test for excess errors)
FAIL: g77.dg/ffree-form-2.f  -Os  (test for excess errors)
FAIL: g77.dg/ffree-form-3.f  -O0  (test for excess errors)
FAIL: g77.dg/ffree-form-3.f  -O1  (test for excess errors)
FAIL: g77.dg/ffree-form-3.f  -O2  (test for excess errors)
FAIL: g77.dg/ffree-form-3.f  -O3 -fomit-frame-pointer  (test for excess errors)
FAIL: g77.dg/ffree-form-3.f  -O3 -g  (test for excess errors)
FAIL: g77.dg/ffree-form-3.f  -Os  (test for excess errors)
FAIL: g77.dg/fno-backslash.f  -O0  (test for excess errors)
WARNING: g77.dg/fno-backslash.f  -O0  compilation failed to produce executable
FAIL: g77.dg/fno-backslash.f  -O1  (test for excess errors)
WARNING: g77.dg/fno-backslash.f  -O1  compilation failed to produce executable
FAIL: g77.dg/fno-backslash.f  -O2  (test for excess errors)
WARNING: g77.dg/fno-backslash.f  -O2  compilation failed to produce executable
FAIL: g77.dg/fno-backslash.f  -O3 -fomit-frame-pointer  (test for excess errors)
WARNING: g77.dg/fno-backslash.f  -O3 -fomit-frame-pointer  compilation failed to produce executable
FAIL: g77.dg/fno-backslash.f  -O3 -g  (test for excess errors)
WARNING: g77.dg/fno-backslash.f  -O3 -g  compilation failed to produce executable
FAIL: g77.dg/fno-backslash.f  -Os  (test for excess errors)
WARNING: g77.dg/fno-backslash.f  -Os  compilation failed to produce executable
FAIL: g77.dg/fno-f90-1.f  -O0  (test for excess errors)
WARNING: g77.dg/fno-f90-1.f  -O0  compilation failed to produce executable
FAIL: g77.dg/fno-f90-1.f  -O1  (test for excess errors)
WARNING: g77.dg/fno-f90-1.f  -O1  compilation failed to produce executable
FAIL: g77.dg/fno-f90-1.f  -O2  (test for excess errors)
WARNING: g77.dg/fno-f90-1.f  -O2  compilation failed to produce executable
FAIL: g77.dg/fno-f90-1.f  -O3 -fomit-frame-pointer  (test for excess errors)
WARNING: g77.dg/fno-f90-1.f  -O3 -fomit-frame-pointer  compilation failed to produce executable
FAIL: g77.dg/fno-f90-1.f  -O3 -g  (test for excess errors)
WARNING: g77.dg/fno-f90-1.f  -O3 -g  compilation failed to produce executable
FAIL: g77.dg/fno-f90-1.f  -Os  (test for excess errors)
WARNING: g77.dg/fno-f90-1.f  -Os  compilation failed to produce executable
FAIL: g77.dg/fno-fixed-form-1.f  -O0  (test for excess errors)
FAIL: g77.dg/fno-fixed-form-1.f  -O1  (test for excess errors)
FAIL: g77.dg/fno-fixed-form-1.f  -O2  (test for excess errors)
FAIL: g77.dg/fno-fixed-form-1.f  -O3 -fomit-frame-pointer  (test for excess errors)
FAIL: g77.dg/fno-fixed-form-1.f  -O3 -g  (test for excess errors)
FAIL: g77.dg/fno-fixed-form-1.f  -Os  (test for excess errors)
FAIL: g77.dg/fno-onetrip.f  -O0  (test for excess errors)
WARNING: g77.dg/fno-onetrip.f  -O0  compilation failed to produce executable
FAIL: g77.dg/fno-onetrip.f  -O1  (test for excess errors)
WARNING: g77.dg/fno-onetrip.f  -O1  compilation failed to produce executable
FAIL: g77.dg/fno-onetrip.f  -O2  (test for excess errors)
WARNING: g77.dg/fno-onetrip.f  -O2  compilation failed to produce executable
FAIL: g77.dg/fno-onetrip.f  -O3 -fomit-frame-pointer  (test for excess errors)
WARNING: g77.dg/fno-onetrip.f  -O3 -fomit-frame-pointer  compilation failed to produce executable
FAIL: g77.dg/fno-onetrip.f  -O3 -g  (test for excess errors)
WARNING: g77.dg/fno-onetrip.f  -O3 -g  compilation failed to produce executable
FAIL: g77.dg/fno-onetrip.f  -Os  (test for excess errors)
WARNING: g77.dg/fno-onetrip.f  -Os  compilation failed to produce executable
FAIL: g77.dg/fno-typeless-boz.f  -O0  (test for excess errors)
WARNING: g77.dg/fno-typeless-boz.f  -O0  compilation failed to produce executable
FAIL: g77.dg/fno-typeless-boz.f  -O1  (test for excess errors)
WARNING: g77.dg/fno-typeless-boz.f  -O1  compilation failed to produce executable
FAIL: g77.dg/fno-typeless-boz.f  -O2  (test for excess errors)
WARNING: g77.dg/fno-typeless-boz.f  -O2  compilation failed to produce executable
FAIL: g77.dg/fno-typeless-boz.f  -O3 -fomit-frame-pointer  (test for excess errors)
WARNING: g77.dg/fno-typeless-boz.f  -O3 -fomit-frame-pointer  compilation failed to produce executable
FAIL: g77.dg/fno-typeless-boz.f  -O3 -g  (test for excess errors)
WARNING: g77.dg/fno-typeless-boz.f  -O3 -g  compilation failed to produce executable
FAIL: g77.dg/fno-typeless-boz.f  -Os  (test for excess errors)
WARNING: g77.dg/fno-typeless-boz.f  -Os  compilation failed to produce executable
FAIL: g77.dg/fno-underscoring.f  -O0  (test for excess errors)
ERROR: g77.dg/fno-underscoring.f  -O0 : error executing dg-final: couldn't open "fno-underscoring.s": no such file or directory
UNRESOLVED: g77.dg/fno-underscoring.f  -O0 : error executing dg-final: couldn't open "fno-underscoring.s": no such file or directory
FAIL: g77.dg/fno-underscoring.f  -O1  (test for excess errors)
ERROR: g77.dg/fno-underscoring.f  -O1 : error executing dg-final: couldn't open "fno-underscoring.s": no such file or directory
UNRESOLVED: g77.dg/fno-underscoring.f  -O1 : error executing dg-final: couldn't open "fno-underscoring.s": no such file or directory
FAIL: g77.dg/fno-underscoring.f  -O2  (test for excess errors)
ERROR: g77.dg/fno-underscoring.f  -O2 : error executing dg-final: couldn't open "fno-underscoring.s": no such file or directory
UNRESOLVED: g77.dg/fno-underscoring.f  -O2 : error executing dg-final: couldn't open "fno-underscoring.s": no such file or directory
FAIL: g77.dg/fno-underscoring.f  -O3 -fomit-frame-pointer  (test for excess errors)
ERROR: g77.dg/fno-underscoring.f  -O3 -fomit-frame-pointer : error executing dg-final: couldn't open "fno-underscoring.s": no such file or directory
UNRESOLVED: g77.dg/fno-underscoring.f  -O3 -fomit-frame-pointer : error executing dg-final: couldn't open "fno-underscoring.s": no such file or directory
FAIL: g77.dg/fno-underscoring.f  -O3 -g  (test for excess errors)
ERROR: g77.dg/fno-underscoring.f  -O3 -g : error executing dg-final: couldn't open "fno-underscoring.s": no such file or directory
UNRESOLVED: g77.dg/fno-underscoring.f  -O3 -g : error executing dg-final: couldn't open "fno-underscoring.s": no such file or directory
FAIL: g77.dg/fno-underscoring.f  -Os  (test for excess errors)
ERROR: g77.dg/fno-underscoring.f  -Os : error executing dg-final: couldn't open "fno-underscoring.s": no such file or directory
UNRESOLVED: g77.dg/fno-underscoring.f  -Os : error executing dg-final: couldn't open "fno-underscoring.s": no such file or directory
FAIL: g77.dg/fno-vxt-1.f  -O0  (test for excess errors)
WARNING: g77.dg/fno-vxt-1.f  -O0  compilation failed to produce executable
FAIL: g77.dg/fno-vxt-1.f  -O1  (test for excess errors)
WARNING: g77.dg/fno-vxt-1.f  -O1  compilation failed to produce executable
FAIL: g77.dg/fno-vxt-1.f  -O2  (test for excess errors)
WARNING: g77.dg/fno-vxt-1.f  -O2  compilation failed to produce executable
FAIL: g77.dg/fno-vxt-1.f  -O3 -fomit-frame-pointer  (test for excess errors)
WARNING: g77.dg/fno-vxt-1.f  -O3 -fomit-frame-pointer  compilation failed to produce executable
FAIL: g77.dg/fno-vxt-1.f  -O3 -g  (test for excess errors)
WARNING: g77.dg/fno-vxt-1.f  -O3 -g  compilation failed to produce executable
FAIL: g77.dg/fno-vxt-1.f  -Os  (test for excess errors)
WARNING: g77.dg/fno-vxt-1.f  -Os  compilation failed to produce executable
FAIL: g77.dg/fonetrip.f  -O0  (test for excess errors)
WARNING: g77.dg/fonetrip.f  -O0  compilation failed to produce executable
FAIL: g77.dg/fonetrip.f  -O1  (test for excess errors)
WARNING: g77.dg/fonetrip.f  -O1  compilation failed to produce executable
FAIL: g77.dg/fonetrip.f  -O2  (test for excess errors)
WARNING: g77.dg/fonetrip.f  -O2  compilation failed to produce executable
FAIL: g77.dg/fonetrip.f  -O3 -fomit-frame-pointer  (test for excess errors)
WARNING: g77.dg/fonetrip.f  -O3 -fomit-frame-pointer  compilation failed to produce executable
FAIL: g77.dg/fonetrip.f  -O3 -g  (test for excess errors)
WARNING: g77.dg/fonetrip.f  -O3 -g  compilation failed to produce executable
FAIL: g77.dg/fonetrip.f  -Os  (test for excess errors)
WARNING: g77.dg/fonetrip.f  -Os  compilation failed to produce executable
FAIL: g77.dg/ftypeless-boz.f  -O0  (test for excess errors)
WARNING: g77.dg/ftypeless-boz.f  -O0  compilation failed to produce executable
FAIL: g77.dg/ftypeless-boz.f  -O1  (test for excess errors)
WARNING: g77.dg/ftypeless-boz.f  -O1  compilation failed to produce executable
FAIL: g77.dg/ftypeless-boz.f  -O2  (test for excess errors)
WARNING: g77.dg/ftypeless-boz.f  -O2  compilation failed to produce executable
FAIL: g77.dg/ftypeless-boz.f  -O3 -fomit-frame-pointer  (test for excess errors)
WARNING: g77.dg/ftypeless-boz.f  -O3 -fomit-frame-pointer  compilation failed to produce executable
FAIL: g77.dg/ftypeless-boz.f  -O3 -g  (test for excess errors)
WARNING: g77.dg/ftypeless-boz.f  -O3 -g  compilation failed to produce executable
FAIL: g77.dg/ftypeless-boz.f  -Os  (test for excess errors)
WARNING: g77.dg/ftypeless-boz.f  -Os  compilation failed to produce executable
FAIL: g77.dg/fugly-assumed.f  -O0  (test for excess errors)
FAIL: g77.dg/fugly-assumed.f  -O1  (test for excess errors)
FAIL: g77.dg/fugly-assumed.f  -O2  (test for excess errors)
FAIL: g77.dg/fugly-assumed.f  -O3 -fomit-frame-pointer  (test for excess errors)
FAIL: g77.dg/fugly-assumed.f  -O3 -g  (test for excess errors)
FAIL: g77.dg/fugly-assumed.f  -Os  (test for excess errors)
FAIL: g77.dg/funderscoring.f  -O0  (test for excess errors)
ERROR: g77.dg/funderscoring.f  -O0 : error executing dg-final: couldn't open "funderscoring.s": no such file or directory
UNRESOLVED: g77.dg/funderscoring.f  -O0 : error executing dg-final: couldn't open "funderscoring.s": no such file or directory
FAIL: g77.dg/funderscoring.f  -O1  (test for excess errors)
ERROR: g77.dg/funderscoring.f  -O1 : error executing dg-final: couldn't open "funderscoring.s": no such file or directory
UNRESOLVED: g77.dg/funderscoring.f  -O1 : error executing dg-final: couldn't open "funderscoring.s": no such file or directory
FAIL: g77.dg/funderscoring.f  -O2  (test for excess errors)
ERROR: g77.dg/funderscoring.f  -O2 : error executing dg-final: couldn't open "funderscoring.s": no such file or directory
UNRESOLVED: g77.dg/funderscoring.f  -O2 : error executing dg-final: couldn't open "funderscoring.s": no such file or directory
FAIL: g77.dg/funderscoring.f  -O3 -fomit-frame-pointer  (test for excess errors)
ERROR: g77.dg/funderscoring.f  -O3 -fomit-frame-pointer : error executing dg-final: couldn't open "funderscoring.s": no such file or directory
UNRESOLVED: g77.dg/funderscoring.f  -O3 -fomit-frame-pointer : error executing dg-final: couldn't open "funderscoring.s": no such file or directory
FAIL: g77.dg/funderscoring.f  -O3 -g  (test for excess errors)
ERROR: g77.dg/funderscoring.f  -O3 -g : error executing dg-final: couldn't open "funderscoring.s": no such file or directory
UNRESOLVED: g77.dg/funderscoring.f  -O3 -g : error executing dg-final: couldn't open "funderscoring.s": no such file or directory
FAIL: g77.dg/funderscoring.f  -Os  (test for excess errors)
ERROR: g77.dg/funderscoring.f  -Os : error executing dg-final: couldn't open "funderscoring.s": no such file or directory
UNRESOLVED: g77.dg/funderscoring.f  -Os : error executing dg-final: couldn't open "funderscoring.s": no such file or directory
FAIL: g77.dg/fvxt-1.f  -O0  (test for excess errors)
WARNING: g77.dg/fvxt-1.f  -O0  compilation failed to produce executable
FAIL: g77.dg/fvxt-1.f  -O1  (test for excess errors)
WARNING: g77.dg/fvxt-1.f  -O1  compilation failed to produce executable
FAIL: g77.dg/fvxt-1.f  -O2  (test for excess errors)
WARNING: g77.dg/fvxt-1.f  -O2  compilation failed to produce executable
FAIL: g77.dg/fvxt-1.f  -O3 -fomit-frame-pointer  (test for excess errors)
WARNING: g77.dg/fvxt-1.f  -O3 -fomit-frame-pointer  compilation failed to produce executable
FAIL: g77.dg/fvxt-1.f  -O3 -g  (test for excess errors)
WARNING: g77.dg/fvxt-1.f  -O3 -g  compilation failed to produce executable
FAIL: g77.dg/fvxt-1.f  -Os  (test for excess errors)
WARNING: g77.dg/fvxt-1.f  -Os  compilation failed to produce executable
FAIL: g77.dg/pr3743-1.f  -O0  (test for excess errors)
FAIL: g77.dg/pr3743-1.f  -O1  (test for excess errors)
FAIL: g77.dg/pr3743-1.f  -O2  (test for excess errors)
FAIL: g77.dg/pr3743-1.f  -O3 -fomit-frame-pointer  (test for excess errors)
FAIL: g77.dg/pr3743-1.f  -O3 -g  (test for excess errors)
FAIL: g77.dg/pr3743-1.f  -Os  (test for excess errors)
FAIL: g77.dg/pr3743-2.f  -O0  (test for excess errors)
FAIL: g77.dg/pr3743-2.f  -O1  (test for excess errors)
FAIL: g77.dg/pr3743-2.f  -O2  (test for excess errors)
FAIL: g77.dg/pr3743-2.f  -O3 -fomit-frame-pointer  (test for excess errors)
FAIL: g77.dg/pr3743-2.f  -O3 -g  (test for excess errors)
FAIL: g77.dg/pr3743-2.f  -Os  (test for excess errors)
FAIL: g77.dg/pr3743-3.f  -O0  (test for excess errors)
FAIL: g77.dg/pr3743-3.f  -O1  (test for excess errors)
FAIL: g77.dg/pr3743-3.f  -O2  (test for excess errors)
FAIL: g77.dg/pr3743-3.f  -O3 -fomit-frame-pointer  (test for excess errors)
FAIL: g77.dg/pr3743-3.f  -O3 -g  (test for excess errors)
FAIL: g77.dg/pr3743-3.f  -Os  (test for excess errors)
FAIL: g77.dg/pr3743-4.f  -O0  (test for excess errors)
FAIL: g77.dg/pr3743-4.f  -O1  (test for excess errors)
FAIL: g77.dg/pr3743-4.f  -O2  (test for excess errors)
FAIL: g77.dg/pr3743-4.f  -O3 -fomit-frame-pointer  (test for excess errors)
FAIL: g77.dg/pr3743-4.f  -O3 -g  (test for excess errors)
FAIL: g77.dg/pr3743-4.f  -Os  (test for excess errors)
FAIL: g77.dg/pr5473.f  -O0  incorrect type (test for errors, line 11)
FAIL: g77.dg/pr5473.f  -O0  incorrect type (test for errors, line 12)
FAIL: g77.dg/pr5473.f  -O0  incorrect type (test for errors, line 13)
FAIL: g77.dg/pr5473.f  -O0  incorrect type (test for errors, line 14)
FAIL: g77.dg/pr5473.f  -O0  (test for excess errors)
FAIL: g77.dg/pr5473.f  -O1  incorrect type (test for errors, line 11)
FAIL: g77.dg/pr5473.f  -O1  incorrect type (test for errors, line 12)
FAIL: g77.dg/pr5473.f  -O1  incorrect type (test for errors, line 13)
FAIL: g77.dg/pr5473.f  -O1  incorrect type (test for errors, line 14)
FAIL: g77.dg/pr5473.f  -O1  (test for excess errors)
FAIL: g77.dg/pr5473.f  -O2  incorrect type (test for errors, line 11)
FAIL: g77.dg/pr5473.f  -O2  incorrect type (test for errors, line 12)
FAIL: g77.dg/pr5473.f  -O2  incorrect type (test for errors, line 13)
FAIL: g77.dg/pr5473.f  -O2  incorrect type (test for errors, line 14)
FAIL: g77.dg/pr5473.f  -O2  (test for excess errors)
FAIL: g77.dg/pr5473.f  -O3 -fomit-frame-pointer  incorrect type (test for errors, line 11)
FAIL: g77.dg/pr5473.f  -O3 -fomit-frame-pointer  incorrect type (test for errors, line 12)
FAIL: g77.dg/pr5473.f  -O3 -fomit-frame-pointer  incorrect type (test for errors, line 13)
FAIL: g77.dg/pr5473.f  -O3 -fomit-frame-pointer  incorrect type (test for errors, line 14)
FAIL: g77.dg/pr5473.f  -O3 -fomit-frame-pointer  (test for excess errors)
FAIL: g77.dg/pr5473.f  -O3 -g  incorrect type (test for errors, line 11)
FAIL: g77.dg/pr5473.f  -O3 -g  incorrect type (test for errors, line 12)
FAIL: g77.dg/pr5473.f  -O3 -g  incorrect type (test for errors, line 13)
FAIL: g77.dg/pr5473.f  -O3 -g  incorrect type (test for errors, line 14)
FAIL: g77.dg/pr5473.f  -O3 -g  (test for excess errors)
FAIL: g77.dg/pr5473.f  -Os  incorrect type (test for errors, line 11)
FAIL: g77.dg/pr5473.f  -Os  incorrect type (test for errors, line 12)
FAIL: g77.dg/pr5473.f  -Os  incorrect type (test for errors, line 13)
FAIL: g77.dg/pr5473.f  -Os  incorrect type (test for errors, line 14)
FAIL: g77.dg/pr5473.f  -Os  (test for excess errors)
FAIL: g77.dg/pr9258.f  -O0  (test for excess errors)
FAIL: g77.dg/pr9258.f  -O1  (test for excess errors)
FAIL: g77.dg/pr9258.f  -O2  (test for excess errors)
FAIL: g77.dg/pr9258.f  -O3 -fomit-frame-pointer  (test for excess errors)
FAIL: g77.dg/pr9258.f  -O3 -g  (test for excess errors)
FAIL: g77.dg/pr9258.f  -Os  (test for excess errors)
FAIL: g77.dg/strlen0.f  -O0  (test for excess errors)
WARNING: g77.dg/strlen0.f  -O0  compilation failed to produce executable
FAIL: g77.dg/strlen0.f  -O1  (test for excess errors)
WARNING: g77.dg/strlen0.f  -O1  compilation failed to produce executable
FAIL: g77.dg/strlen0.f  -O2  (test for excess errors)
WARNING: g77.dg/strlen0.f  -O2  compilation failed to produce executable
FAIL: g77.dg/strlen0.f  -O3 -fomit-frame-pointer  (test for excess errors)
WARNING: g77.dg/strlen0.f  -O3 -fomit-frame-pointer  compilation failed to produce executable
FAIL: g77.dg/strlen0.f  -O3 -g  (test for excess errors)
WARNING: g77.dg/strlen0.f  -O3 -g  compilation failed to produce executable
FAIL: g77.dg/strlen0.f  -Os  (test for excess errors)
WARNING: g77.dg/strlen0.f  -Os  compilation failed to produce executable
FAIL: g77.dg/gcov/gcov-1.f (test for excess errors)
WARNING: g77.dg/gcov/gcov-1.f compilation failed to produce executable
FAIL: g77.dg/gcov/gcov-1.f gcov failed: gcov-1.f.gcov does not exist
FAIL: g77.f-torture/compile/19990218-0.f,  -O0  
FAIL: g77.f-torture/compile/19990218-0.f,  -O1  
FAIL: g77.f-torture/compile/19990218-0.f,  -O2  
FAIL: g77.f-torture/compile/19990218-0.f,  -O3 -fomit-frame-pointer  
FAIL: g77.f-torture/compile/19990218-0.f,  -O3 -g  
FAIL: g77.f-torture/compile/19990218-0.f,  -Os  
FAIL: g77.f-torture/compile/19990305-0.f,  -O0  
FAIL: g77.f-torture/compile/19990305-0.f,  -O1  
FAIL: g77.f-torture/compile/19990305-0.f,  -O2  
FAIL: g77.f-torture/compile/19990305-0.f,  -O3 -fomit-frame-pointer  
FAIL: g77.f-torture/compile/19990305-0.f,  -O3 -g  
FAIL: g77.f-torture/compile/19990305-0.f,  -Os  
FAIL: g77.f-torture/compile/19990419-0.f,  -O0  
FAIL: g77.f-torture/compile/19990419-0.f,  -O1  
FAIL: g77.f-torture/compile/19990419-0.f,  -O2  
FAIL: g77.f-torture/compile/19990419-0.f,  -O3 -fomit-frame-pointer  
FAIL: g77.f-torture/compile/19990419-0.f,  -O3 -g  
FAIL: g77.f-torture/compile/19990419-0.f,  -Os  
FAIL: g77.f-torture/compile/19990502-0.f,  -O0  
FAIL: g77.f-torture/compile/19990502-0.f,  -O1  
FAIL: g77.f-torture/compile/19990502-0.f,  -O2  
FAIL: g77.f-torture/compile/19990502-0.f,  -O3 -fomit-frame-pointer  
FAIL: g77.f-torture/compile/19990502-0.f,  -O3 -g  
FAIL: g77.f-torture/compile/19990502-0.f,  -Os  
FAIL: g77.f-torture/compile/19990502-1.f,  -O0  
FAIL: g77.f-torture/compile/19990502-1.f,  -O1  
FAIL: g77.f-torture/compile/19990502-1.f,  -O2  
FAIL: g77.f-torture/compile/19990502-1.f,  -O3 -fomit-frame-pointer  
FAIL: g77.f-torture/compile/19990502-1.f,  -O3 -fomit-frame-pointer -funroll-loops  
FAIL: g77.f-torture/compile/19990502-1.f,  -O3 -fomit-frame-pointer -funroll-all-loops -finline-functions  
FAIL: g77.f-torture/compile/19990502-1.f,  -O3 -g  
FAIL: g77.f-torture/compile/19990502-1.f,  -Os  
FAIL: g77.f-torture/compile/19990525-0.f,  -O0  
FAIL: g77.f-torture/compile/19990525-0.f,  -O1  
FAIL: g77.f-torture/compile/19990525-0.f,  -O2  
FAIL: g77.f-torture/compile/19990525-0.f,  -O3 -fomit-frame-pointer  
FAIL: g77.f-torture/compile/19990525-0.f,  -O3 -g  
FAIL: g77.f-torture/compile/19990525-0.f,  -Os  
FAIL: g77.f-torture/compile/19990826-1.f,  -O0  
FAIL: g77.f-torture/compile/19990826-1.f,  -O1  
FAIL: g77.f-torture/compile/19990826-1.f,  -O2  
FAIL: g77.f-torture/compile/19990826-1.f,  -O3 -fomit-frame-pointer  
FAIL: g77.f-torture/compile/19990826-1.f,  -O3 -g  
FAIL: g77.f-torture/compile/19990826-1.f,  -Os  
FAIL: g77.f-torture/compile/19990826-3.f,  -O0  
FAIL: g77.f-torture/compile/19990826-3.f,  -O1  
FAIL: g77.f-torture/compile/19990826-3.f,  -O2  
FAIL: g77.f-torture/compile/19990826-3.f,  -O3 -fomit-frame-pointer  
FAIL: g77.f-torture/compile/19990826-3.f,  -O3 -fomit-frame-pointer -funroll-loops  
FAIL: g77.f-torture/compile/19990826-3.f,  -O3 -fomit-frame-pointer -funroll-all-loops -finline-functions  
FAIL: g77.f-torture/compile/19990826-3.f,  -O3 -g  
FAIL: g77.f-torture/compile/19990826-3.f,  -Os  
FAIL: g77.f-torture/compile/19990905-0.f,  -O0  
FAIL: g77.f-torture/compile/19990905-0.f,  -O1  
FAIL: g77.f-torture/compile/19990905-0.f,  -O2  
FAIL: g77.f-torture/compile/19990905-0.f,  -O3 -fomit-frame-pointer  
FAIL: g77.f-torture/compile/19990905-0.f,  -O3 -g  
FAIL: g77.f-torture/compile/19990905-0.f,  -Os  
FAIL: g77.f-torture/compile/19990905-2.f,  -O0  
FAIL: g77.f-torture/compile/19990905-2.f,  -O1  
FAIL: g77.f-torture/compile/19990905-2.f,  -O2  
FAIL: g77.f-torture/compile/19990905-2.f,  -O3 -fomit-frame-pointer  
FAIL: g77.f-torture/compile/19990905-2.f,  -O3 -g  
FAIL: g77.f-torture/compile/19990905-2.f,  -Os  
FAIL: g77.f-torture/compile/20000412-1.f,  -O0  
FAIL: g77.f-torture/compile/20000412-1.f,  -O1  
FAIL: g77.f-torture/compile/20000412-1.f,  -O2  
FAIL: g77.f-torture/compile/20000412-1.f,  -O3 -fomit-frame-pointer  
FAIL: g77.f-torture/compile/20000412-1.f,  -O3 -g  
FAIL: g77.f-torture/compile/20000412-1.f,  -Os  
FAIL: g77.f-torture/compile/20000511-1.f,  -O0  
FAIL: g77.f-torture/compile/20000511-1.f,  -O1  
FAIL: g77.f-torture/compile/20000511-1.f,  -O2  
FAIL: g77.f-torture/compile/20000511-1.f,  -O3 -fomit-frame-pointer  
FAIL: g77.f-torture/compile/20000511-1.f,  -O3 -fomit-frame-pointer -funroll-loops  
FAIL: g77.f-torture/compile/20000511-1.f,  -O3 -fomit-frame-pointer -funroll-all-loops -finline-functions  
FAIL: g77.f-torture/compile/20000511-1.f,  -O3 -g  
FAIL: g77.f-torture/compile/20000511-1.f,  -Os  
FAIL: g77.f-torture/compile/20000511-2.f,  -O0  
FAIL: g77.f-torture/compile/20000511-2.f,  -O1  
FAIL: g77.f-torture/compile/20000511-2.f,  -O2  
FAIL: g77.f-torture/compile/20000511-2.f,  -O3 -fomit-frame-pointer  
FAIL: g77.f-torture/compile/20000511-2.f,  -O3 -fomit-frame-pointer -funroll-loops  
FAIL: g77.f-torture/compile/20000511-2.f,  -O3 -fomit-frame-pointer -funroll-all-loops -finline-functions  
FAIL: g77.f-torture/compile/20000511-2.f,  -O3 -g  
FAIL: g77.f-torture/compile/20000511-2.f,  -Os  
FAIL: g77.f-torture/compile/20000518.f,  -O0  
FAIL: g77.f-torture/compile/20000518.f,  -O1  
FAIL: g77.f-torture/compile/20000518.f,  -O2  
FAIL: g77.f-torture/compile/20000518.f,  -O3 -fomit-frame-pointer  
FAIL: g77.f-torture/compile/20000518.f,  -O3 -fomit-frame-pointer -funroll-loops  
FAIL: g77.f-torture/compile/20000518.f,  -O3 -fomit-frame-pointer -funroll-all-loops -finline-functions  
FAIL: g77.f-torture/compile/20000518.f,  -O3 -g  
FAIL: g77.f-torture/compile/20000518.f,  -Os  
FAIL: g77.f-torture/compile/20000601-1.f,  -O0  
FAIL: g77.f-torture/compile/20000601-1.f,  -O1  
FAIL: g77.f-torture/compile/20000601-1.f,  -O2  
FAIL: g77.f-torture/compile/20000601-1.f,  -O3 -fomit-frame-pointer  
FAIL: g77.f-torture/compile/20000601-1.f,  -O3 -fomit-frame-pointer -funroll-loops  
FAIL: g77.f-torture/compile/20000601-1.f,  -O3 -fomit-frame-pointer -funroll-all-loops -finline-functions  
FAIL: g77.f-torture/compile/20000601-1.f,  -O3 -g  
FAIL: g77.f-torture/compile/20000601-1.f,  -Os  
FAIL: g77.f-torture/compile/20000601-2.f,  -O0  
FAIL: g77.f-torture/compile/20000601-2.f,  -O1  
FAIL: g77.f-torture/compile/20000601-2.f,  -O2  
FAIL: g77.f-torture/compile/20000601-2.f,  -O3 -fomit-frame-pointer  
FAIL: g77.f-torture/compile/20000601-2.f,  -O3 -fomit-frame-pointer -funroll-loops  
FAIL: g77.f-torture/compile/20000601-2.f,  -O3 -fomit-frame-pointer -funroll-all-loops -finline-functions  
FAIL: g77.f-torture/compile/20000601-2.f,  -O3 -g  
FAIL: g77.f-torture/compile/20000601-2.f,  -Os  
FAIL: g77.f-torture/compile/20000629-1.f,  -O0  
FAIL: g77.f-torture/compile/20000629-1.f,  -O1  
FAIL: g77.f-torture/compile/20000629-1.f,  -O2  
FAIL: g77.f-torture/compile/20000629-1.f,  -O3 -fomit-frame-pointer  
FAIL: g77.f-torture/compile/20000629-1.f,  -O3 -fomit-frame-pointer -funroll-loops  
FAIL: g77.f-torture/compile/20000629-1.f,  -O3 -fomit-frame-pointer -funroll-all-loops -finline-functions  
FAIL: g77.f-torture/compile/20000629-1.f,  -O3 -g  
FAIL: g77.f-torture/compile/20000629-1.f,  -Os  
FAIL: g77.f-torture/compile/20000630-2.f,  -O0  
FAIL: g77.f-torture/compile/20000630-2.f,  -O1  
FAIL: g77.f-torture/compile/20000630-2.f,  -O2  
FAIL: g77.f-torture/compile/20000630-2.f,  -O3 -fomit-frame-pointer  
FAIL: g77.f-torture/compile/20000630-2.f,  -O3 -g  
FAIL: g77.f-torture/compile/20000630-2.f,  -Os  
FAIL: g77.f-torture/compile/20010115.f,  -O0  
FAIL: g77.f-torture/compile/20010115.f,  -O1  
FAIL: g77.f-torture/compile/20010115.f,  -O2  
FAIL: g77.f-torture/compile/20010115.f,  -O3 -fomit-frame-pointer  
FAIL: g77.f-torture/compile/20010115.f,  -O3 -g  
FAIL: g77.f-torture/compile/20010115.f,  -Os  
FAIL: g77.f-torture/compile/20010321-1.f,  -O0  
FAIL: g77.f-torture/compile/20010321-1.f,  -O1  
FAIL: g77.f-torture/compile/20010321-1.f,  -O2  
FAIL: g77.f-torture/compile/20010321-1.f,  -O3 -fomit-frame-pointer  
FAIL: g77.f-torture/compile/20010321-1.f,  -O3 -g  
FAIL: g77.f-torture/compile/20010321-1.f,  -Os  
FAIL: g77.f-torture/compile/20010426.f,  -O0  
FAIL: g77.f-torture/compile/20010426.f,  -O1  
FAIL: g77.f-torture/compile/20010426.f,  -O2  
FAIL: g77.f-torture/compile/20010426.f,  -O3 -fomit-frame-pointer  
FAIL: g77.f-torture/compile/20010426.f,  -O3 -g  
FAIL: g77.f-torture/compile/20010426.f,  -Os  
FAIL: g77.f-torture/compile/20010519-1.f,  -O0  
FAIL: g77.f-torture/compile/20010519-1.f,  -O1  
FAIL: g77.f-torture/compile/20010519-1.f,  -O2  
FAIL: g77.f-torture/compile/20010519-1.f,  -O3 -fomit-frame-pointer  
FAIL: g77.f-torture/compile/20010519-1.f,  -O3 -fomit-frame-pointer -funroll-loops  
FAIL: g77.f-torture/compile/20010519-1.f,  -O3 -fomit-frame-pointer -funroll-all-loops -finline-functions  
FAIL: g77.f-torture/compile/20010519-1.f,  -O3 -g  
FAIL: g77.f-torture/compile/20010519-1.f,  -Os  
FAIL: g77.f-torture/compile/20020307-1.f,  -O0  
FAIL: g77.f-torture/compile/20020307-1.f,  -O1  
FAIL: g77.f-torture/compile/20020307-1.f,  -O2  
FAIL: g77.f-torture/compile/20020307-1.f,  -O3 -fomit-frame-pointer  
FAIL: g77.f-torture/compile/20020307-1.f,  -O3 -fomit-frame-pointer -funroll-loops  
FAIL: g77.f-torture/compile/20020307-1.f,  -O3 -fomit-frame-pointer -funroll-all-loops -finline-functions  
FAIL: g77.f-torture/compile/20020307-1.f,  -O3 -g  
FAIL: g77.f-torture/compile/20020307-1.f,  -Os  
FAIL: g77.f-torture/compile/960317-1.f,  -O0  
FAIL: g77.f-torture/compile/960317-1.f,  -O1  
FAIL: g77.f-torture/compile/960317-1.f,  -O2  
FAIL: g77.f-torture/compile/960317-1.f,  -O3 -fomit-frame-pointer  
FAIL: g77.f-torture/compile/960317-1.f,  -O3 -g  
FAIL: g77.f-torture/compile/960317-1.f,  -Os  
FAIL: g77.f-torture/compile/970125-0.f,  -O0  
FAIL: g77.f-torture/compile/970125-0.f,  -O1  
FAIL: g77.f-torture/compile/970125-0.f,  -O2  
FAIL: g77.f-torture/compile/970125-0.f,  -O3 -fomit-frame-pointer  
FAIL: g77.f-torture/compile/970125-0.f,  -O3 -g  
FAIL: g77.f-torture/compile/970125-0.f,  -Os  
FAIL: g77.f-torture/compile/970915-0.f,  -O0  
FAIL: g77.f-torture/compile/970915-0.f,  -O1  
FAIL: g77.f-torture/compile/970915-0.f,  -O2  
FAIL: g77.f-torture/compile/970915-0.f,  -O3 -fomit-frame-pointer  
FAIL: g77.f-torture/compile/970915-0.f,  -O3 -g  
FAIL: g77.f-torture/compile/970915-0.f,  -Os  
FAIL: g77.f-torture/compile/980310-1.f,  -O0  
FAIL: g77.f-torture/compile/980310-1.f,  -O1  
FAIL: g77.f-torture/compile/980310-1.f,  -O2  
FAIL: g77.f-torture/compile/980310-1.f,  -O3 -fomit-frame-pointer  
FAIL: g77.f-torture/compile/980310-1.f,  -O3 -g  
FAIL: g77.f-torture/compile/980310-1.f,  -Os  
FAIL: g77.f-torture/compile/980310-2.f,  -O0  
FAIL: g77.f-torture/compile/980310-2.f,  -O1  
FAIL: g77.f-torture/compile/980310-2.f,  -O2  
FAIL: g77.f-torture/compile/980310-2.f,  -O3 -fomit-frame-pointer  
FAIL: g77.f-torture/compile/980310-2.f,  -O3 -g  
FAIL: g77.f-torture/compile/980310-2.f,  -Os  
FAIL: g77.f-torture/compile/980310-3.f,  -O0  
FAIL: g77.f-torture/compile/980310-3.f,  -O1  
FAIL: g77.f-torture/compile/980310-3.f,  -O2  
FAIL: g77.f-torture/compile/980310-3.f,  -O3 -fomit-frame-pointer  
FAIL: g77.f-torture/compile/980310-3.f,  -O3 -fomit-frame-pointer -funroll-loops  
FAIL: g77.f-torture/compile/980310-3.f,  -O3 -fomit-frame-pointer -funroll-all-loops -finline-functions  
FAIL: g77.f-torture/compile/980310-3.f,  -O3 -g  
FAIL: g77.f-torture/compile/980310-3.f,  -Os  
FAIL: g77.f-torture/compile/980310-4.f,  -O0  
FAIL: g77.f-torture/compile/980310-4.f,  -O1  
FAIL: g77.f-torture/compile/980310-4.f,  -O2  
FAIL: g77.f-torture/compile/980310-4.f,  -O3 -fomit-frame-pointer  
FAIL: g77.f-torture/compile/980310-4.f,  -O3 -fomit-frame-pointer -funroll-loops  
FAIL: g77.f-torture/compile/980310-4.f,  -O3 -fomit-frame-pointer -funroll-all-loops -finline-functions  
FAIL: g77.f-torture/compile/980310-4.f,  -O3 -g  
FAIL: g77.f-torture/compile/980310-4.f,  -Os  
FAIL: g77.f-torture/compile/980310-6.f,  -O0  
FAIL: g77.f-torture/compile/980310-6.f,  -O1  
FAIL: g77.f-torture/compile/980310-6.f,  -O2  
FAIL: g77.f-torture/compile/980310-6.f,  -O3 -fomit-frame-pointer  
FAIL: g77.f-torture/compile/980310-6.f,  -O3 -g  
FAIL: g77.f-torture/compile/980310-6.f,  -Os  
FAIL: g77.f-torture/compile/980310-7.f,  -O0  
FAIL: g77.f-torture/compile/980310-7.f,  -O1  
FAIL: g77.f-torture/compile/980310-7.f,  -O2  
FAIL: g77.f-torture/compile/980310-7.f,  -O3 -fomit-frame-pointer  
FAIL: g77.f-torture/compile/980310-7.f,  -O3 -fomit-frame-pointer -funroll-loops  
FAIL: g77.f-torture/compile/980310-7.f,  -O3 -fomit-frame-pointer -funroll-all-loops -finline-functions  
FAIL: g77.f-torture/compile/980310-7.f,  -O3 -g  
FAIL: g77.f-torture/compile/980310-7.f,  -Os  
FAIL: g77.f-torture/compile/980310-8.f,  -O0  
FAIL: g77.f-torture/compile/980310-8.f,  -O1  
FAIL: g77.f-torture/compile/980310-8.f,  -O2  
FAIL: g77.f-torture/compile/980310-8.f,  -O3 -fomit-frame-pointer  
FAIL: g77.f-torture/compile/980310-8.f,  -O3 -fomit-frame-pointer -funroll-loops  
FAIL: g77.f-torture/compile/980310-8.f,  -O3 -fomit-frame-pointer -funroll-all-loops -finline-functions  
FAIL: g77.f-torture/compile/980310-8.f,  -O3 -g  
FAIL: g77.f-torture/compile/980310-8.f,  -Os  
FAIL: g77.f-torture/compile/980419-2.f,  -O0  
FAIL: g77.f-torture/compile/980419-2.f,  -O1  
FAIL: g77.f-torture/compile/980419-2.f,  -O2  
FAIL: g77.f-torture/compile/980419-2.f,  -O3 -fomit-frame-pointer  
FAIL: g77.f-torture/compile/980419-2.f,  -O3 -fomit-frame-pointer -funroll-loops  
FAIL: g77.f-torture/compile/980419-2.f,  -O3 -fomit-frame-pointer -funroll-all-loops -finline-functions  
FAIL: g77.f-torture/compile/980419-2.f,  -O3 -g  
FAIL: g77.f-torture/compile/980419-2.f,  -Os  
FAIL: g77.f-torture/compile/980424-0.f,  -O0  
FAIL: g77.f-torture/compile/980424-0.f,  -O1  
FAIL: g77.f-torture/compile/980424-0.f,  -O2  
FAIL: g77.f-torture/compile/980424-0.f,  -O3 -fomit-frame-pointer  
FAIL: g77.f-torture/compile/980424-0.f,  -O3 -g  
FAIL: g77.f-torture/compile/980424-0.f,  -Os  
FAIL: g77.f-torture/compile/980427-0.f,  -O0  
FAIL: g77.f-torture/compile/980427-0.f,  -O1  
FAIL: g77.f-torture/compile/980427-0.f,  -O2  
FAIL: g77.f-torture/compile/980427-0.f,  -O3 -fomit-frame-pointer  
FAIL: g77.f-torture/compile/980427-0.f,  -O3 -g  
FAIL: g77.f-torture/compile/980427-0.f,  -Os  
FAIL: g77.f-torture/compile/980519-2.f,  -O0  
FAIL: g77.f-torture/compile/980519-2.f,  -O1  
FAIL: g77.f-torture/compile/980519-2.f,  -O2  
FAIL: g77.f-torture/compile/980519-2.f,  -O3 -fomit-frame-pointer  
FAIL: g77.f-torture/compile/980519-2.f,  -O3 -g  
FAIL: g77.f-torture/compile/980519-2.f,  -Os  
FAIL: g77.f-torture/compile/980729-0.f,  -O0  
FAIL: g77.f-torture/compile/980729-0.f,  -O1  
FAIL: g77.f-torture/compile/980729-0.f,  -O2  
FAIL: g77.f-torture/compile/980729-0.f,  -O3 -fomit-frame-pointer  
FAIL: g77.f-torture/compile/980729-0.f,  -O3 -g  
FAIL: g77.f-torture/compile/980729-0.f,  -Os  
FAIL: g77.f-torture/compile/981117-1.f,  -O0  
FAIL: g77.f-torture/compile/981117-1.f,  -O1  
FAIL: g77.f-torture/compile/981117-1.f,  -O2  
FAIL: g77.f-torture/compile/981117-1.f,  -O3 -fomit-frame-pointer  
FAIL: g77.f-torture/compile/981117-1.f,  -O3 -fomit-frame-pointer -funroll-loops  
FAIL: g77.f-torture/compile/981117-1.f,  -O3 -fomit-frame-pointer -funroll-all-loops -finline-functions  
FAIL: g77.f-torture/compile/981117-1.f,  -O3 -g  
FAIL: g77.f-torture/compile/981117-1.f,  -Os  
FAIL: g77.f-torture/compile/990115-1.f,  -O0  
FAIL: g77.f-torture/compile/990115-1.f,  -O1  
FAIL: g77.f-torture/compile/990115-1.f,  -O2  
FAIL: g77.f-torture/compile/990115-1.f,  -O3 -fomit-frame-pointer  
FAIL: g77.f-torture/compile/990115-1.f,  -O3 -fomit-frame-pointer -funroll-loops  
FAIL: g77.f-torture/compile/990115-1.f,  -O3 -fomit-frame-pointer -funroll-all-loops -finline-functions  
FAIL: g77.f-torture/compile/990115-1.f,  -O3 -g  
FAIL: g77.f-torture/compile/990115-1.f,  -Os  
FAIL: g77.f-torture/compile/alpha1.f,  -O0  
FAIL: g77.f-torture/compile/alpha1.f,  -O1  
FAIL: g77.f-torture/compile/alpha1.f,  -O2  
FAIL: g77.f-torture/compile/alpha1.f,  -O3 -fomit-frame-pointer  
FAIL: g77.f-torture/compile/alpha1.f,  -O3 -g  
FAIL: g77.f-torture/compile/alpha1.f,  -Os  
FAIL: g77.f-torture/compile/toon_1.f,  -O0  
FAIL: g77.f-torture/compile/toon_1.f,  -O1  
FAIL: g77.f-torture/compile/toon_1.f,  -O2  
FAIL: g77.f-torture/compile/toon_1.f,  -O3 -fomit-frame-pointer  
FAIL: g77.f-torture/compile/toon_1.f,  -O3 -g  
FAIL: g77.f-torture/compile/toon_1.f,  -Os  
FAIL: g77.f-torture/compile/20030326-1.f,  -O0  
FAIL: g77.f-torture/compile/20030326-1.f,  -O1  
FAIL: g77.f-torture/compile/20030326-1.f,  -O2  
FAIL: g77.f-torture/compile/20030326-1.f,  -O3 -fomit-frame-pointer  
FAIL: g77.f-torture/compile/20030326-1.f,  -O3 -g  
FAIL: g77.f-torture/compile/20030326-1.f,  -Os  
FAIL: g77.f-torture/compile/13060.f,  -O0  
FAIL: g77.f-torture/compile/13060.f,  -O1  
FAIL: g77.f-torture/compile/13060.f,  -O2  
FAIL: g77.f-torture/compile/13060.f,  -O3 -fomit-frame-pointer  
FAIL: g77.f-torture/compile/13060.f,  -O3 -g  
FAIL: g77.f-torture/compile/13060.f,  -Os  
FAIL: g77.f-torture/compile/12002.f,  -O0  
FAIL: g77.f-torture/compile/12002.f,  -O1  
FAIL: g77.f-torture/compile/12002.f,  -O2  
FAIL: g77.f-torture/compile/12002.f,  -O3 -fomit-frame-pointer  
FAIL: g77.f-torture/compile/12002.f,  -O3 -g  
FAIL: g77.f-torture/compile/12002.f,  -Os  
FAIL: g77.f-torture/compile/8485.f,  -O0  
FAIL: g77.f-torture/compile/8485.f,  -O1  
FAIL: g77.f-torture/compile/8485.f,  -O2  
FAIL: g77.f-torture/compile/8485.f,  -O3 -fomit-frame-pointer  
FAIL: g77.f-torture/compile/8485.f,  -O3 -g  
FAIL: g77.f-torture/compile/8485.f,  -Os  
FAIL: g77.f-torture/compile/xformat.f,  -O0  
FAIL: g77.f-torture/compile/xformat.f,  -O1  
FAIL: g77.f-torture/compile/xformat.f,  -O2  
FAIL: g77.f-torture/compile/xformat.f,  -O3 -fomit-frame-pointer  
FAIL: g77.f-torture/compile/xformat.f,  -O3 -g  
FAIL: g77.f-torture/compile/xformat.f,  -Os  
FAIL: g77.f-torture/compile/cpp.F,  -O0  
FAIL: g77.f-torture/compile/cpp.F,  -O1  
FAIL: g77.f-torture/compile/cpp.F,  -O2  
FAIL: g77.f-torture/compile/cpp.F,  -O3 -fomit-frame-pointer  
FAIL: g77.f-torture/compile/cpp.F,  -O3 -fomit-frame-pointer -funroll-loops  
FAIL: g77.f-torture/compile/cpp.F,  -O3 -fomit-frame-pointer -funroll-all-loops -finline-functions  
FAIL: g77.f-torture/compile/cpp.F,  -O3 -g  
FAIL: g77.f-torture/compile/cpp.F,  -Os  
FAIL: g77.f-torture/compile/cpp2.F,  -O0  
FAIL: g77.f-torture/compile/cpp2.F,  -O1  
FAIL: g77.f-torture/compile/cpp2.F,  -O2  
FAIL: g77.f-torture/compile/cpp2.F,  -O3 -fomit-frame-pointer  
FAIL: g77.f-torture/compile/cpp2.F,  -O3 -g  
FAIL: g77.f-torture/compile/cpp2.F,  -Os  
FAIL: g77.f-torture/execute/10197.f compilation,  -O0 
FAIL: g77.f-torture/execute/10197.f compilation,  -O1 
FAIL: g77.f-torture/execute/10197.f compilation,  -O2 
FAIL: g77.f-torture/execute/10197.f compilation,  -O3 -fomit-frame-pointer 
FAIL: g77.f-torture/execute/10197.f compilation,  -O3 -g 
FAIL: g77.f-torture/execute/10197.f compilation,  -Os 
FAIL: g77.f-torture/execute/12884.f compilation,  -O0 
FAIL: g77.f-torture/execute/12884.f compilation,  -O1 
FAIL: g77.f-torture/execute/12884.f compilation,  -O2 
FAIL: g77.f-torture/execute/12884.f compilation,  -O3 -fomit-frame-pointer 
FAIL: g77.f-torture/execute/12884.f compilation,  -O3 -g 
FAIL: g77.f-torture/execute/12884.f compilation,  -Os 
FAIL: g77.f-torture/execute/13037.f compilation,  -O0 
FAIL: g77.f-torture/execute/13037.f compilation,  -O1 
FAIL: g77.f-torture/execute/13037.f compilation,  -O2 
FAIL: g77.f-torture/execute/13037.f compilation,  -O3 -fomit-frame-pointer 
FAIL: g77.f-torture/execute/13037.f compilation,  -O3 -fomit-frame-pointer -funroll-loops 
FAIL: g77.f-torture/execute/13037.f compilation,  -O3 -fomit-frame-pointer -funroll-all-loops -finline-functions 
FAIL: g77.f-torture/execute/13037.f compilation,  -O3 -g 
FAIL: g77.f-torture/execute/13037.f compilation,  -Os 
FAIL: g77.f-torture/execute/1832.f compilation,  -O0 
FAIL: g77.f-torture/execute/1832.f compilation,  -O1 
FAIL: g77.f-torture/execute/1832.f compilation,  -O2 
FAIL: g77.f-torture/execute/1832.f compilation,  -O3 -fomit-frame-pointer 
FAIL: g77.f-torture/execute/1832.f compilation,  -O3 -g 
FAIL: g77.f-torture/execute/1832.f compilation,  -Os 
FAIL: g77.f-torture/execute/19981119-0.f compilation,  -O0 
FAIL: g77.f-torture/execute/19981119-0.f compilation,  -O1 
FAIL: g77.f-torture/execute/19981119-0.f compilation,  -O2 
FAIL: g77.f-torture/execute/19981119-0.f compilation,  -O3 -fomit-frame-pointer 
FAIL: g77.f-torture/execute/19981119-0.f compilation,  -O3 -g 
FAIL: g77.f-torture/execute/19981119-0.f compilation,  -Os 
FAIL: g77.f-torture/execute/19990313-0.f compilation,  -O0 
FAIL: g77.f-torture/execute/19990313-0.f compilation,  -O1 
FAIL: g77.f-torture/execute/19990313-0.f compilation,  -O2 
FAIL: g77.f-torture/execute/19990313-0.f compilation,  -O3 -fomit-frame-pointer 
FAIL: g77.f-torture/execute/19990313-0.f compilation,  -O3 -g 
FAIL: g77.f-torture/execute/19990313-0.f compilation,  -Os 
FAIL: g77.f-torture/execute/19990313-1.f compilation,  -O0 
FAIL: g77.f-torture/execute/19990313-1.f compilation,  -O1 
FAIL: g77.f-torture/execute/19990313-1.f compilation,  -O2 
FAIL: g77.f-torture/execute/19990313-1.f compilation,  -O3 -fomit-frame-pointer 
FAIL: g77.f-torture/execute/19990313-1.f compilation,  -O3 -g 
FAIL: g77.f-torture/execute/19990313-1.f compilation,  -Os 
FAIL: g77.f-torture/execute/19990313-2.f compilation,  -O0 
FAIL: g77.f-torture/execute/19990313-2.f compilation,  -O1 
FAIL: g77.f-torture/execute/19990313-2.f compilation,  -O2 
FAIL: g77.f-torture/execute/19990313-2.f compilation,  -O3 -fomit-frame-pointer 
FAIL: g77.f-torture/execute/19990313-2.f compilation,  -O3 -g 
FAIL: g77.f-torture/execute/19990313-2.f compilation,  -Os 
FAIL: g77.f-torture/execute/19990313-3.f compilation,  -O0 
FAIL: g77.f-torture/execute/19990313-3.f compilation,  -O1 
FAIL: g77.f-torture/execute/19990313-3.f compilation,  -O2 
FAIL: g77.f-torture/execute/19990313-3.f compilation,  -O3 -fomit-frame-pointer 
FAIL: g77.f-torture/execute/19990313-3.f compilation,  -O3 -g 
FAIL: g77.f-torture/execute/19990313-3.f compilation,  -Os 
FAIL: g77.f-torture/execute/19990325-0.f compilation,  -O0 
FAIL: g77.f-torture/execute/19990325-0.f compilation,  -O1 
FAIL: g77.f-torture/execute/19990325-0.f compilation,  -O2 
FAIL: g77.f-torture/execute/19990325-0.f compilation,  -O3 -fomit-frame-pointer 
FAIL: g77.f-torture/execute/19990325-0.f compilation,  -O3 -g 
FAIL: g77.f-torture/execute/19990325-0.f compilation,  -Os 
FAIL: g77.f-torture/execute/19990325-1.f compilation,  -O0 
FAIL: g77.f-torture/execute/19990325-1.f compilation,  -O1 
FAIL: g77.f-torture/execute/19990325-1.f compilation,  -O2 
FAIL: g77.f-torture/execute/19990325-1.f compilation,  -O3 -fomit-frame-pointer 
FAIL: g77.f-torture/execute/19990325-1.f compilation,  -O3 -g 
FAIL: g77.f-torture/execute/19990325-1.f compilation,  -Os 
FAIL: g77.f-torture/execute/19990419-1.f compilation,  -O0 
FAIL: g77.f-torture/execute/19990419-1.f compilation,  -O1 
FAIL: g77.f-torture/execute/19990419-1.f compilation,  -O2 
FAIL: g77.f-torture/execute/19990419-1.f compilation,  -O3 -fomit-frame-pointer 
FAIL: g77.f-torture/execute/19990419-1.f compilation,  -O3 -fomit-frame-pointer -funroll-loops 
FAIL: g77.f-torture/execute/19990419-1.f compilation,  -O3 -fomit-frame-pointer -funroll-all-loops -finline-functions 
FAIL: g77.f-torture/execute/19990419-1.f compilation,  -O3 -g 
FAIL: g77.f-torture/execute/19990419-1.f compilation,  -Os 
FAIL: g77.f-torture/execute/19990826-0.f compilation,  -O0 
FAIL: g77.f-torture/execute/19990826-0.f compilation,  -O1 
FAIL: g77.f-torture/execute/19990826-0.f compilation,  -O2 
FAIL: g77.f-torture/execute/19990826-0.f compilation,  -O3 -fomit-frame-pointer 
FAIL: g77.f-torture/execute/19990826-0.f compilation,  -O3 -g 
FAIL: g77.f-torture/execute/19990826-0.f compilation,  -Os 
FAIL: g77.f-torture/execute/19990826-2.f compilation,  -O0 
FAIL: g77.f-torture/execute/19990826-2.f compilation,  -O1 
FAIL: g77.f-torture/execute/19990826-2.f compilation,  -O2 
FAIL: g77.f-torture/execute/19990826-2.f compilation,  -O3 -fomit-frame-pointer 
FAIL: g77.f-torture/execute/19990826-2.f compilation,  -O3 -g 
FAIL: g77.f-torture/execute/19990826-2.f compilation,  -Os 
FAIL: g77.f-torture/execute/20000503-1.f compilation,  -O0 
FAIL: g77.f-torture/execute/20000503-1.f compilation,  -O1 
FAIL: g77.f-torture/execute/20000503-1.f compilation,  -O2 
FAIL: g77.f-torture/execute/20000503-1.f compilation,  -O3 -fomit-frame-pointer 
FAIL: g77.f-torture/execute/20000503-1.f compilation,  -O3 -fomit-frame-pointer -funroll-loops 
FAIL: g77.f-torture/execute/20000503-1.f compilation,  -O3 -fomit-frame-pointer -funroll-all-loops -finline-functions 
FAIL: g77.f-torture/execute/20000503-1.f compilation,  -O3 -g 
FAIL: g77.f-torture/execute/20000503-1.f compilation,  -Os 
FAIL: g77.f-torture/execute/20001111.f compilation,  -O0 
FAIL: g77.f-torture/execute/20001111.f compilation,  -O1 
FAIL: g77.f-torture/execute/20001111.f compilation,  -O2 
FAIL: g77.f-torture/execute/20001111.f compilation,  -O3 -fomit-frame-pointer 
FAIL: g77.f-torture/execute/20001111.f compilation,  -O3 -fomit-frame-pointer -funroll-loops 
FAIL: g77.f-torture/execute/20001111.f compilation,  -O3 -fomit-frame-pointer -funroll-all-loops -finline-functions 
FAIL: g77.f-torture/execute/20001111.f compilation,  -O3 -g 
FAIL: g77.f-torture/execute/20001111.f compilation,  -Os 
FAIL: g77.f-torture/execute/20001201.f compilation,  -O0 
FAIL: g77.f-torture/execute/20001201.f compilation,  -O1 
FAIL: g77.f-torture/execute/20001201.f compilation,  -O2 
FAIL: g77.f-torture/execute/20001201.f compilation,  -O3 -fomit-frame-pointer 
FAIL: g77.f-torture/execute/20001201.f compilation,  -O3 -g 
FAIL: g77.f-torture/execute/20001201.f compilation,  -Os 
FAIL: g77.f-torture/execute/20010116.f compilation,  -O0 
FAIL: g77.f-torture/execute/20010116.f compilation,  -O1 
FAIL: g77.f-torture/execute/20010116.f compilation,  -O2 
FAIL: g77.f-torture/execute/20010116.f compilation,  -O3 -fomit-frame-pointer 
FAIL: g77.f-torture/execute/20010116.f compilation,  -O3 -fomit-frame-pointer -funroll-loops 
FAIL: g77.f-torture/execute/20010116.f compilation,  -O3 -fomit-frame-pointer -funroll-all-loops -finline-functions 
FAIL: g77.f-torture/execute/20010116.f compilation,  -O3 -g 
FAIL: g77.f-torture/execute/20010116.f compilation,  -Os 
FAIL: g77.f-torture/execute/20010426.f compilation,  -O0 
FAIL: g77.f-torture/execute/20010426.f compilation,  -O1 
FAIL: g77.f-torture/execute/20010426.f compilation,  -O2 
FAIL: g77.f-torture/execute/20010426.f compilation,  -O3 -fomit-frame-pointer 
FAIL: g77.f-torture/execute/20010426.f compilation,  -O3 -g 
FAIL: g77.f-torture/execute/20010426.f compilation,  -Os 
FAIL: g77.f-torture/execute/20010430.f compilation,  -O0 
FAIL: g77.f-torture/execute/20010430.f compilation,  -O1 
FAIL: g77.f-torture/execute/20010430.f compilation,  -O2 
FAIL: g77.f-torture/execute/20010430.f compilation,  -O3 -fomit-frame-pointer 
FAIL: g77.f-torture/execute/20010430.f compilation,  -O3 -fomit-frame-pointer -funroll-loops 
FAIL: g77.f-torture/execute/20010430.f compilation,  -O3 -fomit-frame-pointer -funroll-all-loops -finline-functions 
FAIL: g77.f-torture/execute/20010430.f compilation,  -O3 -g 
FAIL: g77.f-torture/execute/20010430.f compilation,  -Os 
FAIL: g77.f-torture/execute/20010610.f compilation,  -O0 
FAIL: g77.f-torture/execute/20010610.f compilation,  -O1 
FAIL: g77.f-torture/execute/20010610.f compilation,  -O2 
FAIL: g77.f-torture/execute/20010610.f compilation,  -O3 -fomit-frame-pointer 
FAIL: g77.f-torture/execute/20010610.f compilation,  -O3 -fomit-frame-pointer -funroll-loops 
FAIL: g77.f-torture/execute/20010610.f compilation,  -O3 -fomit-frame-pointer -funroll-all-loops -finline-functions 
FAIL: g77.f-torture/execute/20010610.f compilation,  -O3 -g 
FAIL: g77.f-torture/execute/20010610.f compilation,  -Os 
FAIL: g77.f-torture/execute/5122.f compilation,  -O0 
FAIL: g77.f-torture/execute/5122.f compilation,  -O1 
FAIL: g77.f-torture/execute/5122.f compilation,  -O2 
FAIL: g77.f-torture/execute/5122.f compilation,  -O3 -fomit-frame-pointer 
FAIL: g77.f-torture/execute/5122.f compilation,  -O3 -g 
FAIL: g77.f-torture/execute/5122.f compilation,  -Os 
FAIL: g77.f-torture/execute/6177.f compilation,  -O0 
FAIL: g77.f-torture/execute/6177.f compilation,  -O1 
FAIL: g77.f-torture/execute/6177.f compilation,  -O2 
FAIL: g77.f-torture/execute/6177.f compilation,  -O3 -fomit-frame-pointer 
FAIL: g77.f-torture/execute/6177.f compilation,  -O3 -g 
FAIL: g77.f-torture/execute/6177.f compilation,  -Os 
FAIL: g77.f-torture/execute/6367.f compilation,  -O0 
FAIL: g77.f-torture/execute/6367.f compilation,  -O1 
FAIL: g77.f-torture/execute/6367.f compilation,  -O2 
FAIL: g77.f-torture/execute/6367.f compilation,  -O3 -fomit-frame-pointer 
FAIL: g77.f-torture/execute/6367.f compilation,  -O3 -fomit-frame-pointer -funroll-loops 
FAIL: g77.f-torture/execute/6367.f compilation,  -O3 -fomit-frame-pointer -funroll-all-loops -finline-functions 
FAIL: g77.f-torture/execute/6367.f compilation,  -O3 -g 
FAIL: g77.f-torture/execute/6367.f compilation,  -Os 
FAIL: g77.f-torture/execute/947.f compilation,  -O0 
FAIL: g77.f-torture/execute/947.f compilation,  -O1 
FAIL: g77.f-torture/execute/947.f compilation,  -O2 
FAIL: g77.f-torture/execute/947.f compilation,  -O3 -fomit-frame-pointer 
FAIL: g77.f-torture/execute/947.f compilation,  -O3 -g 
FAIL: g77.f-torture/execute/947.f compilation,  -Os 
FAIL: g77.f-torture/execute/970625-2.f compilation,  -O0 
FAIL: g77.f-torture/execute/970625-2.f compilation,  -O1 
FAIL: g77.f-torture/execute/970625-2.f compilation,  -O2 
FAIL: g77.f-torture/execute/970625-2.f compilation,  -O3 -fomit-frame-pointer 
FAIL: g77.f-torture/execute/970625-2.f compilation,  -O3 -fomit-frame-pointer -funroll-loops 
FAIL: g77.f-torture/execute/970625-2.f compilation,  -O3 -fomit-frame-pointer -funroll-all-loops -finline-functions 
FAIL: g77.f-torture/execute/970625-2.f compilation,  -O3 -g 
FAIL: g77.f-torture/execute/970625-2.f compilation,  -Os 
FAIL: g77.f-torture/execute/970816-3.f compilation,  -O0 
FAIL: g77.f-torture/execute/970816-3.f compilation,  -O1 
FAIL: g77.f-torture/execute/970816-3.f compilation,  -O2 
FAIL: g77.f-torture/execute/970816-3.f compilation,  -O3 -fomit-frame-pointer 
FAIL: g77.f-torture/execute/970816-3.f compilation,  -O3 -g 
FAIL: g77.f-torture/execute/970816-3.f compilation,  -Os 
FAIL: g77.f-torture/execute/971102-1.f compilation,  -O0 
FAIL: g77.f-torture/execute/971102-1.f compilation,  -O1 
FAIL: g77.f-torture/execute/971102-1.f compilation,  -O2 
FAIL: g77.f-torture/execute/971102-1.f compilation,  -O3 -fomit-frame-pointer 
FAIL: g77.f-torture/execute/971102-1.f compilation,  -O3 -fomit-frame-pointer -funroll-loops 
FAIL: g77.f-torture/execute/971102-1.f compilation,  -O3 -fomit-frame-pointer -funroll-all-loops -finline-functions 
FAIL: g77.f-torture/execute/971102-1.f compilation,  -O3 -g 
FAIL: g77.f-torture/execute/971102-1.f compilation,  -Os 
FAIL: g77.f-torture/execute/980520-1.f compilation,  -O0 
FAIL: g77.f-torture/execute/980520-1.f compilation,  -O1 
FAIL: g77.f-torture/execute/980520-1.f compilation,  -O2 
FAIL: g77.f-torture/execute/980520-1.f compilation,  -O3 -fomit-frame-pointer 
FAIL: g77.f-torture/execute/980520-1.f compilation,  -O3 -g 
FAIL: g77.f-torture/execute/980520-1.f compilation,  -Os 
FAIL: g77.f-torture/execute/980628-0.f compilation,  -O0 
FAIL: g77.f-torture/execute/980628-0.f compilation,  -O1 
FAIL: g77.f-torture/execute/980628-0.f compilation,  -O2 
FAIL: g77.f-torture/execute/980628-0.f compilation,  -O3 -fomit-frame-pointer 
FAIL: g77.f-torture/execute/980628-0.f compilation,  -O3 -g 
FAIL: g77.f-torture/execute/980628-0.f compilation,  -Os 
FAIL: g77.f-torture/execute/980628-1.f compilation,  -O0 
FAIL: g77.f-torture/execute/980628-1.f compilation,  -O1 
FAIL: g77.f-torture/execute/980628-1.f compilation,  -O2 
FAIL: g77.f-torture/execute/980628-1.f compilation,  -O3 -fomit-frame-pointer 
FAIL: g77.f-torture/execute/980628-1.f compilation,  -O3 -g 
FAIL: g77.f-torture/execute/980628-1.f compilation,  -Os 
FAIL: g77.f-torture/execute/980628-10.f compilation,  -O0 
FAIL: g77.f-torture/execute/980628-10.f compilation,  -O1 
FAIL: g77.f-torture/execute/980628-10.f compilation,  -O2 
FAIL: g77.f-torture/execute/980628-10.f compilation,  -O3 -fomit-frame-pointer 
FAIL: g77.f-torture/execute/980628-10.f compilation,  -O3 -g 
FAIL: g77.f-torture/execute/980628-10.f compilation,  -Os 
FAIL: g77.f-torture/execute/980628-2.f compilation,  -O0 
FAIL: g77.f-torture/execute/980628-2.f compilation,  -O1 
FAIL: g77.f-torture/execute/980628-2.f compilation,  -O2 
FAIL: g77.f-torture/execute/980628-2.f compilation,  -O3 -fomit-frame-pointer 
FAIL: g77.f-torture/execute/980628-2.f compilation,  -O3 -g 
FAIL: g77.f-torture/execute/980628-2.f compilation,  -Os 
FAIL: g77.f-torture/execute/980628-3.f compilation,  -O0 
FAIL: g77.f-torture/execute/980628-3.f compilation,  -O1 
FAIL: g77.f-torture/execute/980628-3.f compilation,  -O2 
FAIL: g77.f-torture/execute/980628-3.f compilation,  -O3 -fomit-frame-pointer 
FAIL: g77.f-torture/execute/980628-3.f compilation,  -O3 -g 
FAIL: g77.f-torture/execute/980628-3.f compilation,  -Os 
FAIL: g77.f-torture/execute/980628-4.f compilation,  -O0 
FAIL: g77.f-torture/execute/980628-4.f compilation,  -O1 
FAIL: g77.f-torture/execute/980628-4.f compilation,  -O2 
FAIL: g77.f-torture/execute/980628-4.f compilation,  -O3 -fomit-frame-pointer 
FAIL: g77.f-torture/execute/980628-4.f compilation,  -O3 -g 
FAIL: g77.f-torture/execute/980628-4.f compilation,  -Os 
FAIL: g77.f-torture/execute/980628-5.f compilation,  -O0 
FAIL: g77.f-torture/execute/980628-5.f compilation,  -O1 
FAIL: g77.f-torture/execute/980628-5.f compilation,  -O2 
FAIL: g77.f-torture/execute/980628-5.f compilation,  -O3 -fomit-frame-pointer 
FAIL: g77.f-torture/execute/980628-5.f compilation,  -O3 -g 
FAIL: g77.f-torture/execute/980628-5.f compilation,  -Os 
FAIL: g77.f-torture/execute/980628-6.f compilation,  -O0 
FAIL: g77.f-torture/execute/980628-6.f compilation,  -O1 
FAIL: g77.f-torture/execute/980628-6.f compilation,  -O2 
FAIL: g77.f-torture/execute/980628-6.f compilation,  -O3 -fomit-frame-pointer 
FAIL: g77.f-torture/execute/980628-6.f compilation,  -O3 -g 
FAIL: g77.f-torture/execute/980628-6.f compilation,  -Os 
FAIL: g77.f-torture/execute/980628-7.f compilation,  -O0 
FAIL: g77.f-torture/execute/980628-7.f compilation,  -O1 
FAIL: g77.f-torture/execute/980628-7.f compilation,  -O2 
FAIL: g77.f-torture/execute/980628-7.f compilation,  -O3 -fomit-frame-pointer 
FAIL: g77.f-torture/execute/980628-7.f compilation,  -O3 -g 
FAIL: g77.f-torture/execute/980628-7.f compilation,  -Os 
FAIL: g77.f-torture/execute/980628-8.f compilation,  -O0 
FAIL: g77.f-torture/execute/980628-8.f compilation,  -O1 
FAIL: g77.f-torture/execute/980628-8.f compilation,  -O2 
FAIL: g77.f-torture/execute/980628-8.f compilation,  -O3 -fomit-frame-pointer 
FAIL: g77.f-torture/execute/980628-8.f compilation,  -O3 -g 
FAIL: g77.f-torture/execute/980628-8.f compilation,  -Os 
FAIL: g77.f-torture/execute/980628-9.f compilation,  -O0 
FAIL: g77.f-torture/execute/980628-9.f compilation,  -O1 
FAIL: g77.f-torture/execute/980628-9.f compilation,  -O2 
FAIL: g77.f-torture/execute/980628-9.f compilation,  -O3 -fomit-frame-pointer 
FAIL: g77.f-torture/execute/980628-9.f compilation,  -O3 -g 
FAIL: g77.f-torture/execute/980628-9.f compilation,  -Os 
FAIL: g77.f-torture/execute/980701-0.f compilation,  -O0 
FAIL: g77.f-torture/execute/980701-0.f compilation,  -O1 
FAIL: g77.f-torture/execute/980701-0.f compilation,  -O2 
FAIL: g77.f-torture/execute/980701-0.f compilation,  -O3 -fomit-frame-pointer 
FAIL: g77.f-torture/execute/980701-0.f compilation,  -O3 -g 
FAIL: g77.f-torture/execute/980701-0.f compilation,  -Os 
FAIL: g77.f-torture/execute/980701-1.f compilation,  -O0 
FAIL: g77.f-torture/execute/980701-1.f compilation,  -O1 
FAIL: g77.f-torture/execute/980701-1.f compilation,  -O2 
FAIL: g77.f-torture/execute/980701-1.f compilation,  -O3 -fomit-frame-pointer 
FAIL: g77.f-torture/execute/980701-1.f compilation,  -O3 -g 
FAIL: g77.f-torture/execute/980701-1.f compilation,  -Os 
FAIL: g77.f-torture/execute/alpha2.f compilation,  -O0 
FAIL: g77.f-torture/execute/alpha2.f compilation,  -O1 
FAIL: g77.f-torture/execute/alpha2.f compilation,  -O2 
FAIL: g77.f-torture/execute/alpha2.f compilation,  -O3 -fomit-frame-pointer 
FAIL: g77.f-torture/execute/alpha2.f compilation,  -O3 -g 
FAIL: g77.f-torture/execute/alpha2.f compilation,  -Os 
FAIL: g77.f-torture/execute/auto0.f compilation,  -O0 
FAIL: g77.f-torture/execute/auto0.f compilation,  -O1 
FAIL: g77.f-torture/execute/auto0.f compilation,  -O2 
FAIL: g77.f-torture/execute/auto0.f compilation,  -O3 -fomit-frame-pointer 
FAIL: g77.f-torture/execute/auto0.f compilation,  -O3 -fomit-frame-pointer -funroll-loops 
FAIL: g77.f-torture/execute/auto0.f compilation,  -O3 -fomit-frame-pointer -funroll-all-loops -finline-functions 
FAIL: g77.f-torture/execute/auto0.f compilation,  -O3 -g 
FAIL: g77.f-torture/execute/auto0.f compilation,  -Os 
FAIL: g77.f-torture/execute/auto1.f compilation,  -O0 
FAIL: g77.f-torture/execute/auto1.f compilation,  -O1 
FAIL: g77.f-torture/execute/auto1.f compilation,  -O2 
FAIL: g77.f-torture/execute/auto1.f compilation,  -O3 -fomit-frame-pointer 
FAIL: g77.f-torture/execute/auto1.f compilation,  -O3 -fomit-frame-pointer -funroll-loops 
FAIL: g77.f-torture/execute/auto1.f compilation,  -O3 -fomit-frame-pointer -funroll-all-loops -finline-functions 
FAIL: g77.f-torture/execute/auto1.f compilation,  -O3 -g 
FAIL: g77.f-torture/execute/auto1.f compilation,  -Os 
FAIL: g77.f-torture/execute/cabs.f compilation,  -O0 
FAIL: g77.f-torture/execute/cabs.f compilation,  -O1 
FAIL: g77.f-torture/execute/cabs.f compilation,  -O2 
FAIL: g77.f-torture/execute/cabs.f compilation,  -O3 -fomit-frame-pointer 
FAIL: g77.f-torture/execute/cabs.f compilation,  -O3 -g 
FAIL: g77.f-torture/execute/cabs.f compilation,  -Os 
FAIL: g77.f-torture/execute/claus.f compilation,  -O0 
FAIL: g77.f-torture/execute/claus.f compilation,  -O1 
FAIL: g77.f-torture/execute/claus.f compilation,  -O2 
FAIL: g77.f-torture/execute/claus.f compilation,  -O3 -fomit-frame-pointer 
FAIL: g77.f-torture/execute/claus.f compilation,  -O3 -fomit-frame-pointer -funroll-loops 
FAIL: g77.f-torture/execute/claus.f compilation,  -O3 -fomit-frame-pointer -funroll-all-loops -finline-functions 
FAIL: g77.f-torture/execute/claus.f compilation,  -O3 -g 
FAIL: g77.f-torture/execute/claus.f compilation,  -Os 
FAIL: g77.f-torture/execute/complex_1.f compilation,  -O0 
FAIL: g77.f-torture/execute/complex_1.f compilation,  -O1 
FAIL: g77.f-torture/execute/complex_1.f compilation,  -O2 
FAIL: g77.f-torture/execute/complex_1.f compilation,  -O3 -fomit-frame-pointer 
FAIL: g77.f-torture/execute/complex_1.f compilation,  -O3 -g 
FAIL: g77.f-torture/execute/complex_1.f compilation,  -Os 
FAIL: g77.f-torture/execute/dcomplex.f compilation,  -O0 
FAIL: g77.f-torture/execute/dcomplex.f compilation,  -O1 
FAIL: g77.f-torture/execute/dcomplex.f compilation,  -O2 
FAIL: g77.f-torture/execute/dcomplex.f compilation,  -O3 -fomit-frame-pointer 
FAIL: g77.f-torture/execute/dcomplex.f compilation,  -O3 -g 
FAIL: g77.f-torture/execute/dcomplex.f compilation,  -Os 
FAIL: g77.f-torture/execute/dnrm2.f compilation,  -O0 
FAIL: g77.f-torture/execute/dnrm2.f compilation,  -O1 
FAIL: g77.f-torture/execute/dnrm2.f compilation,  -O2 
FAIL: g77.f-torture/execute/dnrm2.f compilation,  -O3 -fomit-frame-pointer 
FAIL: g77.f-torture/execute/dnrm2.f compilation,  -O3 -fomit-frame-pointer -funroll-loops 
FAIL: g77.f-torture/execute/dnrm2.f compilation,  -O3 -fomit-frame-pointer -funroll-all-loops -finline-functions 
FAIL: g77.f-torture/execute/dnrm2.f compilation,  -O3 -g 
FAIL: g77.f-torture/execute/dnrm2.f compilation,  -Os 
FAIL: g77.f-torture/execute/erfc.f compilation,  -O0 
FAIL: g77.f-torture/execute/erfc.f compilation,  -O1 
FAIL: g77.f-torture/execute/erfc.f compilation,  -O2 
FAIL: g77.f-torture/execute/erfc.f compilation,  -O3 -fomit-frame-pointer 
FAIL: g77.f-torture/execute/erfc.f compilation,  -O3 -g 
FAIL: g77.f-torture/execute/erfc.f compilation,  -Os 
FAIL: g77.f-torture/execute/exp.f compilation,  -O0 
FAIL: g77.f-torture/execute/exp.f compilation,  -O1 
FAIL: g77.f-torture/execute/exp.f compilation,  -O2 
FAIL: g77.f-torture/execute/exp.f compilation,  -O3 -fomit-frame-pointer 
FAIL: g77.f-torture/execute/exp.f compilation,  -O3 -g 
FAIL: g77.f-torture/execute/exp.f compilation,  -Os 
FAIL: g77.f-torture/execute/f90-intrinsic-bit.f compilation,  -O0 
FAIL: g77.f-torture/execute/f90-intrinsic-bit.f compilation,  -O1 
FAIL: g77.f-torture/execute/f90-intrinsic-bit.f compilation,  -O2 
FAIL: g77.f-torture/execute/f90-intrinsic-bit.f compilation,  -O3 -fomit-frame-pointer 
FAIL: g77.f-torture/execute/f90-intrinsic-bit.f compilation,  -O3 -fomit-frame-pointer -funroll-loops 
FAIL: g77.f-torture/execute/f90-intrinsic-bit.f compilation,  -O3 -fomit-frame-pointer -funroll-all-loops -finline-functions 
FAIL: g77.f-torture/execute/f90-intrinsic-bit.f compilation,  -O3 -g 
FAIL: g77.f-torture/execute/f90-intrinsic-bit.f compilation,  -Os 
FAIL: g77.f-torture/execute/f90-intrinsic-mathematical.f compilation,  -O0 
FAIL: g77.f-torture/execute/f90-intrinsic-mathematical.f compilation,  -O1 
FAIL: g77.f-torture/execute/f90-intrinsic-mathematical.f compilation,  -O2 
FAIL: g77.f-torture/execute/f90-intrinsic-mathematical.f compilation,  -O3 -fomit-frame-pointer 
FAIL: g77.f-torture/execute/f90-intrinsic-mathematical.f compilation,  -O3 -g 
FAIL: g77.f-torture/execute/f90-intrinsic-mathematical.f compilation,  -Os 
FAIL: g77.f-torture/execute/f90-intrinsic-numeric.f compilation,  -O0 
FAIL: g77.f-torture/execute/f90-intrinsic-numeric.f compilation,  -O1 
FAIL: g77.f-torture/execute/f90-intrinsic-numeric.f compilation,  -O2 
FAIL: g77.f-torture/execute/f90-intrinsic-numeric.f compilation,  -O3 -fomit-frame-pointer 
FAIL: g77.f-torture/execute/f90-intrinsic-numeric.f compilation,  -O3 -g 
FAIL: g77.f-torture/execute/f90-intrinsic-numeric.f compilation,  -Os 
FAIL: g77.f-torture/execute/int8421.f compilation,  -O0 
FAIL: g77.f-torture/execute/int8421.f compilation,  -O1 
FAIL: g77.f-torture/execute/int8421.f compilation,  -O2 
FAIL: g77.f-torture/execute/int8421.f compilation,  -O3 -fomit-frame-pointer 
FAIL: g77.f-torture/execute/int8421.f compilation,  -O3 -g 
FAIL: g77.f-torture/execute/int8421.f compilation,  -Os 
FAIL: g77.f-torture/execute/intrinsic-f2c-z.f compilation,  -O0 
FAIL: g77.f-torture/execute/intrinsic-f2c-z.f compilation,  -O1 
FAIL: g77.f-torture/execute/intrinsic-f2c-z.f compilation,  -O2 
FAIL: g77.f-torture/execute/intrinsic-f2c-z.f compilation,  -O3 -fomit-frame-pointer 
FAIL: g77.f-torture/execute/intrinsic-f2c-z.f compilation,  -O3 -g 
FAIL: g77.f-torture/execute/intrinsic-f2c-z.f compilation,  -Os 
FAIL: g77.f-torture/execute/intrinsic-unix-bessel.f compilation,  -O0 
FAIL: g77.f-torture/execute/intrinsic-unix-bessel.f compilation,  -O1 
FAIL: g77.f-torture/execute/intrinsic-unix-bessel.f compilation,  -O2 
FAIL: g77.f-torture/execute/intrinsic-unix-bessel.f compilation,  -O3 -fomit-frame-pointer 
FAIL: g77.f-torture/execute/intrinsic-unix-bessel.f compilation,  -O3 -g 
FAIL: g77.f-torture/execute/intrinsic-unix-bessel.f compilation,  -Os 
FAIL: g77.f-torture/execute/intrinsic-unix-erf.f compilation,  -O0 
FAIL: g77.f-torture/execute/intrinsic-unix-erf.f compilation,  -O1 
FAIL: g77.f-torture/execute/intrinsic-unix-erf.f compilation,  -O2 
FAIL: g77.f-torture/execute/intrinsic-unix-erf.f compilation,  -O3 -fomit-frame-pointer 
FAIL: g77.f-torture/execute/intrinsic-unix-erf.f compilation,  -O3 -g 
FAIL: g77.f-torture/execute/intrinsic-unix-erf.f compilation,  -Os 
FAIL: g77.f-torture/execute/intrinsic-vax-cd.f compilation,  -O0 
FAIL: g77.f-torture/execute/intrinsic-vax-cd.f compilation,  -O1 
FAIL: g77.f-torture/execute/intrinsic-vax-cd.f compilation,  -O2 
FAIL: g77.f-torture/execute/intrinsic-vax-cd.f compilation,  -O3 -fomit-frame-pointer 
FAIL: g77.f-torture/execute/intrinsic-vax-cd.f compilation,  -O3 -g 
FAIL: g77.f-torture/execute/intrinsic-vax-cd.f compilation,  -Os 
FAIL: g77.f-torture/execute/intrinsic77.f compilation,  -O0 
FAIL: g77.f-torture/execute/intrinsic77.f compilation,  -O1 
FAIL: g77.f-torture/execute/intrinsic77.f compilation,  -O2 
FAIL: g77.f-torture/execute/intrinsic77.f compilation,  -O3 -fomit-frame-pointer 
FAIL: g77.f-torture/execute/intrinsic77.f compilation,  -O3 -g 
FAIL: g77.f-torture/execute/intrinsic77.f compilation,  -Os 
FAIL: g77.f-torture/execute/io0.f compilation,  -O0 
FAIL: g77.f-torture/execute/io0.f compilation,  -O1 
FAIL: g77.f-torture/execute/io0.f compilation,  -O2 
FAIL: g77.f-torture/execute/io0.f compilation,  -O3 -fomit-frame-pointer 
FAIL: g77.f-torture/execute/io0.f compilation,  -O3 -g 
FAIL: g77.f-torture/execute/io0.f compilation,  -Os 
FAIL: g77.f-torture/execute/io1.f compilation,  -O0 
FAIL: g77.f-torture/execute/io1.f compilation,  -O1 
FAIL: g77.f-torture/execute/io1.f compilation,  -O2 
FAIL: g77.f-torture/execute/io1.f compilation,  -O3 -fomit-frame-pointer 
FAIL: g77.f-torture/execute/io1.f compilation,  -O3 -g 
FAIL: g77.f-torture/execute/io1.f compilation,  -Os 
FAIL: g77.f-torture/execute/labug1.f compilation,  -O0 
FAIL: g77.f-torture/execute/labug1.f compilation,  -O1 
FAIL: g77.f-torture/execute/labug1.f compilation,  -O2 
FAIL: g77.f-torture/execute/labug1.f compilation,  -O3 -fomit-frame-pointer 
FAIL: g77.f-torture/execute/labug1.f compilation,  -O3 -fomit-frame-pointer -funroll-loops 
FAIL: g77.f-torture/execute/labug1.f compilation,  -O3 -fomit-frame-pointer -funroll-all-loops -finline-functions 
FAIL: g77.f-torture/execute/labug1.f compilation,  -O3 -g 
FAIL: g77.f-torture/execute/labug1.f compilation,  -Os 
FAIL: g77.f-torture/execute/large_vec.f compilation,  -O0 
FAIL: g77.f-torture/execute/large_vec.f compilation,  -O1 
FAIL: g77.f-torture/execute/large_vec.f compilation,  -O2 
FAIL: g77.f-torture/execute/large_vec.f compilation,  -O3 -fomit-frame-pointer 
FAIL: g77.f-torture/execute/large_vec.f compilation,  -O3 -g 
FAIL: g77.f-torture/execute/large_vec.f compilation,  -Os 
FAIL: g77.f-torture/execute/le.f compilation,  -O0 
FAIL: g77.f-torture/execute/le.f compilation,  -O1 
FAIL: g77.f-torture/execute/le.f compilation,  -O2 
FAIL: g77.f-torture/execute/le.f compilation,  -O3 -fomit-frame-pointer 
FAIL: g77.f-torture/execute/le.f compilation,  -O3 -g 
FAIL: g77.f-torture/execute/le.f compilation,  -Os 
FAIL: g77.f-torture/execute/select.f compilation,  -O0 
FAIL: g77.f-torture/execute/select.f compilation,  -O1 
FAIL: g77.f-torture/execute/select.f compilation,  -O2 
FAIL: g77.f-torture/execute/select.f compilation,  -O3 -fomit-frame-pointer 
FAIL: g77.f-torture/execute/select.f compilation,  -O3 -g 
FAIL: g77.f-torture/execute/select.f compilation,  -Os 
FAIL: g77.f-torture/execute/short.f compilation,  -O0 
FAIL: g77.f-torture/execute/short.f compilation,  -O1 
FAIL: g77.f-torture/execute/short.f compilation,  -O2 
FAIL: g77.f-torture/execute/short.f compilation,  -O3 -fomit-frame-pointer 
FAIL: g77.f-torture/execute/short.f compilation,  -O3 -fomit-frame-pointer -funroll-loops 
FAIL: g77.f-torture/execute/short.f compilation,  -O3 -fomit-frame-pointer -funroll-all-loops -finline-functions 
FAIL: g77.f-torture/execute/short.f compilation,  -O3 -g 
FAIL: g77.f-torture/execute/short.f compilation,  -Os 
FAIL: g77.f-torture/execute/u77-test.f compilation,  -O0 
FAIL: g77.f-torture/execute/u77-test.f compilation,  -O1 
FAIL: g77.f-torture/execute/u77-test.f compilation,  -O2 
FAIL: g77.f-torture/execute/u77-test.f compilation,  -O3 -fomit-frame-pointer 
FAIL: g77.f-torture/execute/u77-test.f compilation,  -O3 -fomit-frame-pointer -funroll-loops 
FAIL: g77.f-torture/execute/u77-test.f compilation,  -O3 -fomit-frame-pointer -funroll-all-loops -finline-functions 
FAIL: g77.f-torture/execute/u77-test.f compilation,  -O3 -g 
FAIL: g77.f-torture/execute/u77-test.f compilation,  -Os 
FAIL: g77.f-torture/execute/cpp.F compilation,  -O0 
FAIL: g77.f-torture/execute/cpp.F compilation,  -O1 
FAIL: g77.f-torture/execute/cpp.F compilation,  -O2 
FAIL: g77.f-torture/execute/cpp.F compilation,  -O3 -fomit-frame-pointer 
FAIL: g77.f-torture/execute/cpp.F compilation,  -O3 -g 
FAIL: g77.f-torture/execute/cpp.F compilation,  -Os 
FAIL: g77.f-torture/execute/cpp2.F compilation,  -O0 
FAIL: g77.f-torture/execute/cpp2.F compilation,  -O1 
FAIL: g77.f-torture/execute/cpp2.F compilation,  -O2 
FAIL: g77.f-torture/execute/cpp2.F compilation,  -O3 -fomit-frame-pointer 
FAIL: g77.f-torture/execute/cpp2.F compilation,  -O3 -g 
FAIL: g77.f-torture/execute/cpp2.F compilation,  -Os 
FAIL: g77.f-torture/noncompile/check0.f

		=== g77 Summary ===

# of unexpected failures	1104
# of unresolved testcases	33
# of untested testcases		462
# of unsupported tests		6
/s/scratch/ljrittle/gcc-build-panther-0210/gcc/testsuite/../g77 version 3.4.0 20040210 (prerelease)

		=== gcc tests ===


Running target unix/-pthread
WARNING: program timed out.
FAIL: gcc.c-torture/compile/20001226-1.c  -O3 -g  (test for excess errors)
WARNING: program timed out.
FAIL: gcc.c-torture/compile/20001226-1.c  -Os  (test for excess errors)
FAIL: gcc.c-torture/execute/conversion.c execution,  -O0 
FAIL: gcc.c-torture/execute/conversion.c execution,  -O1 
FAIL: gcc.c-torture/execute/conversion.c execution,  -O2 
FAIL: gcc.c-torture/execute/conversion.c execution,  -O3 -fomit-frame-pointer 
FAIL: gcc.c-torture/execute/conversion.c execution,  -O3 -g 
FAIL: gcc.c-torture/execute/conversion.c execution,  -Os 
UNRESOLVED: gcc.c-torture/execute/simd-4.c execution,  -O0 
UNRESOLVED: gcc.c-torture/execute/va-arg-25.c execution,  -O0 
UNRESOLVED: gcc.c-torture/execute/va-arg-25.c execution,  -O1 
UNRESOLVED: gcc.c-torture/execute/va-arg-25.c execution,  -O2 
UNRESOLVED: gcc.c-torture/execute/va-arg-25.c execution,  -O3 -fomit-frame-pointer 
UNRESOLVED: gcc.c-torture/execute/va-arg-25.c execution,  -O3 -g 
UNRESOLVED: gcc.c-torture/execute/va-arg-25.c execution,  -Os 
FAIL: gcc.c-torture/execute/ieee/rbug.c execution,  -O0 
FAIL: gcc.c-torture/execute/ieee/rbug.c execution,  -O1 
FAIL: gcc.c-torture/execute/ieee/rbug.c execution,  -O2 
FAIL: gcc.c-torture/execute/ieee/rbug.c execution,  -Os 
FAIL: gcc.c-torture/execute/ieee/rbug.c execution,  -O0 
FAIL: gcc.c-torture/execute/ieee/rbug.c execution,  -O1 
FAIL: gcc.c-torture/execute/ieee/rbug.c execution,  -O2 
FAIL: gcc.c-torture/execute/ieee/rbug.c execution,  -Os 
UNRESOLVED: gcc.dg/compat/vector-1 c_compat_x_tst.o-c_compat_y_tst.o link 
UNRESOLVED: gcc.dg/compat/vector-1 c_compat_x_tst.o-c_compat_y_tst.o execute 
UNRESOLVED: gcc.dg/compat/vector-2 c_compat_x_tst.o-c_compat_y_tst.o link 
UNRESOLVED: gcc.dg/compat/vector-2 c_compat_x_tst.o-c_compat_y_tst.o execute 
FAIL: gcc.dg/20001013-1.c (test for excess errors)
WARNING: gcc.dg/20001013-1.c compilation failed to produce executable
FAIL: gcc.dg/20001101-1.c (test for excess errors)
WARNING: gcc.dg/20001101-1.c compilation failed to produce executable
FAIL: gcc.dg/20001102-1.c (test for excess errors)
WARNING: gcc.dg/20001102-1.c compilation failed to produce executable
FAIL: gcc.dg/20020607-2.c (test for excess errors)
WARNING: gcc.dg/20020607-2.c compilation failed to produce executable
WARNING: gcc.dg/20021014-1.c compilation failed to produce executable
FAIL: gcc.dg/20030414-2.c (test for excess errors)
WARNING: gcc.dg/20030414-2.c compilation failed to produce executable
FAIL: gcc.dg/20030804-1.c (test for excess errors)
FAIL: gcc.dg/20030826-1.c (test for excess errors)
WARNING: gcc.dg/20030826-1.c compilation failed to produce executable
FAIL: gcc.dg/builtins-10.c (test for excess errors)
FAIL: gcc.dg/builtins-11.c (test for excess errors)
FAIL: gcc.dg/builtins-17.c (test for excess errors)
FAIL: gcc.dg/builtins-18.c (test for excess errors)
FAIL: gcc.dg/builtins-19.c (test for excess errors)
FAIL: gcc.dg/builtins-20.c (test for excess errors)
FAIL: gcc.dg/builtins-24.c (test for excess errors)
WARNING: gcc.dg/builtins-24.c compilation failed to produce executable
FAIL: gcc.dg/builtins-26.c (test for excess errors)
FAIL: gcc.dg/builtins-27.c (test for excess errors)
FAIL: gcc.dg/builtins-6.c (test for excess errors)
WARNING: gcc.dg/builtins-6.c compilation failed to produce executable
FAIL: gcc.dg/builtins-7.c (test for excess errors)
FAIL: gcc.dg/builtins-8.c (test for excess errors)
WARNING: gcc.dg/builtins-8.c compilation failed to produce executable
FAIL: gcc.dg/fastmath-1.c (test for excess errors)
WARNING: gcc.dg/fastmath-1.c compilation failed to produce executable
FAIL: gcc.dg/fnegate-1.c (test for excess errors)
WARNING: gcc.dg/fnegate-1.c compilation failed to produce executable
FAIL: gcc.dg/nest.c (test for excess errors)
WARNING: gcc.dg/nest.c compilation failed to produce executable
XPASS: gcc.dg/uninit-4.c uninitialized variable warning (test for bogus messages, line 26)
FAIL: gcc.dg/pch/static-1.c -O0 -g assembly comparison
FAIL: gcc.dg/pch/static-1.c  -O0  assembly comparison
FAIL: gcc.dg/pch/static-1.c  -O1  assembly comparison
FAIL: gcc.dg/pch/static-2.c -O0 -g assembly comparison
FAIL: gcc.dg/pch/static-2.c  -O0  assembly comparison
FAIL: gcc.dg/pch/static-2.c  -O1  assembly comparison
FAIL: gcc.dg/pch/static-3.c -O0 -g assembly comparison
FAIL: gcc.dg/pch/static-3.c  -O0  assembly comparison
FAIL: gcc.dg/pch/static-3.c  -O1  assembly comparison
FAIL: gcc.dg/torture/builtin-attr-1.c  -O0  (test for excess errors)
FAIL: gcc.dg/torture/builtin-attr-1.c  -O1  (test for excess errors)
FAIL: gcc.dg/torture/builtin-attr-1.c  -O2  (test for excess errors)
FAIL: gcc.dg/torture/builtin-attr-1.c  -O3 -fomit-frame-pointer  (test for excess errors)
FAIL: gcc.dg/torture/builtin-attr-1.c  -O3 -g  (test for excess errors)
FAIL: gcc.dg/torture/builtin-attr-1.c  -Os  (test for excess errors)
FAIL: gcc.dg/torture/builtin-explog-1.c  -O0  (test for excess errors)
FAIL: gcc.dg/torture/builtin-explog-1.c  -O1  (test for excess errors)
FAIL: gcc.dg/torture/builtin-explog-1.c  -O2  (test for excess errors)
FAIL: gcc.dg/torture/builtin-explog-1.c  -O3 -fomit-frame-pointer  (test for excess errors)
FAIL: gcc.dg/torture/builtin-explog-1.c  -O3 -g  (test for excess errors)
FAIL: gcc.dg/torture/builtin-explog-1.c  -Os  (test for excess errors)

		=== gcc Summary ===

# of expected passes		24543
# of unexpected failures	59
# of unexpected successes	1
# of expected failures		84
# of unresolved testcases	11
# of untested testcases		7
# of unsupported tests		300
/s/scratch/ljrittle/gcc-build-panther-0210/gcc/xgcc version 3.4.0 20040210 (prerelease)

		=== objc tests ===


Running target unix/-pthread

		=== objc Summary ===

# of expected passes		1341
# of unsupported tests		8
/s/scratch/ljrittle/gcc-build-panther-0210/gcc/xgcc version 3.4.0 20040210 (prerelease)

		=== libstdc++ tests ===


Running target unix/-pthread
FAIL: 22_locale/collate/compare/wchar_t/2.cc (test for excess errors)
WARNING: 22_locale/collate/compare/wchar_t/2.cc compilation failed to produce executable
FAIL: 22_locale/collate/compare/wchar_t/wrapped_env.cc (test for excess errors)
WARNING: 22_locale/collate/compare/wchar_t/wrapped_env.cc compilation failed to produce executable
FAIL: 22_locale/collate/compare/wchar_t/wrapped_locale.cc (test for excess errors)
WARNING: 22_locale/collate/compare/wchar_t/wrapped_locale.cc compilation failed to produce executable
FAIL: 22_locale/collate/hash/wchar_t/2.cc (test for excess errors)
WARNING: 22_locale/collate/hash/wchar_t/2.cc compilation failed to produce executable
FAIL: 22_locale/collate/hash/wchar_t/wrapped_env.cc (test for excess errors)
WARNING: 22_locale/collate/hash/wchar_t/wrapped_env.cc compilation failed to produce executable
FAIL: 22_locale/collate/hash/wchar_t/wrapped_locale.cc (test for excess errors)
WARNING: 22_locale/collate/hash/wchar_t/wrapped_locale.cc compilation failed to produce executable
FAIL: 22_locale/collate/transform/wchar_t/2.cc (test for excess errors)
WARNING: 22_locale/collate/transform/wchar_t/2.cc compilation failed to produce executable
FAIL: 22_locale/collate/transform/wchar_t/wrapped_env.cc (test for excess errors)
WARNING: 22_locale/collate/transform/wchar_t/wrapped_env.cc compilation failed to produce executable
FAIL: 22_locale/collate/transform/wchar_t/wrapped_locale.cc (test for excess errors)
WARNING: 22_locale/collate/transform/wchar_t/wrapped_locale.cc compilation failed to produce executable
FAIL: 22_locale/ctype/is/wchar_t/1.cc execution test
FAIL: 22_locale/ctype/scan/wchar_t/1.cc execution test
XPASS: 26_numerics/c99_classification_macros_c.cc (test for excess errors)
WARNING: program timed out.
FAIL: 27_io/basic_filebuf/open/char/9507.cc execution test
WARNING: program timed out.
FAIL: 27_io/basic_filebuf/showmanyc/char/9533-1.cc execution test
FAIL: ext/stdio_filebuf/char/10063-2.cc execution test

		=== libstdc++ Summary ===

# of expected passes		2527
# of unexpected failures	14
# of unexpected successes	1
# of expected failures		2

Compiler version: 3.4.0 20040210 (prerelease) 
Platform: sparc64-unknown-freebsd5.2
configure flags: --prefix=/home/ljrittle/panther/tmp/install-panther --with-gnu-as --with-as=/usr/bin/as --with-gnu-ld --with-ld=/usr/bin/ld
BOOT_CFLAGS=-g -O2
Key: gmake is GNU make
     srcdir means in-source configuration was done within the gcc source tree
     objdir means out-source configuration was done within a fresh directory
See http://people.freebsd.org/~ljrittle/daily-gcc-bootstrap-reports
for all related transcript logs and log.sent files (not staged
until after all daily bootstraps for a machine complete).


Index Nav: [Date Index] [Subject Index] [Author Index] [Thread Index]
Message Nav: [Date Prev] [Date Next] [Thread Prev] [Thread Next]