This is the mail archive of the gcc-testresults@gcc.gnu.org mailing list for the GCC project.


Index Nav: [Date Index] [Subject Index] [Author Index] [Thread Index]
Message Nav: [Date Prev] [Date Next] [Thread Prev] [Thread Next]
Other format: [Raw text]

*** bootstrap fails for 3.3 20021006 (experimental) on i486-suse-linux-gnu


LAST_UPDATED: Sun Oct 6 22:17:56 UTC 2002

Native configuration is i486-suse-linux-gnu

		=== configure ===

[...]
checking whether getrusage is declared... yes
checking whether times is declared... yes
checking for struct tms... yes
checking for clock_t... yes
checking if mkdir takes one argument... no
Using `/home/schiele/gcccvs/gcc/gcc/config/i386/i386.c' for machine-specific logic.
Using `/home/schiele/gcccvs/gcc/gcc/config/i386/i386.md' as machine description file.
Using the following target machine macro files:
	/home/schiele/gcccvs/gcc/gcc/config/i386/i386.h
	/home/schiele/gcccvs/gcc/gcc/config/i386/unix.h
	/home/schiele/gcccvs/gcc/gcc/config/i386/att.h
	/home/schiele/gcccvs/gcc/gcc/config/dbxelf.h
	/home/schiele/gcccvs/gcc/gcc/config/elfos.h
	/home/schiele/gcccvs/gcc/gcc/config/svr4.h
	/home/schiele/gcccvs/gcc/gcc/config/linux.h
	/home/schiele/gcccvs/gcc/gcc/config/i386/linux.h
checking for library containing strerror... none required
checking for working const... (cached) yes
checking for off_t... yes
checking for size_t... yes
checking for working alloca.h... (cached) yes
checking for alloca... yes
checking whether we are using the GNU C Library 2.1 or newer... yes
checking for argz.h... yes
checking for limits.h... (cached) yes
checking for locale.h... yes
checking for nl_types.h... yes
checking for malloc.h... (cached) yes
checking for stddef.h... (cached) yes
checking for stdlib.h... (cached) yes
checking for string.h... (cached) yes
checking for unistd.h... (cached) yes
checking for sys/param.h... (cached) yes
checking for feof_unlocked... yes
checking for fgets_unlocked... yes
checking for getcwd... (cached) yes
checking for getegid... yes
checking for geteuid... yes
checking for getgid... yes
checking for getuid... yes
checking for mempcpy... yes
checking for munmap... yes
checking for putenv... (cached) yes
checking for setenv... (cached) yes
checking for setlocale... yes
checking for stpcpy... yes
checking for strchr... (cached) yes
checking for strcasecmp... (cached) yes
checking for strdup... (cached) yes
checking for strtoul... (cached) yes
checking for tsearch... yes
checking for __argz_count... yes
checking for __argz_stringify... yes
checking for __argz_next... yes
checking for iconv... (cached) yes
checking for iconv declaration... (cached) 
         extern size_t iconv (iconv_t cd, char * *inbuf, size_t *inbytesleft, char * *outbuf, size_t *outbytesleft);
checking for nl_langinfo and CODESET... yes
checking for LC_MESSAGES... yes
checking whether NLS is requested... yes
checking whether included gettext is requested... no
checking for libintl.h... yes
checking for GNU gettext in libc... yes
checking for dcgettext... yes
checking for msgfmt... /usr/bin/msgfmt
checking for gmsgfmt... /usr/bin/msgfmt
checking for xgettext... /usr/bin/xgettext
checking for bison... bison
checking version of bison... 1.33, ok
checking for catalogs to be installed...  da el es fr ja nl sv tr
checking what assembler to use... /usr/bin/as
checking what linker to use... /usr/bin/ld
checking what nm to use... nm
checking what objdump to use... objdump
checking assembler alignment features... .p2align including maximum skip
checking assembler subsection support... working .subsection -1
checking assembler weak support... yes
checking assembler hidden support... no
checking assembler leb128 support... yes
checking assembler eh_frame optimization... yes
checking assembler section merging support... yes
checking assembler thread-local storage support... no
checking assembler instructions... filds fists 
checking assembler GOTOFF in data directives... yes
checking assembler dwarf2 debug_line support... yes
checking assembler --gdwarf2 support... yes
checking assembler --gstabs support... yes
checking linker PT_GNU_EH_FRAME support... no
Using ggc-page for garbage collection.
checking whether to enable maintainer-specific portions of Makefiles... no
Links are now set up to build a native compiler for i486-suse-linux-gnu
updating cache ../config.cache
creating ./config.status
creating Makefile
creating intl/Makefile
creating fixinc/Makefile
creating gccbug
creating mklibgcc
creating mkheaders
creating auto-host.h

Full log can be found at
http://pi3.informatik.uni-mannheim.de/~schiele/gcclogs/20021007/i486-suse-linux.configure

              === make bootstrap ===

[...]
/local/gccbuild/i486-suse-linux/libstdc++-v3/include/ext/stl_rope.h:2456:   instantiated from `__gnu_cxx::_Rope_base<char, std::allocator<char> >'
/local/gccbuild/i486-suse-linux/libstdc++-v3/include/ext/stl_rope.h:2456:   instantiated from `__gnu_cxx::rope<char, std::allocator<char> >'
/local/gccbuild/i486-suse-linux/libstdc++-v3/include/ext/stl_rope.h:2456:   instantiated from here
/local/gccbuild/i486-suse-linux/libstdc++-v3/include/ext/stl_rope.h:455: error: base
   class `__gnu_cxx::_Rope_RopeRep<char, std::allocator<char> >' has incomplete 
   type
/local/gccbuild/i486-suse-linux/libstdc++-v3/include/ext/stl_rope.h:649: error: no
   type named `allocator_type' in `struct __gnu_cxx::_Rope_rep_base<char, 
   std::allocator<char> >'
/local/gccbuild/i486-suse-linux/libstdc++-v3/include/ext/stl_rope.h:652: error: no
   type named `allocator_type' in `struct __gnu_cxx::_Rope_rep_base<char, 
   std::allocator<char> >'
/local/gccbuild/i486-suse-linux/libstdc++-v3/include/ext/stl_rope.h: In instantiation of `__gnu_cxx::_Rope_RopeSubstring<char, std::allocator<char> >':
/local/gccbuild/i486-suse-linux/libstdc++-v3/include/ext/stl_rope.h:455:   instantiated from `__gnu_cxx::_Rope_rep_alloc_base<char, std::allocator<char>, true>'
/local/gccbuild/i486-suse-linux/libstdc++-v3/include/ext/stl_rope.h:1200:   instantiated from `__gnu_cxx::_Rope_rep_base<char, std::allocator<char> >'
/local/gccbuild/i486-suse-linux/libstdc++-v3/include/ext/stl_rope.h:1200:   instantiated from `__gnu_cxx::_Rope_RopeRep<char, std::allocator<char> >'
/local/gccbuild/i486-suse-linux/libstdc++-v3/include/ext/stl_rope.h:1200:   instantiated from `__gnu_cxx::_Rope_alloc_base<char, std::allocator<char>, true>'
/local/gccbuild/i486-suse-linux/libstdc++-v3/include/ext/stl_rope.h:2456:   instantiated from `__gnu_cxx::_Rope_base<char, std::allocator<char> >'
/local/gccbuild/i486-suse-linux/libstdc++-v3/include/ext/stl_rope.h:2456:   instantiated from `__gnu_cxx::rope<char, std::allocator<char> >'
/local/gccbuild/i486-suse-linux/libstdc++-v3/include/ext/stl_rope.h:2456:   instantiated from here
/local/gccbuild/i486-suse-linux/libstdc++-v3/include/ext/stl_rope.h:712: error: no
   type named `allocator_type' in `struct __gnu_cxx::_Rope_rep_base<char, 
   std::allocator<char> >'
/local/gccbuild/i486-suse-linux/libstdc++-v3/include/ext/stl_rope.h:715: error: no
   type named `allocator_type' in `struct __gnu_cxx::_Rope_rep_base<char, 
   std::allocator<char> >'
/local/gccbuild/i486-suse-linux/libstdc++-v3/include/ext/stl_rope.h: In instantiation of `__gnu_cxx::_Rope_RopeConcatenation<wchar_t, std::allocator<wchar_t> >':
/local/gccbuild/i486-suse-linux/libstdc++-v3/include/ext/stl_rope.h:455:   instantiated from `__gnu_cxx::_Rope_rep_alloc_base<wchar_t, std::allocator<wchar_t>, true>'
/local/gccbuild/i486-suse-linux/libstdc++-v3/include/ext/stl_rope.h:1200:   instantiated from `__gnu_cxx::_Rope_rep_base<wchar_t, std::allocator<wchar_t> >'
/local/gccbuild/i486-suse-linux/libstdc++-v3/include/ext/stl_rope.h:1200:   instantiated from `__gnu_cxx::_Rope_RopeRep<wchar_t, std::allocator<wchar_t> >'
/local/gccbuild/i486-suse-linux/libstdc++-v3/include/ext/stl_rope.h:1200:   instantiated from `__gnu_cxx::_Rope_alloc_base<wchar_t, std::allocator<wchar_t>, true>'
/local/gccbuild/i486-suse-linux/libstdc++-v3/include/ext/stl_rope.h:2461:   instantiated from `__gnu_cxx::_Rope_base<wchar_t, std::allocator<wchar_t> >'
/local/gccbuild/i486-suse-linux/libstdc++-v3/include/ext/stl_rope.h:2461:   instantiated from `__gnu_cxx::rope<wchar_t, std::allocator<wchar_t> >'
/local/gccbuild/i486-suse-linux/libstdc++-v3/include/ext/stl_rope.h:2461:   instantiated from here
/local/gccbuild/i486-suse-linux/libstdc++-v3/include/ext/stl_rope.h:455: error: base
   class `__gnu_cxx::_Rope_RopeRep<wchar_t, std::allocator<wchar_t> >' has 
   incomplete type
/local/gccbuild/i486-suse-linux/libstdc++-v3/include/ext/stl_rope.h:609: error: no
   type named `allocator_type' in `struct __gnu_cxx::_Rope_rep_base<wchar_t, 
   std::allocator<wchar_t> >'
/local/gccbuild/i486-suse-linux/libstdc++-v3/include/ext/stl_rope.h:614: error: no
   type named `allocator_type' in `struct __gnu_cxx::_Rope_rep_base<wchar_t, 
   std::allocator<wchar_t> >'
/local/gccbuild/i486-suse-linux/libstdc++-v3/include/ext/stl_rope.h: In instantiation of `__gnu_cxx::_Rope_RopeLeaf<wchar_t, std::allocator<wchar_t> >':
/local/gccbuild/i486-suse-linux/libstdc++-v3/include/ext/stl_rope.h:455:   instantiated from `__gnu_cxx::_Rope_rep_alloc_base<wchar_t, std::allocator<wchar_t>, true>'
/local/gccbuild/i486-suse-linux/libstdc++-v3/include/ext/stl_rope.h:1200:   instantiated from `__gnu_cxx::_Rope_rep_base<wchar_t, std::allocator<wchar_t> >'
/local/gccbuild/i486-suse-linux/libstdc++-v3/include/ext/stl_rope.h:1200:   instantiated from `__gnu_cxx::_Rope_RopeRep<wchar_t, std::allocator<wchar_t> >'
/local/gccbuild/i486-suse-linux/libstdc++-v3/include/ext/stl_rope.h:1200:   instantiated from `__gnu_cxx::_Rope_alloc_base<wchar_t, std::allocator<wchar_t>, true>'
/local/gccbuild/i486-suse-linux/libstdc++-v3/include/ext/stl_rope.h:2461:   instantiated from `__gnu_cxx::_Rope_base<wchar_t, std::allocator<wchar_t> >'
/local/gccbuild/i486-suse-linux/libstdc++-v3/include/ext/stl_rope.h:2461:   instantiated from `__gnu_cxx::rope<wchar_t, std::allocator<wchar_t> >'
/local/gccbuild/i486-suse-linux/libstdc++-v3/include/ext/stl_rope.h:2461:   instantiated from here
/local/gccbuild/i486-suse-linux/libstdc++-v3/include/ext/stl_rope.h:455: error: base
   class `__gnu_cxx::_Rope_RopeRep<wchar_t, std::allocator<wchar_t> >' has 
   incomplete type
/local/gccbuild/i486-suse-linux/libstdc++-v3/include/ext/stl_rope.h:580: error: no
   type named `allocator_type' in `struct __gnu_cxx::_Rope_rep_base<wchar_t, 
   std::allocator<wchar_t> >'
/local/gccbuild/i486-suse-linux/libstdc++-v3/include/ext/stl_rope.h:582: error: no
   type named `allocator_type' in `struct __gnu_cxx::_Rope_rep_base<wchar_t, 
   std::allocator<wchar_t> >'
/local/gccbuild/i486-suse-linux/libstdc++-v3/include/ext/stl_rope.h: In instantiation of `__gnu_cxx::_Rope_RopeFunction<wchar_t, std::allocator<wchar_t> >':
/local/gccbuild/i486-suse-linux/libstdc++-v3/include/ext/stl_rope.h:455:   instantiated from `__gnu_cxx::_Rope_rep_alloc_base<wchar_t, std::allocator<wchar_t>, true>'
/local/gccbuild/i486-suse-linux/libstdc++-v3/include/ext/stl_rope.h:1200:   instantiated from `__gnu_cxx::_Rope_rep_base<wchar_t, std::allocator<wchar_t> >'
/local/gccbuild/i486-suse-linux/libstdc++-v3/include/ext/stl_rope.h:1200:   instantiated from `__gnu_cxx::_Rope_RopeRep<wchar_t, std::allocator<wchar_t> >'
/local/gccbuild/i486-suse-linux/libstdc++-v3/include/ext/stl_rope.h:1200:   instantiated from `__gnu_cxx::_Rope_alloc_base<wchar_t, std::allocator<wchar_t>, true>'
/local/gccbuild/i486-suse-linux/libstdc++-v3/include/ext/stl_rope.h:2461:   instantiated from `__gnu_cxx::_Rope_base<wchar_t, std::allocator<wchar_t> >'
/local/gccbuild/i486-suse-linux/libstdc++-v3/include/ext/stl_rope.h:2461:   instantiated from `__gnu_cxx::rope<wchar_t, std::allocator<wchar_t> >'
/local/gccbuild/i486-suse-linux/libstdc++-v3/include/ext/stl_rope.h:2461:   instantiated from here
/local/gccbuild/i486-suse-linux/libstdc++-v3/include/ext/stl_rope.h:455: error: base
   class `__gnu_cxx::_Rope_RopeRep<wchar_t, std::allocator<wchar_t> >' has 
   incomplete type
/local/gccbuild/i486-suse-linux/libstdc++-v3/include/ext/stl_rope.h:649: error: no
   type named `allocator_type' in `struct __gnu_cxx::_Rope_rep_base<wchar_t, 
   std::allocator<wchar_t> >'
/local/gccbuild/i486-suse-linux/libstdc++-v3/include/ext/stl_rope.h:652: error: no
   type named `allocator_type' in `struct __gnu_cxx::_Rope_rep_base<wchar_t, 
   std::allocator<wchar_t> >'
/local/gccbuild/i486-suse-linux/libstdc++-v3/include/ext/stl_rope.h: In instantiation of `__gnu_cxx::_Rope_RopeSubstring<wchar_t, std::allocator<wchar_t> >':
/local/gccbuild/i486-suse-linux/libstdc++-v3/include/ext/stl_rope.h:455:   instantiated from `__gnu_cxx::_Rope_rep_alloc_base<wchar_t, std::allocator<wchar_t>, true>'
/local/gccbuild/i486-suse-linux/libstdc++-v3/include/ext/stl_rope.h:1200:   instantiated from `__gnu_cxx::_Rope_rep_base<wchar_t, std::allocator<wchar_t> >'
/local/gccbuild/i486-suse-linux/libstdc++-v3/include/ext/stl_rope.h:1200:   instantiated from `__gnu_cxx::_Rope_RopeRep<wchar_t, std::allocator<wchar_t> >'
/local/gccbuild/i486-suse-linux/libstdc++-v3/include/ext/stl_rope.h:1200:   instantiated from `__gnu_cxx::_Rope_alloc_base<wchar_t, std::allocator<wchar_t>, true>'
/local/gccbuild/i486-suse-linux/libstdc++-v3/include/ext/stl_rope.h:2461:   instantiated from `__gnu_cxx::_Rope_base<wchar_t, std::allocator<wchar_t> >'
/local/gccbuild/i486-suse-linux/libstdc++-v3/include/ext/stl_rope.h:2461:   instantiated from `__gnu_cxx::rope<wchar_t, std::allocator<wchar_t> >'
/local/gccbuild/i486-suse-linux/libstdc++-v3/include/ext/stl_rope.h:2461:   instantiated from here
/local/gccbuild/i486-suse-linux/libstdc++-v3/include/ext/stl_rope.h:712: error: no
   type named `allocator_type' in `struct __gnu_cxx::_Rope_rep_base<wchar_t, 
   std::allocator<wchar_t> >'
/local/gccbuild/i486-suse-linux/libstdc++-v3/include/ext/stl_rope.h:715: error: no
   type named `allocator_type' in `struct __gnu_cxx::_Rope_rep_base<wchar_t, 
   std::allocator<wchar_t> >'
gmake[4]: *** [ext-inst.lo] Error 1
gmake[4]: Leaving directory `/local/gccbuild/i486-suse-linux/libstdc++-v3/src'
gmake[3]: *** [all-recursive] Error 1
gmake[3]: Leaving directory `/local/gccbuild/i486-suse-linux/libstdc++-v3'
gmake[2]: *** [all-recursive-am] Error 2
gmake[2]: Leaving directory `/local/gccbuild/i486-suse-linux/libstdc++-v3'
gmake[1]: *** [all-target-libstdc++-v3] Error 2
gmake[1]: Leaving directory `/local/gccbuild'
gmake: *** [bootstrap] Error 2

Full log can be found at
http://pi3.informatik.uni-mannheim.de/~schiele/gcclogs/20021007/i486-suse-linux.make

Compiler version: 3.3 20021006 (experimental)
Platform: i486-suse-linux-gnu
configure flags: --enable-threads=posix --prefix=/opt/Pkg/Linux/i686/gcc33 --enable-languages=c,c++,f77,objc --disable-libgcj --with-gxx-include-dir=/opt/Pkg/Linux/i686/gcc33/include/g++ --with-system-zlib --enable-shared --enable-__cxa_atexit i486-suse-linux


Index Nav: [Date Index] [Subject Index] [Author Index] [Thread Index]
Message Nav: [Date Prev] [Date Next] [Thread Prev] [Thread Next]