This is the mail archive of the gcc-regression@gcc.gnu.org mailing list for the GCC project.


Index Nav: [Date Index] [Subject Index] [Author Index] [Thread Index]
Message Nav: [Date Prev] [Date Next] [Thread Prev] [Thread Next]
Other format: [Raw text]

Gcc [trunk revision 227279] failed to profiledbootstrap on x86_64!


cd bld; \
 RUNTESTFLAGS="--target_board='unix{-m32,}'" ../src-trunk/configure \
	 --prefix=/usr/6.0.0 --enable-clocale=gnu --with-system-zlib --enable-shared --with-demangler-in-ld --enable-libmpx --with-build-config=bootstrap-lto --disable-werror --with-fpmath=sse --enable-languages=c,c++,fortran,java,lto,objc
checking build system type... x86_64-pc-linux-gnu
checking host system type... x86_64-pc-linux-gnu
checking target system type... x86_64-pc-linux-gnu
checking for a BSD-compatible install... /bin/install -c
    grep "Error " makelog.227279.trunk.x86_64 >> makelog.227279.trunk.x86_64.mail; \
make[7]: *** [/tmp/cchkKNRW.ltrans0.ltrans.o] Error 1
make[6]: *** [build/genhooks] Error 1
make[5]: *** [all-stagefeedback-gcc] Error 2
make[4]: *** [stagefeedback-bubble] Error 2
make[3]: *** [profiledbootstrap] Error 2
make[2]: *** [profiledbootstrap] Error 2
	-o build/gengtype-lex.o gengtype-lex.c
/export/gnu/import/git/gcc-test-profiled/bld/./prev-gcc/xg++ -B/export/gnu/import/git/gcc-test-profiled/bld/./prev-gcc/ -B/usr/6.0.0/x86_64-pc-linux-gnu/bin/ -nostdinc++ -B/export/gnu/import/git/gcc-test-profiled/bld/prev-x86_64-pc-linux-gnu/libstdc++-v3/src/.libs -B/export/gnu/import/git/gcc-test-profiled/bld/prev-x86_64-pc-linux-gnu/libstdc++-v3/libsupc++/.libs  -I/export/gnu/import/git/gcc-test-profiled/bld/prev-x86_64-pc-linux-gnu/libstdc++-v3/include/x86_64-pc-linux-gnu  -I/export/gnu/import/git/gcc-test-profiled/bld/prev-x86_64-pc-linux-gnu/libstdc++-v3/include  -I/export/gnu/import/git/gcc-test-profiled/src-trunk/libstdc++-v3/libsupc++ -L/export/gnu/import/git/gcc-test-profiled/bld/prev-x86_64-pc-linux-gnu/libstdc++-v3/src/.libs -L/export/gnu/import/git/gcc-test-profiled/bld/prev-x86_64-pc-linux-gnu/libstdc++-v3/libsupc++/.libs -c   -g -O2 -flto=jobserver -frandom-seed=1 -fprofile-use -DIN_GCC     -fno-exceptions -fno-rtti -fasynchronous-unwind-tables -W -Wall -Wno-narrowing -Wwrite-strings -Wcast-qual -Wmissing-format-attribute -Woverloaded-virtual -pedantic -Wno-long-long -Wno-variadic-macros -Wno-overlength-strings -fno-common  -DHAVE_CONFIG_H -DGENERATOR_FILE -fno-PIE -I. -Ibuild -I../../src-trunk/gcc -I../../src-trunk/gcc/build -I../../src-trunk/gcc/../include  -I../../src-trunk/gcc/../libcpp/include  \
	-o build/gengtype-parse.o ../../src-trunk/gcc/gengtype-parse.c
/export/gnu/import/git/gcc-test-profiled/bld/./prev-gcc/xg++ -B/export/gnu/import/git/gcc-test-profiled/bld/./prev-gcc/ -B/usr/6.0.0/x86_64-pc-linux-gnu/bin/ -nostdinc++ -B/export/gnu/import/git/gcc-test-profiled/bld/prev-x86_64-pc-linux-gnu/libstdc++-v3/src/.libs -B/export/gnu/import/git/gcc-test-profiled/bld/prev-x86_64-pc-linux-gnu/libstdc++-v3/libsupc++/.libs  -I/export/gnu/import/git/gcc-test-profiled/bld/prev-x86_64-pc-linux-gnu/libstdc++-v3/include/x86_64-pc-linux-gnu  -I/export/gnu/import/git/gcc-test-profiled/bld/prev-x86_64-pc-linux-gnu/libstdc++-v3/include  -I/export/gnu/import/git/gcc-test-profiled/src-trunk/libstdc++-v3/libsupc++ -L/export/gnu/import/git/gcc-test-profiled/bld/prev-x86_64-pc-linux-gnu/libstdc++-v3/src/.libs -L/export/gnu/import/git/gcc-test-profiled/bld/prev-x86_64-pc-linux-gnu/libstdc++-v3/libsupc++/.libs -c   -g -O2 -flto=jobserver -frandom-seed=1 -fprofile-use -DIN_GCC     -fno-exceptions -fno-rtti -fasynchronous-unwind-tables -W -Wall -Wno-narrowing -Wwrite-strings -Wcast-qual -Wmissing-format-attribute -Woverloaded-virtual -pedantic -Wno-long-long -Wno-variadic-macros -Wno-overlength-strings -fno-common  -DHAVE_CONFIG_H -DGENERATOR_FILE -fno-PIE -I. -Ibuild -I../../src-trunk/gcc -I../../src-trunk/gcc/build -I../../src-trunk/gcc/../include  -I../../src-trunk/gcc/../libcpp/include  \
	-o build/gengtype-state.o ../../src-trunk/gcc/gengtype-state.c
gawk -f ../../src-trunk/gcc/opt-functions.awk -f ../../src-trunk/gcc/opt-read.awk \
       -f ../../src-trunk/gcc/opth-gen.awk \
       < optionlist > tmp-options.h
/export/gnu/import/git/gcc-test-profiled/bld/./prev-gcc/xg++ -B/export/gnu/import/git/gcc-test-profiled/bld/./prev-gcc/ -B/usr/6.0.0/x86_64-pc-linux-gnu/bin/ -nostdinc++ -B/export/gnu/import/git/gcc-test-profiled/bld/prev-x86_64-pc-linux-gnu/libstdc++-v3/src/.libs -B/export/gnu/import/git/gcc-test-profiled/bld/prev-x86_64-pc-linux-gnu/libstdc++-v3/libsupc++/.libs  -I/export/gnu/import/git/gcc-test-profiled/bld/prev-x86_64-pc-linux-gnu/libstdc++-v3/include/x86_64-pc-linux-gnu  -I/export/gnu/import/git/gcc-test-profiled/bld/prev-x86_64-pc-linux-gnu/libstdc++-v3/include  -I/export/gnu/import/git/gcc-test-profiled/src-trunk/libstdc++-v3/libsupc++ -L/export/gnu/import/git/gcc-test-profiled/bld/prev-x86_64-pc-linux-gnu/libstdc++-v3/src/.libs -L/export/gnu/import/git/gcc-test-profiled/bld/prev-x86_64-pc-linux-gnu/libstdc++-v3/libsupc++/.libs -c   -g -O2 -flto=jobserver -frandom-seed=1 -fprofile-use -DIN_GCC     -fno-exceptions -fno-rtti -fasynchronous-unwind-tables -W -Wall -Wno-narrowing -Wwrite-strings -Wcast-qual -Wmissing-format-attribute -Woverloaded-virtual -pedantic -Wno-long-long -Wno-variadic-macros -Wno-overlength-strings -fno-common  -DHAVE_CONFIG_H -DGENERATOR_FILE -fno-PIE -I. -Ibuild -I../../src-trunk/gcc -I../../src-trunk/gcc/build -I../../src-trunk/gcc/../include  -I../../src-trunk/gcc/../libcpp/include  \
	-o build/genconstants.o ../../src-trunk/gcc/genconstants.c
/bin/sh ../../src-trunk/gcc/../move-if-change tmp-options.h options.h
echo timestamp > s-options-h
/export/gnu/import/git/gcc-test-profiled/bld/./prev-gcc/xg++ -B/export/gnu/import/git/gcc-test-profiled/bld/./prev-gcc/ -B/usr/6.0.0/x86_64-pc-linux-gnu/bin/ -nostdinc++ -B/export/gnu/import/git/gcc-test-profiled/bld/prev-x86_64-pc-linux-gnu/libstdc++-v3/src/.libs -B/export/gnu/import/git/gcc-test-profiled/bld/prev-x86_64-pc-linux-gnu/libstdc++-v3/libsupc++/.libs  -I/export/gnu/import/git/gcc-test-profiled/bld/prev-x86_64-pc-linux-gnu/libstdc++-v3/include/x86_64-pc-linux-gnu  -I/export/gnu/import/git/gcc-test-profiled/bld/prev-x86_64-pc-linux-gnu/libstdc++-v3/include  -I/export/gnu/import/git/gcc-test-profiled/src-trunk/libstdc++-v3/libsupc++ -L/export/gnu/import/git/gcc-test-profiled/bld/prev-x86_64-pc-linux-gnu/libstdc++-v3/src/.libs -L/export/gnu/import/git/gcc-test-profiled/bld/prev-x86_64-pc-linux-gnu/libstdc++-v3/libsupc++/.libs -c   -g -O2 -flto=jobserver -frandom-seed=1 -fprofile-use -DIN_GCC     -fno-exceptions -fno-rtti -fasynchronous-unwind-tables -W -Wall -Wno-narrowing -Wwrite-strings -Wcast-qual -Wmissing-format-attribute -Woverloaded-virtual -pedantic -Wno-long-long -Wno-variadic-macros -Wno-overlength-strings -fno-common  -DHAVE_CONFIG_H -DGENERATOR_FILE -fno-PIE -I. -Ibuild -I../../src-trunk/gcc -I../../src-trunk/gcc/build -I../../src-trunk/gcc/../include  -I../../src-trunk/gcc/../libcpp/include  \
	-o build/gengenrtl.o ../../src-trunk/gcc/gengenrtl.c
/export/gnu/import/git/gcc-test-profiled/bld/./prev-gcc/xg++ -B/export/gnu/import/git/gcc-test-profiled/bld/./prev-gcc/ -B/usr/6.0.0/x86_64-pc-linux-gnu/bin/ -nostdinc++ -B/export/gnu/import/git/gcc-test-profiled/bld/prev-x86_64-pc-linux-gnu/libstdc++-v3/src/.libs -B/export/gnu/import/git/gcc-test-profiled/bld/prev-x86_64-pc-linux-gnu/libstdc++-v3/libsupc++/.libs  -I/export/gnu/import/git/gcc-test-profiled/bld/prev-x86_64-pc-linux-gnu/libstdc++-v3/include/x86_64-pc-linux-gnu  -I/export/gnu/import/git/gcc-test-profiled/bld/prev-x86_64-pc-linux-gnu/libstdc++-v3/include  -I/export/gnu/import/git/gcc-test-profiled/src-trunk/libstdc++-v3/libsupc++ -L/export/gnu/import/git/gcc-test-profiled/bld/prev-x86_64-pc-linux-gnu/libstdc++-v3/src/.libs -L/export/gnu/import/git/gcc-test-profiled/bld/prev-x86_64-pc-linux-gnu/libstdc++-v3/libsupc++/.libs   -g -O2 -flto=jobserver -frandom-seed=1 -fprofile-use -DIN_GCC     -fno-exceptions -fno-rtti -fasynchronous-unwind-tables -W -Wall -Wno-narrowing -Wwrite-strings -Wcast-qual -Wmissing-format-attribute -Woverloaded-virtual -pedantic -Wno-long-long -Wno-variadic-macros -Wno-overlength-strings -fno-common  -DHAVE_CONFIG_H -DGENERATOR_FILE -fno-PIE -static-libstdc++ -static-libgcc  -no-pie -o build/genhooks \
    build/genhooks.o build/errors.o .././libiberty/libiberty.a
/export/gnu/import/git/gcc-test-profiled/bld/./prev-gcc/xg++ -B/export/gnu/import/git/gcc-test-profiled/bld/./prev-gcc/ -B/usr/6.0.0/x86_64-pc-linux-gnu/bin/ -nostdinc++ -B/export/gnu/import/git/gcc-test-profiled/bld/prev-x86_64-pc-linux-gnu/libstdc++-v3/src/.libs -B/export/gnu/import/git/gcc-test-profiled/bld/prev-x86_64-pc-linux-gnu/libstdc++-v3/libsupc++/.libs  -I/export/gnu/import/git/gcc-test-profiled/bld/prev-x86_64-pc-linux-gnu/libstdc++-v3/include/x86_64-pc-linux-gnu  -I/export/gnu/import/git/gcc-test-profiled/bld/prev-x86_64-pc-linux-gnu/libstdc++-v3/include  -I/export/gnu/import/git/gcc-test-profiled/src-trunk/libstdc++-v3/libsupc++ -L/export/gnu/import/git/gcc-test-profiled/bld/prev-x86_64-pc-linux-gnu/libstdc++-v3/src/.libs -L/export/gnu/import/git/gcc-test-profiled/bld/prev-x86_64-pc-linux-gnu/libstdc++-v3/libsupc++/.libs   -g -O2 -flto=jobserver -frandom-seed=1 -fprofile-use -DIN_GCC     -fno-exceptions -fno-rtti -fasynchronous-unwind-tables -W -Wall -Wno-narrowing -Wwrite-strings -Wcast-qual -Wmissing-format-attribute -Woverloaded-virtual -pedantic -Wno-long-long -Wno-variadic-macros -Wno-overlength-strings -fno-common  -DHAVE_CONFIG_H -DGENERATOR_FILE -fno-PIE -static-libstdc++ -static-libgcc  -no-pie -o build/genchecksum \
    build/genchecksum.o .././libiberty/libiberty.a
../../src-trunk/gcc/doc/extend.texi:7316: warning: node `Constraints' is next for `Extended Asm' in menu but not in sectioning
../../src-trunk/gcc/doc/md.texi:1061: warning: node `Extended Asm' is prev for `Constraints' in menu but not in sectioning
/export/gnu/import/git/gcc-test-profiled/bld/./prev-gcc/xg++ -B/export/gnu/import/git/gcc-test-profiled/bld/./prev-gcc/ -B/usr/6.0.0/x86_64-pc-linux-gnu/bin/ -nostdinc++ -B/export/gnu/import/git/gcc-test-profiled/bld/prev-x86_64-pc-linux-gnu/libstdc++-v3/src/.libs -B/export/gnu/import/git/gcc-test-profiled/bld/prev-x86_64-pc-linux-gnu/libstdc++-v3/libsupc++/.libs  -I/export/gnu/import/git/gcc-test-profiled/bld/prev-x86_64-pc-linux-gnu/libstdc++-v3/include/x86_64-pc-linux-gnu  -I/export/gnu/import/git/gcc-test-profiled/bld/prev-x86_64-pc-linux-gnu/libstdc++-v3/include  -I/export/gnu/import/git/gcc-test-profiled/src-trunk/libstdc++-v3/libsupc++ -L/export/gnu/import/git/gcc-test-profiled/bld/prev-x86_64-pc-linux-gnu/libstdc++-v3/src/.libs -L/export/gnu/import/git/gcc-test-profiled/bld/prev-x86_64-pc-linux-gnu/libstdc++-v3/libsupc++/.libs   -g -O2 -flto=jobserver -frandom-seed=1 -fprofile-use -DIN_GCC     -fno-exceptions -fno-rtti -fasynchronous-unwind-tables -W -Wall -Wno-narrowing -Wwrite-strings -Wcast-qual -Wmissing-format-attribute -Woverloaded-virtual -pedantic -Wno-long-long -Wno-variadic-macros -Wno-overlength-strings -fno-common  -DHAVE_CONFIG_H -DGENERATOR_FILE -fno-PIE -static-libstdc++ -static-libgcc  -no-pie -o build/genenums \
    build/genenums.o build/read-md.o build/errors.o .././libiberty/libiberty.a
echo timestamp > doc/gcc.1
(pod2man --center="GNU" --release="gcc-6.0.0" --date=2015-08-27 --section=1 gcc.pod > doc/gcc.1.T$$ && \
	mv -f doc/gcc.1.T$$ doc/gcc.1) || \
	(rm -f doc/gcc.1.T$$ && exit 1)
/export/gnu/import/git/gcc-test-profiled/bld/./prev-gcc/xg++ -B/export/gnu/import/git/gcc-test-profiled/bld/./prev-gcc/ -B/usr/6.0.0/x86_64-pc-linux-gnu/bin/ -nostdinc++ -B/export/gnu/import/git/gcc-test-profiled/bld/prev-x86_64-pc-linux-gnu/libstdc++-v3/src/.libs -B/export/gnu/import/git/gcc-test-profiled/bld/prev-x86_64-pc-linux-gnu/libstdc++-v3/libsupc++/.libs  -I/export/gnu/import/git/gcc-test-profiled/bld/prev-x86_64-pc-linux-gnu/libstdc++-v3/include/x86_64-pc-linux-gnu  -I/export/gnu/import/git/gcc-test-profiled/bld/prev-x86_64-pc-linux-gnu/libstdc++-v3/include  -I/export/gnu/import/git/gcc-test-profiled/src-trunk/libstdc++-v3/libsupc++ -L/export/gnu/import/git/gcc-test-profiled/bld/prev-x86_64-pc-linux-gnu/libstdc++-v3/src/.libs -L/export/gnu/import/git/gcc-test-profiled/bld/prev-x86_64-pc-linux-gnu/libstdc++-v3/libsupc++/.libs   -g -O2 -flto=jobserver -frandom-seed=1 -fprofile-use -DIN_GCC     -fno-exceptions -fno-rtti -fasynchronous-unwind-tables -W -Wall -Wno-narrowing -Wwrite-strings -Wcast-qual -Wmissing-format-attribute -Woverloaded-virtual -pedantic -Wno-long-long -Wno-variadic-macros -Wno-overlength-strings -fno-common  -DHAVE_CONFIG_H -DGENERATOR_FILE -fno-PIE -static-libstdc++ -static-libgcc  -no-pie -o build/genmddeps \
    build/genmddeps.o build/read-md.o build/errors.o .././libiberty/libiberty.a
../../src-trunk/gcc/genhooks.c: In function âemit_documentationâ:
../../src-trunk/gcc/genhooks.c:284:1: internal compiler error: in gen_inlined_subroutine_die, at dwarf2out.c:19946
 }
 ^
0x8457b7 gen_inlined_subroutine_die
	../../src-trunk/gcc/dwarf2out.c:19945
0x8457b7 gen_block_die
	../../src-trunk/gcc/dwarf2out.c:21002
0x844e42 decls_for_scope
	../../src-trunk/gcc/dwarf2out.c:21075
0x84515d gen_lexical_block_die
	../../src-trunk/gcc/dwarf2out.c:19928
0x84515d gen_block_die
	../../src-trunk/gcc/dwarf2out.c:21005
0x844e42 decls_for_scope
	../../src-trunk/gcc/dwarf2out.c:21075
0x845454 gen_inlined_subroutine_die
	../../src-trunk/gcc/dwarf2out.c:19966
0x845454 gen_block_die
	../../src-trunk/gcc/dwarf2out.c:21002
0x844e42 decls_for_scope
	../../src-trunk/gcc/dwarf2out.c:21075
0x845283 gen_block_die
	../../src-trunk/gcc/dwarf2out.c:21008
0x844e42 decls_for_scope
	../../src-trunk/gcc/dwarf2out.c:21075
0x845283 gen_block_die
	../../src-trunk/gcc/dwarf2out.c:21008
0x844e42 decls_for_scope
	../../src-trunk/gcc/dwarf2out.c:21075
0x84515d gen_lexical_block_die
	../../src-trunk/gcc/dwarf2out.c:19928
0x84515d gen_block_die
	../../src-trunk/gcc/dwarf2out.c:21005
0x844e42 decls_for_scope
	../../src-trunk/gcc/dwarf2out.c:21075
0x84515d gen_lexical_block_die
	../../src-trunk/gcc/dwarf2out.c:19928
0x84515d gen_block_die
	../../src-trunk/gcc/dwarf2out.c:21005
0x844e42 decls_for_scope
	../../src-trunk/gcc/dwarf2out.c:21075
0x822acf gen_subprogram_die
	../../src-trunk/gcc/dwarf2out.c:19224
Please submit a full bug report,
with preprocessed source if appropriate.
Please include the complete backtrace with any bug report.
See <http://gcc.gnu.org/bugs.html> for instructions.
make[7]: *** [/tmp/cchkKNRW.ltrans0.ltrans.o] Error 1
lto-wrapper: fatal error: make returned 2 exit status
compilation terminated.
/usr/local/bin/ld: error: lto-wrapper failed
collect2: error: ld returned 1 exit status
Makefile:2638: recipe for target 'build/genhooks' failed
make[6]: *** [build/genhooks] Error 1
make[6]: *** Waiting for unfinished jobs....
rm fsf-funding.pod grmic.pod gcov.pod gc-analyze.pod cpp.pod gfdl.pod gpl.pod gfortran.pod gcc.pod gcj-dbtool.pod jcf-dump.pod gcj.pod jv-convert.pod gcov-tool.pod gij.pod
make[6]: Leaving directory '/export/gnu/import/git/gcc-test-profiled/bld/gcc'
Makefile:4573: recipe for target 'all-stagefeedback-gcc' failed
make[5]: *** [all-stagefeedback-gcc] Error 2
make[5]: Leaving directory '/export/gnu/import/git/gcc-test-profiled/bld'
Makefile:23738: recipe for target 'stagefeedback-bubble' failed
make[4]: *** [stagefeedback-bubble] Error 2
make[4]: Leaving directory '/export/gnu/import/git/gcc-test-profiled/bld'
Makefile:23757: recipe for target 'profiledbootstrap' failed
make[3]: *** [profiledbootstrap] Error 2
make[3]: Leaving directory '/export/gnu/import/git/gcc-test-profiled/bld'
21927.99user 443.71system 1:07:46elapsed 550%CPU (0avgtext+0avgdata 804756maxresident)k
586664inputs+19946080outputs (10658major+125014294minor)pagefaults 0swaps
Makefile:291: recipe for target 'profiledbootstrap' failed
make[2]: *** [profiledbootstrap] Error 2
make[2]: Leaving directory '/export/gnu/import/git/gcc-test-profiled'


Index Nav: [Date Index] [Subject Index] [Author Index] [Thread Index]
Message Nav: [Date Prev] [Date Next] [Thread Prev] [Thread Next]