gcc-prs archive
date index for November, 2002

This is the mail archive of the gcc-prs@gcc.gnu.org mailing list for the GCC project.

Indexes: [Date Index] [Subject Index] [Author Index] [Thread Index]
Site Nav: [Browse other archives for this mailing list]
[Browse other mailing lists at this site]
Search: Limit to:

November 30, 2002
20:57 Re: c++/8227: [3.3 regression] g++ 3.3: ctors not called in static array initialization mmitchel
20:56 c++/8227 mmitchel
20:56 c++/8227 mmitchel
20:16 Re: c++/8749: undefined reference error when declaring a function as inline and using -O3 switch jocelyn fournier
20:16 Re: c++/8772: Segmentation fault on 3 lines of template code Zack Weinberg
20:13 Re: c++/8332: [3.2/3.3 regression] strlen/template interaction causes ICE mmitchel
20:06 c++/8214 mmitchel
20:06 c++/8214 mmitchel
20:06 Re: other/8771: groff error Phil Edwards
20:01 Re: c++/8214: [3.2/3.3 regression] character conversion problem mmitchel
19:46 c++/8772: Segmentation fault on 3 lines of template code sneechy
18:16 c++/8214 mmitchel
18:16 c++/8214 mmitchel
17:56 other/8771: groff error dani
14:35 Re: c++/8227: [3.3 regression] g++ 3.3: ctors not called in static array initialization mmitchel
14:15 Re: c++/7977: [3.2/3.3 regression] structs in anonymous union mmitchel
14:07 Re: c++/8511: (hopefully) reproducible cc1plus SIGSEGV. mmitchel
14:06 c++/8511 mmitchel
14:06 c++/8511 mmitchel
13:48 Re: c++/8214: [3.2/3.3 regression] character conversion problem mmitchel
12:46 Re: libstdc++/8716: std::string( NULL, 0 ) throws exception also on zero length Joacim Zschimmer
11:36 Re: libstdc++/8707: make distclean fails Karl Berry
10:26 c++/8769: Compile chokes on mpeglib_artsplay of kdemultimedia (compiler error at extract_insn) ismore
09:46 bootstrap/8768: GCC-3.2-r4 Bootstrap error m
09:26 bootstrap/8767: stage 2: error on dwarfout.o carlos
09:26 c++/8766: cc1plus segfaults after failed initialisation of static template variable Andrew Sayers
07:36 other/8765: -msoft-float does not work for mipsel-linux, and probably others bart
04:26 libstdc++/8716: std::string( NULL, 0 ) throws exception also on zero length Joacim Zschimmer

November 29, 2002
20:46 libgcj/8759 tromey
20:34 Re: libgcj/8759: java.beans.Introspector has no flushCaches() or flushFromCaches() methods tromey
19:16 Re: target/8763: generic vectors and altivec multiply Andrew Pinski
19:16 other/8764: no way to use hex numbers in md files pinskia
19:06 target/8763: generic vectors and altivec multiply pinskia
17:54 Re: c++/8662: [3.2/3.3 regression] illegal access of private member of unnamed class mmitchel
17:36 Re: libstdc++/8761: poor fstream performance Phil Edwards
17:06 c++/8762: Internal compiler error. bothie
16:26 libstdc++/8761: poor fstream performance wj178839
15:51 Re: libstdc++/8716: std::string( NULL, 0 ) throws exception also on zero length paolo
15:24 Re: c++/6580: crash on destructors involving ~string() reichelt
15:06 Re: optimization/7675: [3.2/3.3 regression] ICE in fixup_var_refs_1 Volker Reichelt
14:22 Re: middle-end/7324: Internal compiler error in fixup_var_refs_1, at function.c:1874 reichelt
14:18 Re: optimization/7675: [3.2/3.3 regression] ICE in fixup_var_refs_1 reichelt
13:56 Re: c++/8688: [3.3 regression] ICE with segfault on missing comma in initializer of 2D array. reichelt
13:46 Re: optimization/8758: gcc 3.2.1 gives bad values to a long long variable when optimizing with O2 reichelt
13:37 Re: c++/8749: undefined reference error when declaring a function as inline and using -O3 switch reichelt
12:56 Re: c/6724: "make check" on glibc-2.2.5 fails using gcc-3.1 Andreas Jaeger
12:51 Re: c/8426: GCC segfault reichelt
12:46 Re: target/5894: x86/-m128bit-long-double: ICE on (double *= unsigned long long int) reichelt
12:40 Re: optimization/8760: gcc 3.2.1 problem with -m128bit-long-double reichelt
12:26 optimization/8760: gcc 3.2.1 problem with -m128bit-long-double pnardu
12:26 Re: fortran/8751: g77 produces incorrect code when using -funroll-loops Toon Moene
12:13 Re: c++/8756: Feedback about #8749 bug reichelt
12:10 Re: c++/8749: undefined reference error when declaring a function as inline and using -O3 switch reichelt
12:04 Re: c/6724: "make check" on glibc-2.2.5 fails using gcc-3.1 bangerth
12:02 Re: bootstrap/6691: [Solaris 2.7] Internal compiler error when building gcc-3.1 bangerth
11:58 Re: c/6191: ICE doing pointer math with -fPIC bangerth
10:36 Re: bootstrap/1987: GCC 2.95.2 fails to build under Interix 2.2 Wolfgang Bangerth
10:36 libgcj/8759: java.beans.Introspector has no flushCaches() or flushFromCaches() methods gbenson
09:46 Re: optimization/8758: gcc 3.2.1 gives bad values to a long long variable when optimizing with O2 Christian Ehrhardt
09:26 Re: c++/6915: istream::get calls won't compile when getting an unsignedchar David Burken
09:26 Re: optimization/8758: gcc 3.2.1 gives bad values to a long longvariable when optimizing with O2 Andreas Jaeger
08:46 optimization/8758: gcc 3.2.1 gives bad values to a long long variable when optimizing with O2 bhelmste
08:26 other/8757: GCC crash when sizeof (long) > sizeof (char *), (splay_tree_compare_fn)strcmp is wrong mitr
07:36 c++/8756: Feedback about #8749 bug joc
07:16 target/8755: exceptions not caught from shared library on solaris 2.8 andete
06:36 Re: c/8754: Allows illegal code Volker Reichelt
06:16 Re: c/8754: Allows illegal code Petter Reinholdtsen
06:08 Re: c/8754: Allows illegal code reichelt
05:46 c/8754: Allows illegal code pere
05:28 Re: c/5077: Strange Code Generation reichelt
05:16 c++/8753: Wishlist: g++ disable Warning "is implicitly a typename" Steffen Neumann
04:36 Re: c++/5919: [3.2/3.3 regression] ICE when passing variable array to template function Volker Reichelt
04:02 Re: c/7277: Casting integers to vector types causes internal compiler error reichelt
03:56 Re: c++/3079: ICE in c_expand_expr, at c-common.c:3521 Volker Reichelt
03:05 Re: fortran/8751: g77 produces incorrect code when using -funroll-loops reichelt
02:56 Re: c++/8061: ICE in grokdeclarator, at cp/decl.c:10142 Gabriel Dos Reis
02:56 Re: libstdc++/8713: template <class charT> bool isspace (charT c,const locale& loc) Leif Lönnblad
02:27 Re: fortran/8751: g77 produces incorrect code when using -funroll-loops toon
01:56 bootstrap/8752: error compiling plural.c in gcc/intl rolf-alois.walter
01:49 Re: c++/8702: [3.3 regression] matching of conversion operators nathan
00:10 Re: pending/8739: Darling neil

November 28, 2002
17:30 Re: c++/3431: ice while emitting debug info reichelt
16:35 Re: optimization/6139: C++ && -O3 && (quicksort.cc of Mesa/glu) == ICE (-O2 is fine) reichelt
16:28 Re: other/6308: Internal compiler error reichelt
16:08 Re: c/6632: ICE when using put_user with "void *" argument reichelt
16:04 Re: c/7330: ICE with dereferenced "void *" pointer reichelt
15:39 Re: c/6684: Internal compiler error of GCC 3.1 with -O2 reichelt
15:27 Re: middle-end/7199: ia64.md missing usual fnma patterns reichelt
15:26 Re: c/7207: gcc crashes on Mesa 4.0.3 compilation reichelt
15:21 Re: optimization/7253: Internal compiler error with -O2, ok with -O1 reichelt
15:18 Re: c/7271: having problem with pointer to pointer with const in function calling reichelt
15:16 fortran/8751: g77 produces incorrect code when using -funroll-loops Peter van Hoof
15:03 Re: c/7330: ICE with dereferenced "void *" pointer reichelt
14:49 Re: optimization/7878: GCC 3.2 Internal compiler error in simplify_subreg reichelt
14:40 Re: optimization/7924: internal compiler error reichelt
14:34 Re: other/8745: "Const" method returning "non-const"reference doesn't work. reichelt
14:01 Re: spam/8744: Verdana, Arial, Helvetica, sans reichelt
13:53 Re: c++/8749: undefined reference error when declaring a function as inline and using -O3 switch reichelt
13:36 libstdc++/8716 pme
13:31 Re: c++/8748: [3.3 regression] ICE in cp_expr_size at cp/cp-lang.c: 307 reichelt
13:26 Re: libstdc++/8716: std::string( NULL, 0 ) throws exception also on zero length Phil Edwards
13:26 optimization/8750: Cygwin prolog generation erroneously emitting __alloca as regular function call fish
13:13 Re: c++/8747: [3.3 regression] internal compiler error: in cp_convert_parm_for_inlining, at cp/call.c:4304 reichelt
12:36 c++/8749: undefined reference error when declaring a function as inline and using -O3 switch joc
11:16 c++/8747: [3.3 regression] internal compiler error: in cp_convert_parm_for_inlining, at cp/call.c:4304 aj
11:16 c++/8748: [regression 3.3] ICE in cp_expr_size at cp/cp-lang.c: 307 aj
09:56 Re: c++/8061: ICE in grokdeclarator, at cp/decl.c:10142 David Abrahams
09:06 Re: other/8745: "Const" method returning "non-const"reference doesn't work. Cristian Negresco
08:26 Re: c/8661: GCC 3.2 don't produces builtin code for __builtin_alloca reichelt
08:26 optimization/8746: gcc-3 miscompiles Linux kernel ppa driver on x86 chaus
08:19 Re: c/8462: [3.3 regression] ice in illegal array initializer reichelt
08:06 other/8745: "Const" method returning "non-const"reference doesn't work. cristian_negresco
08:02 Re: c/8605: <integer>-1 evaluates wrong or causes compiler error (attachment) reichelt
07:55 Re: optimization/8705: [3.2 regression] ICE in emit_move_insn_1, at expr.c:3101 reichelt
07:36 Re: preprocessor/8505: cross cpp0 use PREFIX_INCLUDE_DIR=$prefix/include stephane Carbillet
07:31 Re: c++/8442: [3.2/3.3 regression] ICE on nested template classes lerdsuwa
07:14 Re: optimization/8241: g++ ICE for optimization -O2 reichelt
05:46 Re: c/8743: receiving result from __builtin_return_address() beyond stack top causes segfault Edward Welbourne
05:16 c/8743: receiving result from __builtin_return_address() beyond stack top causes segfault eddy
05:07 Re: java/8741: [3.2/3.3 regression] gcj crashes when compiling the attached file reichelt
04:56 java/8742: Multiple identically-named local classes broken gbenson
04:50 Re: target/8659: trying to delete frame instruction with -fpic sirl
04:36 java/8741: gcj crashes when compiling the attached file gbenson
04:29 Re: optimization/8599: [3.2 regression] loop unroll bug with -march=k6-3 sirl
04:16 java/8740: Cross-package inheritance of static member classes broken gbenson
03:16 Re: c++/8061: ICE in grokdeclarator, at cp/decl.c:10142 Peter Kolloch
02:06 Re: libstdc++/8731: thread mutex initializers Georg Wild
00:46 libgcj/8738: java.io.CharArrayWriter's write methods erroneously throw IOExceptions gbenson

November 27, 2002
21:24 Re: c++/8706: gcc cannot generate __cdel functions that can be called by Visual C if that function returns >8 byte strucutres by value cgf
18:36 Re: c/6123: sparc-sun-solaris2.7 gcc-3.1 C testsuite failure in verify_local_live_at_start w/-fpic|-fPIC on gcc.dg/20020312-2.c Kaveh R. Ghazi
18:16 optimization/8737: Pentium4 + SSE: register to spill in class 'FLOAT_REGS' [minimal example] demon_lord
17:46 Re: c/8730: [3.2/3.3 regression] Cannot compile C function inside other C function reichelt
16:52 Re: spam/8735: Topmargin reichelt
16:22 Re: c++/8240: ICE, Internal compiler error in expand_call, at calls.c:3049 reichelt
16:19 Re: c++/8701: Internal compiler error in expand_call, at calls.c:3049 reichelt
15:56 Re: optimization/7507: [3.2/3.3 regression] ICE (segfault) with -O2 Wolfgang Bangerth
15:53 Re: c++/8736: internal compile error at a typedef to a typedef in a template sub struct of a template struct from a template function reichelt
15:36 Re: optimization/7507: [3.2/3.3 regression] ICE (segfault) with -O2 Volker Reichelt
13:56 Re: target/8659: trying to delete frame instruction with -fpic Marcus Meissner
12:26 Re: preprocessor/8729: [3.2/3.3 regression] C preprocessor crashes on files with null characters Neil Booth
10:36 c++/8736: internal compile error at a typedef to a typedef in a template sub struct of a template struct from a template function pkolloch
10:26 Re: target/8659: trying to delete frame instruction with -fpic Franz Sirl
09:56 c/8734: -O2 breaks something in 3.2.1 on x86-64 mcihar
09:46 Re: target/8659: trying to delete frame instruction with -fpic Marcus Meissner
09:45 Re: pending/8732: AW: c/7795: linux-2.4.19 kernel failes reichelt
09:22 Re: c/8733: Modulus operator incorrect nathan
09:16 Re: c/8733: Modulus operator incorrect Andrew Pinski
09:06 c/8733: Modulus operator incorrect jsulliva77
09:05 Re: c++/8727: [3.2/3.3 regression] compiler confused by inheritance from an anonymous struct reichelt
08:54 Re: preprocessor/8729: [3.2/3.3 regression] C preprocessor crashes on files with null characters reichelt
08:23 Re: libstdc++/8731: thread mutex initializers bangerth
08:18 Re: c/7795: linux-2.4.19 kernel failes bangerth
08:14 Re: optimization/7507: [3.2/3.3 regression] ICE (segfault) with -O2 reichelt
08:04 Re: c/8068: [3.2/3.3 regression] exceedingly high (infinite) memory usage bangerth
07:58 Re: c/7949: [3.2/3.3 regression] Mishandling of double != 0.0 at -O1 bangerth
07:56 Re: c/7652: -Wswitch-break : Warn if a switch case falls through Andrew Cagney
07:50 Re: c/7895: Bit-field initialization incorrect after padding with :0 bangerth
07:45 Re: c/7872: ICE on legal code, regression from 3.0 and 2.9* bangerth
07:44 Re: c/7871: ICE on legal code, global register variables problems bangerth
07:33 Re: c/7795: linux-2.4.19 kernel failes bangerth
07:31 Re: c/7751: iconv.c:434: Internal compiler error in extract_insn, at recog.c:2148 bangerth
07:26 Re: c/7749: warning: no previous prototype for foobar_func () bangerth
07:25 Re: c/7741: ICE on conflicting types bangerth
07:21 Re: c/7652: -Wswitch-break : Warn if a switch case falls through bangerth
07:14 Re: c/7453: -fverbose-asm causes gcc -S to crash bangerth
07:11 Re: c/7565: GCC 2.95.3 rejects valid input. bangerth
07:03 Re: c/7495: GCC generates crashing code when there is large static array bangerth
07:00 Re: c/7355: ice on array lookup outside function causes GCC segfault bangerth
06:56 Re: libstdc++/8731: thread mutex initializers bangerth
06:21 Re: c/8281: Segfault when compiling for ultrasparc bangerth
05:52 Re: c++/5094: partial specialisation cannot be friend?? lerdsuwa
05:36 Re: c/8281: Segfault when compiling for ultrasparc Christian Ehrhardt
05:06 Re: optimization/8726: GCC 3.2.1 miscompiles Samba 2.2.7 on 32-bit sparc Christian Ehrhardt
04:06 Re: c++/8598: xmmintrin.h broken for c++ Jan Hubicka
02:34 Re: optimization/8725: [3.2/3.3 regression] spurious stack adjustment ebotcazou
02:26 c++/8731: STL problems georg.wild
02:16 c/8730: Cannot compile C function inside other C function ilgis
01:56 Re: libstdc++/8713: template <class charT> bool isspace (charT c,const locale& loc) Leif Lönnblad
01:46 Re: c/6123: sparc-sun-solaris2.7 gcc-3.1 C testsuite failure in verify_local_live_at_start w/-fpic|-fPIC on gcc.dg/20020312-2.c Christian Ehrhardt

November 26, 2002
23:36 preprocessor/8729: C preprocessor crashes on binary ELF files. drey
20:06 Re: c/6123: sparc-sun-solaris2.7 gcc-3.1 C testsuite failure in verify_local_live_at_start w/-fpic|-fPIC on gcc.dg/20020312-2.c Kaveh R. Ghazi
19:43 Re: c++/8612: Vtable layout: missing vcall offset bangerth
19:29 Re: c++/8684: ABI Issue: gcc3.2 is not reusing tail-padding.. bangerth
19:23 Re: c++/8598: xmmintrin.h broken for c++ bangerth
18:46 Re: target/8728: using alloca and -finstrument-functions causes a seg fault on powerpc-apple-darwin6.2 Andrew Pinski
18:36 target/8728: using alloca and -finstrument-functions causes a seg fault on powerpc-apple-darwin6.2 apinski
17:50 Re: pending/8692: A funny game jbuck
17:50 Re: pending/8695: Dancing Beads jbuck
17:46 Re: c++/8699: Illegal usage of 'this' in constructor Joe Buck
17:45 Re: c++/8699: Illegal usage of 'this' in constructor jbuck
17:40 Re: pending/8704: Language jbuck
17:31 Re: pending/8718: Fw:darling jbuck
17:26 c++/8727: compiler confused by inheritance from an anonymous struct jbuck
17:06 optimization/8726: GCC 3.2.1 miscompiles Samba 2.2.7 on 32-bit sparc Paul Eggert
15:47 Re: c++/7780: -Woverloaded-virtual generating false-positives bangerth
15:46 optimization/8725: spurious stack adjustment dann
15:36 Re: c/3190: Re: gcc bug: complaint on %c for strftime Robert Dewar
15:16 Re: c++/7780: -Woverloaded-virtual generating false-positives Wolfgang Bangerth
14:56 Re: c/8721: nmrpsa_problem Wolfgang Bangerth
14:56 Re: c++/7780: -Woverloaded-virtual generating false-positives Wolfgang Bangerth
14:06 Re: c/3190: Re: gcc bug: complaint on %c for strftime Zack Weinberg
13:26 Re: c/3190: Re: gcc bug: complaint on %c for strftime Pavel Roskin
13:16 Re: c/8721: nmrpsa_problem Bosong Xiang
13:06 Re: c/3190: Re: gcc bug: complaint on %c for strftime Neil Booth
13:06 Re: libstdc++/8713: template <class charT> bool isspace (charT c,const locale& loc) Paolo Carlini
13:06 Re: c/3190: Re: gcc bug: complaint on %c for strftime Joseph S. Myers
12:46 preprocessor/8524 neil
12:46 Re: c/3190: Re: gcc bug: complaint on %c for strftime Andries.Brouwer
12:26 Re: c/3190: Re: gcc bug: complaint on %c for strftime Neil Booth
12:16 Re: c++/8724: [3.2/3.3 regression] explicit destructor call for incomplete class allowed bangerth
12:16 c/3190: Re: gcc bug: complaint on %c for strftime Joseph S. Myers
12:07 Re: libstdc++/8713: template <class charT> bool isspace (charT c, const locale& loc) paolo
12:06 c++/8724: G++ 3.2 accepts explicit destructor call for incomplete class eker
11:53 Re: c/8721: nmrpsa_problem bangerth
11:23 Re: c/8722: nmrpsa_problem paolo
11:20 Re: web/8723: gnatsweb bug 7714 should be reopened paolo
11:16 web/8723: gnatsweb bug 7714 should be reopened linux_dr
11:13 Re: optimization/7714: inlining of function with inline assembler causes duplicate assembler lables paolo
11:06 Re: libstdc++/8716: std::string( NULL, 0 ) throws exception alsoon zero length Paolo Carlini
11:06 Re: optimization/7714: inlining of function with inline assemblercauses duplicate assembler lables Loren Osborn
10:46 Re: optimization/7714: inlining of function with inline assemblercauses duplicate assembler lables Loren Osborn
10:36 c/8722: nmrpsa_problem bx22
10:26 c/8721: nmrpsa_problem bx22
10:02 Re: c++/8720: [3.3 regression] ICE with bitwise or (3 operands) bangerth
09:59 Re: c++/8719: cc1plus ICE in emit_move_insn_1: init static template variable bangerth
09:56 Re: c++/8702: [3.3 regression] matching of conversion operators Wolfgang Bangerth
09:56 Re: c/8715: '~' operator for unsigned char and conversion to bool Richard Earnshaw
09:46 c++/8720: Internal compiler error by compilation of OpenOffice.org - bitwise or (3 operands) pmladek
09:46 Re: libstdc++/8707: make distclean fails Phil Edwards
09:36 Re: libstdc++/8707: make distclean fails Karl Berry
09:26 c++/8719: cc1plus ICE in emit_move_insn_1: init static template variable jmichaud
08:56 Re: c++/8702: [3.3 regression] matching of conversion operators Craig Rodrigues
08:37 Re: libstdc++/8716: std::string( NULL, 0 ) throws exception also on zero length pme
08:18 Re: libstdc++/8707: make distclean fails Karl Berry
07:56 Re: c++/3518: default conversion applied too soon Wolfgang Bangerth
07:56 Re: libstdc++/8707: make distclean fails Phil Edwards
07:37 Re: c/7490: [3.2/3.3 regression] ICE with alias definition bangerth
07:33 Re: c/6123: sparc-sun-solaris2.7 gcc-3.1 C testsuite failure in verify_local_live_at_start w/-fpic|-fPIC on gcc.dg/20020312-2.c bangerth
07:30 Re: c/3188: I define bit fields in a long long, union the long long, and print. bangerth
07:21 Re: bootstrap/6792: Fails with ICE when compiling 32 bit version of libstdc++-v3/libsupc++/del_op.cc on Solaris bangerth
06:56 bootstrap/8717: gcc 3.2.1 fails to compile in 64-bit mode under Solaris 8 rhfreeman
05:56 Re: c++/8699: Illegal usage of 'this' in constructor Peter Englmaier
05:56 libstdc++/8716: std::string( NULL, 0 ) throws exception also on zero length x
05:26 c/8715: '~' operator for unsigned char and conversion to bool jozef.kosoru
05:16 Re: c/7490: gcc dumps core when trying to compile the attached code. Christian Ehrhardt
04:26 Re: c/6123: sparc-sun-solaris2.7 gcc-3.1 C testsuite failure in verify_local_live_at_start w/-fpic|-fPIC on gcc.dg/20020312-2.c Christian Ehrhardt
03:46 libstdc++/8713: template <class charT> bool isspace (charT c, const locale& loc) leif.lonnblad
02:56 java/8712: gcj (GCC) 3.2 - ICE at fold-const.c:2934 stoeber
02:26 Re: c/3188: I define bit fields in a long long, union the long long, and print. Christian Ehrhardt
02:26 RE: c++/8701: Internal compiler error in expand_call, at calls.c:3049 Auvray, Luc
01:56 libgcj/8711: abnormal program termination during loop starts CPU overload davit
01:06 bootstrap/8710: make bootstrap fails with error on plural.y on AIX 4.3.3 zvickery

November 25, 2002
22:06 Re: bootstrap/6792: Fails with ICE when compiling 32 bit version of libstdc++-v3/libsupc++/del_op.cc on Solaris Robert Schiele
22:06 java/8709: class init optimization should check subclasses tromey
21:16 libstdc++/8708: __USE_MALLOC doesn't work bkoz
21:06 libstdc++/8707: make distclean fails karl
15:46 Re: bootstrap/6825: [Sun OS 4.1.4] gcc 3.1 fails to build Wolfgang Bangerth
15:36 c++/8706: gcc cannot generate __cdel functions that can be called by Visual C if that function returns >8 byte strucutres by value cheng
15:36 Re: bootstrap/6825: [Sun OS 4.1.4] gcc 3.1 fails to build jason andrade
15:13 Re: bootstrap/8324: redhat linux 7.3 bootstrap failure when building gcc-2.95.2 bangerth
15:09 Re: bootstrap/8418: [x86] Seg fault during make bootstrap bangerth
15:03 Re: bootstrap/8556: Bootstrap error 2 bangerth
14:59 Re: bootstrap/6825: [Sun OS 4.1.4] gcc 3.1 fails to build bangerth
14:56 Re: bootstrap/6796: [True64 5.0A] gcc 3.1: ICE on bootstrap (stage2/xgcc predict.c) bangerth
14:55 Re: bootstrap/6797: gcc 3.1 on Tru64 5.0A: ICE on bootstrap (stage2/xgcc predict.c) bangerth
14:53 Re: bootstrap/6792: Fails with ICE when compiling 32 bit version of libstdc++-v3/libsupc++/del_op.cc on Solaris bangerth
14:46 c/8639 rth
14:42 Re: c/8639: [3.2/3.3 regression] simple integer arithmetic expression broken rth
14:36 Re: c/8015: optimization error Neil Booth
14:16 Re: c/8015: optimization error David Relson
13:16 optimization/8705: Internal compiler error in emit_move_insn_1, at expr.c:3101 psilord
11:54 Re: c++/8701: Internal compiler error in expand_call, at calls.c:3049 bangerth
11:06 c/8639 rth
09:16 RE: c++/8701: Internal compiler error in expand_call, at calls.c:3049 Auvray, Luc
09:15 Re: c++/8702: [3.3 regression] matching of conversion operators bangerth
08:59 Re: c++/8701: Internal compiler error in expand_call, at calls.c:3049 bangerth
08:54 Re: c++/8700: [3.2/3.3 regression] 2nd `ghost' version of operator<< prevents match for temp variable... bangerth
08:48 Re: c++/7682: [HP UX] bug on hp making the gcc dump undefined type info name for a class bangerth
08:46 c++/8702: gcc 3.3: "error: template definition of non-template" rodrigc
07:56 c++/8701: Internal compiler error in expand_call, at calls.c:3049 lauvray
07:17 Re: bootstrap/6967: [x86 x mips-ecoff] build fails - ICE in assemble_integer, at varasm.c:2012 bangerth
07:16 RE: c++/7682: bug on hp making the gcc dump undefined type info name for a class Helmut Haigermoser
07:16 c++/8700: 2nd `ghost' version of operator<< prevents match for temp variable... adelroy
07:04 Re: c/8032: [3.2/3.3 regression] GCC >= 3.0 incorrectly initializes static structs in the presence of flexible arrays ebotcazou
05:56 Re: bootstrap/6967: [x86 x mips-ecoff] build fails - ICE in assemble_integer, at varasm.c:2012 Chris Bainbridge
00:46 c++/8699: Illegal usage of 'this' in constructor ppe
00:26 Re: c++/8691: -O3 and -fno-implicit-templates are incompatible Christoph Ludwig

November 24, 2002
20:26 bootstrap/8698: mips-sgi-irix6.5 bootstrap fail on Iris Indigo hbent
17:24 Re: c++/8696: g++ 3.2 internal compiler error: Segmentation fault reichelt
16:56 Re: c++/8691: -O3 and -fno-implicit-templates are incompatible Volker Reichelt
16:53 Re: c++/8691: [3.2 regression] -O3 and -fno-implicit-templates are incompatible reichelt
16:06 Re: c++/8691: -O3 and -fno-implicit-templates are incompatible Paolo Carlini
15:56 Re: c++/8691: -O3 and -fno-implicit-templates are incompatible Paolo Carlini
15:46 optimization/8697: [IA64] Lost zero-extension schwab
15:37 Re: c/8032: [3.2/3.3 regression] GCC >= 3.0 incorrectly initializes static structs in the presence of flexible arrays reichelt
15:26 c++/8696: g++ 3.2 internal compiler error: Segmentation fault justus
14:33 Re: optimization/6985: GCC-3.x incorrectly initializes local arrays reichelt
14:28 Re: c/7289: wrong code generated for switch statement reichelt
14:22 Re: optimization/8275: [3.2 regression] ICE in simplify_subreg, at simplify-rtx.c:2452 ebotcazou
14:16 optimization/8275 ebotcazou
13:56 Re: optimization/7122: -o2 processed floating point code generates bogus NaN reichelt
13:44 Re: c/7437: Identical unsigned int calculations differ by 1, depending on number of steps in calculation. reichelt
13:30 Re: c++/8691: -O3 and -fno-implicit-templates are incompatible reichelt
12:46 Re: other/8314: m68k-elf/rtems should multilib crt[begin|end].o Mark Mitchell
10:59 Re: bootstrap/3915: [Solaris] library -lgcc: not found bangerth
10:59 Re: bootstrap/3892: [Solaris] ICE in verify_local_live_at_start, at flow.c:4179 bangerth
10:59 Re: bootstrap/3220: ICE in subreg_highpart_offset, at emit-rtl.c:1171 bangerth
10:58 Re: bootstrap/3219: autoheader: No template for symbol `_POSIX_SOURCE' bangerth
10:47 Re: bootstrap/5811: [i386-unknown-freebsd4.5] make compare fails when built with BSD make bangerth
10:46 libstdc++/8694: <string> breaks <ctype.h> on HP-UX 10.20 dimitri
10:16 ada/8693: Declaring access-to-subprogram causes bug box but should generate a compilation error drut_qx
06:06 c++/8691: -O3 and -fno-implicit-templates are incompatible cludwig
04:16 Re: bootstrap/3219, 3220, 3892, 3915 Alexander Klimov
03:50 Re: c++/53: inner template classes as friends? lerdsuwa
03:37 Re: c++/8099: Friend classes and template specializations lerdsuwa
03:35 Re: c++/8099: Friend classes and template specializations lerdsuwa
03:25 Re: c++/8056: Friends and partial specializations lerdsuwa
00:39 Re: c++/7641: [3.2/3.3 regression] friend declaration of nested types doesn't compile lerdsuwa

November 23, 2002
21:36 Re: bootstrap/8686: 3.2.1 bootstrap fails: 32-bit Solaris 9 + Sun patch 112963-01 Paul Eggert
14:26 Re: c++/7825: Internal compiler error with static struct initialisation. Phil Armstrong
14:16 bootstrap/8690: libjava doesn`t build with Cygwin, nt 5.1 kredba
10:06 ada/8689: GNAT 3.15p can not be used as 3.2.1 (others?) boostrap jeff
06:06 c++/8688: ICE with segfault on missing comma in initializer of 2D array V.Haisman
04:49 Re: pending/8673: Re: 6926 gcc-3.1 does not want to install on sparc-sun-solaris paolo
03:28 Re: optimization/8275: [3.2 regression] ICE in simplify_subreg, at simplify-rtx.c:2452 ebotcazou
02:06 Re: bootstrap/5811: [i386-unknown-freebsd4.5] make compare fails when built with Mack Lobell
01:56 bootstrap/8687: libjava doesn't build with BSD make macklobell
01:16 Re: c++/8240: ICE, Internal compiler error in expand_call, atcalls.c:3049 Wolfgang Bangerth
01:16 Re: c++/8240: ICE, Internal compiler error in expand_call, atcalls.c:3049 Wolfgang Bangerth
01:16 Re: c++/8240: ICE, Internal compiler error in expand_call, at calls.c:3049 Joe Buck
00:48 Re: c/8588: [3.2 regression] ICE in extract_insn, at recog.c:2148 ebotcazou
00:46 c/8588 ebotcazou
00:30 Re: c/8518: [3.2 regression] ICE when compiling mplayer ebotcazou
00:26 c/8518 ebotcazou
00:11 Re: c/8439: [3.2 regression] empty struct causes crash ebotcazou
00:06 c/8439 ebotcazou

November 22, 2002
22:36 bootstrap/8686: GCC 3.2.1 bootstrap fails: 32-bit Solaris 9 + Sun patch 112963-01 Paul Eggert
17:16 libgcj/8685: CNI Invocation of Java code from C++ example fails tjmather
16:18 Re: bootstrap/7104: [x86 x sh-elf] [new-regalloc-branch] bootstrap failure for sh-elf target bangerth
16:15 Re: bootstrap/6967: [x86 x mips-ecoff] build fails - ICE in assemble_integer, at varasm.c:2012 bangerth
16:14 Re: bootstrap/6953: [x86 x mips] xgcc fails to compile part of libgcc2 bangerth
16:10 Re: bootstrap/6598: [m88k] configure identifies old/broken gcc as gcc and passes unknown options bangerth
16:08 Re: bootstrap/6593: [m88k] configure fails to recognize single argument gettimeofday() functions bangerth
16:07 Re: optimization/8275: [3.2 regression] ICE in simplify_subreg, at simplify-rtx.c:2452 reichelt
15:46 c++/8684: ABI Issue: gcc3.2 is not reusing tail-padding.. sunil.k.davasam
15:36 middle-end/8683: Small structs returned in registers are incorrectly justified dave.anglin
15:19 Re: optimization/8178: __builtin_ffs broken reichelt
15:16 Re: bootstrap/5811: [i386-unknown-freebsd4.5] make compare fails when builtwith BSD make Mack Lobell
15:12 Re: bootstrap/5811: [i386-unknown-freebsd4.5] make compare fails when built with BSD make bangerth
15:00 Re: bootstrap/6591: [m88k] 2.95.3: genrecog: Internal compiler error in `merge_trees' at gcc/genrecog.c:968 bangerth
14:46 Re: bootstrap/6591: [m88k] 2.95.3: genrecog: Internal compiler error in `merge_trees' at gcc/genrecog.c:968 Sven Dack
14:27 Re: c++/8390: Object layout: empty virtual base allocation failure bangerth
14:01 Re: c++/8374: ?: operator and derived classes bangerth
13:59 Re: c++/8280: friend declaration introduces class name into namespace scope bangerth
13:56 java/8676 tromey
13:50 Re: c++/8045: Missing "unused variable" warning bangerth
13:48 Re: optimization/7687: [3.2 regression] ICE in use_thunk, at cp/method.c:412 reichelt
13:33 Re: optimization/8599: [3.2 regression] loop unroll bug with -march=k6-3 ebotcazou
13:29 Re: c++/8682: gcc crashes compiling this file reichelt
13:26 optimization/8599 ebotcazou
13:23 Re: c/8015: optimization error reichelt
12:46 c++/8682: gcc crashes compiling this file sb
11:36 Re: c++/8214: [3.2/3.3 regression] character conversion problem bangerth
11:26 Re: optimization/8508: GCC 3.2 ICE with aggressive optimization (SSE?) reichelt
11:26 Re: c++/8173: Internal error in g++ on compiling Qt-retated code (PerlQt module) bangerth
11:23 Re: c++/7977: [3.2/3.3 regression] structs in anonymous union bangerth
11:18 Re: c++/7945: initializing a struct having a class component fails bangerth
11:16 Re: c++/7943: Compilation gives many strange errors bangerth
11:05 Re: c++/7916: [3.2/3.3 regression] ICE in instantiate_virtual_register_1 bangerth
10:57 Re: libstdc++/8645: unnecessary non-0 checks in stl_tree.h paolo
10:56 libstdc++/8645 paolo
10:54 Re: c++/7865: internal error on legal code bangerth
10:46 Re: c++/7825: Internal compiler error with static struct initialisation. bangerth
10:26 Re: c++/6794: [3.2 regression] ICE with __attribute__ ((__noreturn__)) Volker Reichelt
10:26 Re: c++/6794: [3.2 regression] ICE with __attribute__ ((__noreturn__)) Volker Reichelt
09:46 c/8681: Generates unneeded test rf13
09:42 Re: c/6815: [3.2 regression] ICE with longjmp if -fprofile-arcs -O is specified reichelt
09:30 Re: c++/7818: protected members still non-reachable from an unbound friend template member function bangerth
09:23 Re: bootstrap/7817: [3.2/3.3 regression] Link to gcc man page in g++ man page incorrect bangerth
09:16 c++/8680: g++ doesn't warn when passing a C++ funcptr instead of extern "C" funcptr apm35
09:10 Re: c/6835: static struct assignment -> gcc internal error reichelt
09:08 Re: c++/7806: Possible fix for c++/7780: -Woverloaded-virtual generating bangerth
09:07 Re: optimization/7714: inlining of function with inline assembler causes duplicate assembler lables bangerth
09:06 Re: java/1455: gcjh barfs on legal java name usage Bosscher Steven Civ USAFA/DFAN
08:56 java/8676 tromey
08:55 Re: optimization/6840: ICE when compiling floating-point code reichelt
08:47 Re: c/6898: gcc produces incorrect minimization code reichelt
08:36 c/8679: gcc3.2 gmake fails on configure libstdc++: xgcc doesn't work donna
08:19 Re: c++/8678: c++ bangerth
08:17 Re: c/6917: optimization problem in gcc 3.1 reichelt
08:16 c++/8678: c++ Norman Ulbrich
08:03 Re: c/6939: taking sizeof array parameter should trigger a warning reichelt
07:42 Re: c++/7536: C++ front end does not warn of promotion of negative ints to unsigneds bangerth
07:26 other/8677: "gcc -v" should report options used for bootstrap nirkko
07:16 Re: c++/7503: (x < Y ? X : Y) as an lvalue and assignment Wolfgang Bangerth
07:09 Re: bootstrap/5888: [sun solaris 2.6] Bootstrap stage 2/3 comparison failure gcc-3.0.4 bangerth
05:43 Re: libstdc++/8645: unnecessary non-0 checks in stl_tree.h paolo
05:41 Re: target/8340: [3.3 regression] ICE on x86 inline asm w/ -fPIC ebotcazou
05:11 Re: libstdc++/8645: unnecessary non-0 checks in stl_tree.h paolo
02:26 Re: bootstrap/3867: [djgpp] eh_frame optimization check inconfigure is broken Tim Van Holder

November 21, 2002
21:06 java/8676: ICE in generate_bytecode_conditional at jcf-write.c:1359 jmr
19:36 Re: c++/7536: C++ front end does not warn of promotion of negative ints to unsigneds Gabriel Dos Reis
19:06 Re: c++/7536: C++ front end does not warn of promotion of negativeints to unsigneds Wolfgang Bangerth
18:56 Re: c++/7780: -Woverloaded-virtual generating false-positives bangerth
18:51 Re: c++/7774: [3.2 regression] C++ Template partial specialization broken with function types bangerth
18:47 Re: c++/7765: Problems with french translation bangerth
18:46 Re: c++/7536: C++ front end does not warn of promotion of negative ints to unsigneds Gabriel Dos Reis
18:45 Re: c++/7740: g++ 3.2 compiles routines marked as extern "C++" with incorrect "C" linkage bangerth
18:41 Re: c++/7682: bug on hp making the gcc dump undefined type info name for a class bangerth
18:34 Re: c++/7666: Rejects a(b&c) and looks for a(b c) bangerth
18:17 Re: c++/7641: friend declaration of nested types doesn't compile bangerth
18:16 Re: c++/7536: C++ front end does not warn of promotion of negativeints to unsigneds Wolfgang Bangerth
18:06 Re: c++/7536: C++ front end does not warn of promotion of negative ints to unsigneds Gabriel Dos Reis
18:04 Re: bootstrap/7610: [linux x86] ICE after bootstrap while compiling libstdc++/libsupc++ using -g1 bangerth
17:58 Re: debug/7580: incorrect/unfortunate DWARF-2 info for static const int class members bangerth
17:52 Re: c++/7536: C++ front end does not warn of promotion of negative ints to unsigneds bangerth
17:48 Re: c++/7503: (x < Y ? X : Y) as an lvalue and assignment bangerth
17:35 Re: c++/7395: namespace qualification in friend causes later semantic failure bangerth
17:33 Re: c++/7362: ICE with attributed packed and function local structs bangerth
17:31 Re: c++/7319: misleading template in error message bangerth
17:25 Re: c++/7046: #pragma pack(1) context evaluated at point of instantiation rather than declaration bangerth
17:20 Re: c++/6992: [3.2/3.3 regression?] GCC-3.1.x - attribute 'section' broken for constructors bangerth
17:16 Re: c++/8662: [3.2 regression] illegal access of private member ofunnamed class Joe Buck
17:06 Re: c++/5934: File compiles under Linux, but not under Solaris bangerth
14:50 Re: libgcj/1362: libffi fails on sparc-sun-solaris2.7 bangerth
14:46 Re: libgcj/1362: libffi fails on sparc-sun-solaris2.7 Jeff Sturm
14:44 Re: optimization/8585: Linux-x86 optimization bug when using floor and log reichelt
14:26 Re: libgcj/1362: libffi fails on sparc-sun-solaris2.7 Bosscher Steven Civ USAFA/DFAN
14:01 Re: c++/8665: explicit specialization of the member class template of a class template reichelt
13:51 Re: c++/8342: [3.3 regression] g++.jason/pmf7.C fails on i586-pc-linux-gnu ebotcazou
13:46 Re: bootstrap/8657: No rule to make target `bootstrap' in directory 'gcc' Neil Booth
13:46 Re: c++/8047: [i386] Stack corruption with exceptions Danny Smith
13:46 c++/8342 ebotcazou
13:26 c++/8675: 30% slower code using gcc3.2 vs. gcc3.0.1 pfr+gcc
13:06 Re: java/1378: Only one result with Helloworld program under cygwin and W98 Bosscher Steven Civ USAFA/DFAN
12:56 Re: java/1374: gcj -C diverges from javac Bosscher Steven Civ USAFA/DFAN
12:26 Re: java/1111: Order matters for inline candidates Bosscher Steven Civ USAFA/DFAN
11:11 Re: c++/8674: [3.3 regression] ICE in cp_expr_size, at cp/cp-lang.c:307 bangerth
11:06 Re: bootstrap/2718: in zlib: configure: error: can not find install-sh or install.sh in .. ./.. bangerth
11:06 Re: bootstrap/2718: in zlib: configure: error: can not find install-shor install.sh in .. ./.. Peter Katzmann
10:56 c++/8674: Internal compiler error with the OpenOffice.org sources pmladek
10:06 Re: libstdc++/8670: Alignment problem in std::basic_string Martin Sebor
09:26 Re: c++/8672: Access to private bases denied bangerth
09:00 Re: c++/8663: [3.3 regression] ICE in cp_expr_size, at cp/cp-lang.c:307 reichelt
08:46 c++/8672: Access to private bases denied struppi
07:41 Re: c++/8664: gcc 3.2 ICE when compiling ddd paolo
07:18 Re: optimization/8671: gcc version 2.95.3 passing parameters bug bangerth
07:10 Re: c++/8035: optimizing access to a const member causes illegal code to be generated sirl
07:05 Re: optimization/2903: [arm] Optimization bug with long long arithmetic rearnsha
07:03 Re: bootstrap/8657: No rule to make target `bootstrap' in directory 'gcc' bangerth
06:57 Re: bootstrap/5917: [hpux 11.0 64bit] Building gcc-3.0.4 (bootstrap) using gcc-3.0.2/64 and binutils-2.12 fails bangerth
06:56 optimization/8671: gcc version 2.95.3 passing parameters bug _hristo_
06:56 optimization/2903 rearnsha
06:55 Re: bootstrap/3867: [djgpp] eh_frame optimization check in configure is broken bangerth
06:53 Re: bootstrap/6218: [alpha osf1 4.0] Build hangs bangerth
06:52 Re: bootstrap/6173: [mn10200-elf] does not build libgcc:_floatdidf.o hp
06:51 Re: bootstrap/6560: [vax ultrix4.3] Compiler fails to build bangerth
06:44 Re: bootstrap/4269: [sparc-unknown-netbsdeld1.5] HAVE_NL_LANGINFO doesn't ensure that CODESET is available bangerth
06:41 Re: c++/8035: optimizing access to a const member causes illegal code to be generated on powerpc reichelt
06:36 libstdc++/8670: Alignment problem in std::basic_string jkanze
06:26 bootstrap/8669: ICE lookup_base_r, at cp/search.c:283 ask
06:25 Re: optimization/8599: [3.2 regression] loop unroll bug with -march=k6-3 ebotcazou
06:17 Re: bootstrap/6172: [fr30-elf] does not build hp
06:16 RE: c++/8035: optimizing access to a const member causes illegal code to be generated on powerpc Rob Taylor
06:07 Re: bootstrap/4198: [sparclite-elf] does not build, needs tweaking for crtstuff.c changes hp
05:37 Re: c++/8035: optimizing access to a const member causes illegal code to be generated on powerpc sirl
05:22 Re: c++/8667: ICE 19970302 on trivial code paolo
05:18 Re: target/8659: trying to delete frame instruction with -fpic sirl
04:33 Re: libstdc++/8636: ostringstreams lose their data paolo
04:17 Re: c++/8666: ICE 19970302 on trivial code paolo
04:17 Re: c++/8668: ICE 19970302 on trivial code paolo
04:16 Re: libstdc++/8636: ostringstreams lose their data Paolo Carlini
04:16 Re: libstdc++/8636: global ostringstreams lose their data Michael Pronath
04:06 c++/8668: ICE 19970302 on trivial code massimo.bombino
04:06 c++/8667: ICE 19970302 on trivial code massimo.bombino
04:06 c++/8666: ICE 19970302 on trivial code massimo.bombino
03:47 Re: libstdc++/6047: weird behaviour when reading from a pipe through an ifstream paolo
03:36 Re: bootstrap/4269: [sparc-unknown-netbsdeld1.5] HAVE_NL_LANGINFO doesn't ensure that CODESET is available Adrian Bunk
03:08 Re: libstdc++/8636: ostringstreams lose their data paolo
02:56 Re: libstdc++/8636: global ostringstreams lose their data Paolo Carlini
02:03 Re: optimization/2903: [arm] Optimization bug with long long arithmetic rearnsha
01:36 c++/8665: explicit specialization of the member class template of a class template jozef.kosoru
00:16 Re: bootstrap/5917: [hpux 11.0 64bit] Building gcc-3.0.4 (bootstrap) using gcc-3.0.2/64 and binutils-2.12 fails H.Merijn Brand
00:16 Re: bootstrap/8657: No rule to make target `bootstrap' in directory 'gcc' Andris Pavenis
00:06 Re: bootstrap/3867: [djgpp] eh_frame optimization check inconfigure is broken Tim Van Holder

November 20, 2002
23:51 Re: c++/8664: gcc 3.2 ICE when compiling ddd paolo
23:49 Re: libstdc++/8652: wstring::c_str() not work paolo
23:36 Re: bootstrap/8657: No rule to make target `bootstrap' in directory'gcc' Zack Weinberg
23:03 Re: pending/8653: RE: [PATCH] Fix PR 8639 (3.2.1 material) neil
23:03 Re: pending/8650: II Congreso Internacional de Telemática, CITEL 2002 neil
23:03 Re: pending/8651: II Congreso Internacional de Telemática, CITEL 2002 neil
22:56 Re: bootstrap/8657: No rule to make target `bootstrap' in directory 'gcc' Neil Booth
22:36 Re: bootstrap/8657: No rule to make target `bootstrap' in directory'gcc' Zack Weinberg
22:06 Re: bootstrap/6218: [alpha osf1 4.0] Build hangs Michael Richards
21:56 Re: bootstrap/8657: No rule to make target `bootstrap' in directory 'gcc' Rolf-Alois Walter
20:46 c++/8664: gcc 3.2 ICE when compiling ddd nall
19:09 Re: target/491: [ARM; 2.95] unrecognizable insn with -march=armv4 bangerth
19:06 Re: bootstrap/6225: [x86 x sh-elf] reload1.c failure bangerth
19:05 Re: c/4552: case statement "without range" causes gcc to quickly eat all memory bangerth
19:03 Re: target/4516: [SH] sh-unknown-linux-gnu: big jump table bangerth
19:01 Re: libstdc++/4455: [HP-UX] libstdc++.sl depends on libgcc.a bangerth
18:59 Re: c++/4408: apparent namespace collision with global variable 'count' bangerth
18:58 Re: c++/4094: LHS conditional in assignment in gcc/cp/decl.c bangerth
18:56 Re: c/3982: Incorrect Initialization in shared objects on Solaris 2.7 bangerth
18:56 Re: bootstrap/6225: [x86 x sh-elf] reload1.c failure tm
18:53 Re: target/3947: [MIPS] MIPS multiple inheritance - thunk causes two destructor calls bangerth
18:50 Re: middle-end/3919: __builtin_constant_p false on long long compile-time-known variable converted to long on 32-bit platform bangerth
18:49 Re: c/3773: Comparision with string literal bangerth
18:47 Re: other/3692: gcc-3.0: error in startup code. crtbegin.o? bangerth
18:45 Re: other/3486: After build problem bangerth
18:45 Re: other/3340: Build 3.0 on Linux-glibc1 fails: wrong include for syscall.h bangerth
18:44 Re: c++/3206: missing when mangling name for ofsteram constructor bangerth
18:43 Re: optimization/2903: [arm] Optimization bug with long long arithmetic bangerth
18:38 Re: target/2853: gcc-3.0 generates incorrect code for std::strchr() for i586-pc-msdosdjgp bangerth
18:37 Re: java/2791: Bogus "class `foo' already defined ..." error from jc1 bangerth
18:35 Re: other/2506: Solaris 7: `__builtin_va_alist' undeclared by <stdarg.h> in gcc 2.95.3 bangerth
18:34 Re: c++/2447: g++ don't handle execption when using with -fomit-frame-pointer bangerth
18:21 Re: bootstrap/6591: [m88k] 2.95.3: genrecog: Internal compiler error in `merge_trees' at gcc/genrecog.c:968 bangerth
18:20 Re: bootstrap/6583: [cygwin] make bootstrap failed in building libgcj bangerth
18:19 Re: bootstrap/6563: error building a cross compiler bangerth
18:18 Re: bootstrap/6560: [vax ultrix4.3] Compiler fails to build bangerth
18:16 Re: bootstrap/6541: [sparc solaris8] ../../../libjava/java/net/natInetAddress.cc:338: `MAXHOSTNAMELEN' undeclared bangerth
18:15 Re: bootstrap/6447: [sparc solaris8] Build of gcc 3.0.3 failing bangerth
18:14 Re: bootstrap/6444: [x86 x fr30-elf] does not build simple test case -- follow-on to #6172 bangerth
18:12 Re: bootstrap/6400: [freebsd] problem compiling gcc/crtstuff.c during bootstrap bangerth
18:10 Re: bootstrap/6274: [linux x86] 'make bootstrap' fails bangerth
18:09 Re: bootstrap/6250: [alpha osf1 5.0] gcc 3.0.4 build fails bangerth
18:08 Re: bootstrap/6225: [x86 x sh-elf] reload1.c failure bangerth
18:07 Re: bootstrap/6218: [alpha osf1 4.0] Build hangs bangerth
18:06 Re: bootstrap/6207: [alpha osf1 5.0] 'make bootstrap' fails when building libstdc++-v3 bangerth
18:05 Re: bootstrap/6186: [i86 x sh-elf] Bootstrap failure bangerth
18:04 Re: bootstrap/6173: [mn10200-elf] does not build libgcc:_floatdidf.o bangerth
18:03 Re: bootstrap/6172: [fr30-elf] does not build libgcc:_addsub_df.o bangerth
18:02 Re: bootstrap/6136: [sun solaris2.8] eh_alloc.cc:81: excess elements in aggregate bangerth
18:02 Re: bootstrap/6046: [linux x86] GCC 3.0.4 fails to bootstrap: undefined reference to 'L505' bangerth
18:01 Re: bootstrap/5980: [mac osx] extract_insn fails during compilation of unwind-dw2.c bangerth
18:00 Re: bootstrap/5945: [sgi irix64] Stage 1 compiler fails during bootstrap bangerth
17:58 Re: bootstrap/5917: [hpux 11.0 64bit] Building gcc-3.0.4 (bootstrap) using gcc-3.0.2/64 and binutils-2.12 fails bangerth
17:57 Re: bootstrap/5888: [sun solaris 2.6] Bootstrap stage 2/3 comparison failure gcc-3.0.4 bangerth
17:56 Re: bootstrap/5870: [alpha osf1 5.0] gcc-20020304 bootstrap fails with fatal internal compiler error in tmp-dum.c bangerth
17:55 Re: bootstrap/5868: [sgi irix] gcc-20020304 bootstrap fails because of a bad loader switch bangerth
17:53 Re: bootstrap/5867: [mac osx] gcc-20020304 bootstrap fails bangerth
17:52 Re: bootstrap/5864: [linux-alpha] gcc-20020304 build reports fatal Java compiler error for libjava/java/lang/Character.java bangerth
17:51 Re: bootstrap/5811: [i386-unknown-freebsd4.5] make compare fails when built with BSD make bangerth
14:47 Re: c++/8648: gcc -v -save-temps piece.ii bangerth
14:46 c++/8663: ICE in cp_expr_size, at cp/cp-lang.c:307 deller
13:56 Re: c++/8648: gcc -v -save-temps piece.ii Hermann Kleier
13:56 Re: bootstrap/8657: No rule to make target `bootstrap' in directory'gcc' Zack Weinberg
13:27 Re: libstdc++/6745: Sever io problems on branch rdbuf paolo
12:42 Re: libstdc++/8637: istream& get (char* s, streamsize n, char delim ) does not work paolo
12:08 Re: libstdc++/8655: Problematic behaviour of std::ends paolo
11:47 Re: c++/8662: [3.2 regression] illegal access of private member of unnamed class reichelt
11:46 c++/8662: [3.2 regression] illegal access of private member of unnamed class reichelt
11:36 c/8661: GCC 3.2 don't produces builtin code for __builtin_alloca bkausbk
11:26 Re: bootstrap/8657: No rule to make target `bootstrap' in directory 'gcc' Neil Booth
11:05 Re: c++/8660: template overloading ICE in tsubst_expr, at cp/pt.c:7644 bangerth
10:46 c++/8660: template overloading ICE in tsubst_expr, at cp/pt.c:7644 martin.dorey
09:36 Re: bootstrap/1987: GCC 2.95.2 fails to build under Interix 2.2 Wolfgang Bangerth
09:26 Re: bootstrap/1987: GCC 2.95.2 fails to build under Interix 2.2 Bo Najdrovsky
09:26 Re: bootstrap/3776: [sh-hms] Can't build for sh-hms Rob Savoye
09:25 Re: bootstrap/1987: [Interix 2.2] GCC 2.95.2 fails to build bangerth
09:23 Re: bootstrap/3776: [sh-hms] Can't build for sh-hms bangerth
08:46 Re: libstdc++/8655: Problematic behaviour of std::ends Wolfgang Bangerth
08:06 Re: libstdc++/8655: Problematic behaviour of std::ends Ioannis Papadopoulos
07:37 Re: bootstrap/5070: [powerpc-darwin] parsing gcc-**/gcc/builtin-attr.def Arnaud Blondel
07:31 Re: bootstrap/5070: [powerpc-darwin] parsing gcc-**/gcc/builtin-attr.def bangerth
07:22 Re: bootstrap/8657: No rule to make target `bootstrap' in directory 'gcc' bangerth
07:19 Re: bootstrap/5114: [linux-x86] No rule to make target `gnu/gcj/runtime/StringBuffer.java' bangerth
07:03 Re: bootstrap/8657: No rule to make target `bootstrap' in directory 'gcc' reichelt
07:02 Re: bootstrap/3799: [fr30-elf] fails to build on 3.0-CVS bangerth
07:00 Re: bootstrap/5102: [linux-x86] Bootsrap failure in libobjc with -finline-functions bangerth
07:00 Re: bootstrap/4386: Parallel build failure in libstdc++-v3 with gthr-*.h bangerth
06:59 Re: bootstrap/5112: [IA64] gcc-ss-20011210, ia64-linux, CFLAGS="-O2 -g" does not build bangerth
06:56 target/8659: trying to delete frame instruction with -fpic meissner
05:57 Re: libstdc++/8655: Problematic behaviour of std::ends reichelt
05:26 Re: other/8658: Cannot install gcc 3.2 on sparc-sun-solaris2.8 'David Scott Urban
05:16 other/8658: Cannot install gcc 3.2 on sparc-sun-solaris2.8 urban
05:07 Re: libstdc++/8655: Problematic behaviour of std::ends paolo
05:06 Re: libstdc++/8655: Problematic behaviour of std::ends Ioannis Papadopoulos
05:06 Re: bootstrap/3799: [fr30-elf] fails to build on 3.0-CVS Joel Sherrill
04:50 Re: libstdc++/8655: Problematic behaviour of std::ends paolo
04:48 Re: libstdc++/8636: global ostringstreams lose their data paolo
04:46 bootstrap/8657: No rule to make target `bootstrap' in directory 'gcc' rolf-alois.walter
04:39 Re: libstdc++/8652: wstring::c_str() not work paolo
03:21 Re: c/7622: [3.2 regression] tree inliner fallout (regression relative to 2.95) ebotcazou
03:06 c++/8656: Unable to assign function with __attribute__ and pointer return type to an appropriate variable rmathew
02:47 libstdc++/8655: Problematic behaviour of std::ends Ioannis.Papadopoulos
02:46 c/8518 ebotcazou
01:36 Re: bootstrap/5114: [linux-x86] No rule to make target `gnu/gcj/runtime/StringBuffer.java' Georg Wild
01:26 c/8654: ICE in reload_cse_simplify_operands uros
00:06 Re: bootstrap/5102: [linux-x86] Bootsrap failure in libobjc with-finline-functions Gwenole Beauchesne

November 19, 2002
19:06 libstdc++/8652: wstring::c_str() not work ejoy
18:56 Re: bootstrap/5112: [IA64] gcc-ss-20011210, ia64-linux, CFLAGS="-O2 -g" does not build Randolph Chung
18:41 Re: bootstrap/5536: CFLAGS not propagated to libgcc Makefile bangerth
18:39 Re: bootstrap/5139: [sgi-irix6.5] bootstrap crashes build gcc/gcc/libgcc2.c bangerth
18:38 Re: bootstrap/5114: [linux-x86] No rule to make target `gnu/gcj/runtime/StringBuffer.java' bangerth
18:37 Re: bootstrap/5102: [linux-x86] Bootsrap failure in libobjc with -finline-functions bangerth
18:36 Re: bootstrap/5070: [powerpc-darwin] parsing gcc-**/gcc/builtin-attr.def bangerth
18:34 Re: target/4936: [linux-C3] Failure during genattr, possibly because of proc chip.. bangerth
18:32 Re: bootstrap/4834: making gcc as cross-compiler for i586-pc-msdosdjgpp fails bangerth
18:31 Re: bootstrap/4779: [linux-x86]src/ffitest.o missing bangerth
18:29 Re: bootstrap/4644: [alphaev56-dec-osf5.0] stage2 g++ internal compiler error (#536854048) bangerth
18:28 Re: bootstrap/4610: [alpha-dec-osf4.0d] CC and gcc fail with OOM compiling combine.c on OSF1 (DEC Unix) bangerth
18:27 Re: bootstrap/4386: Parallel build failure in libstdc++-v3 with gthr-*.h bangerth
18:25 Re: bootstrap/4269: [sparc-unknown-netbsdeld1.5] HAVE_NL_LANGINFO doesn't ensure that CODESET is available bangerth
18:24 Re: bootstrap/4198: [sparclite-elf] does not build, needs tweaking for crtstuff.c changes bangerth
18:18 Re: bootstrap/3915: [Solaris] library -lgcc: not found bangerth
18:17 Re: bootstrap/3892: [Solaris] ICE in verify_local_live_at_start, at flow.c:4179 bangerth
18:16 Re: bootstrap/3758: GCC-3.0 doesn't build under cygwin / Bad diagnosticreporting Wolfgang Bangerth
18:16 Re: bootstrap/3758: GCC-3.0 doesn't build under cygwin / Baddiagnostic reporting David Abrahams
18:15 Re: bootstrap/3867: [djgpp] eh_frame optimization check in configure is broken bangerth
18:12 Re: bootstrap/3776: [sh-hms] Can't build for sh-hms bangerth
18:12 Re: bootstrap/3675: [linux-x-cygwin] gcc-3.0 fails to build cross-compiler bangerth
18:08 Re: bootstrap/3758: GCC-3.0 doesn't build under cygwin / Bad diagnostic reporting bangerth
18:06 Re: bootstrap/5779: [Solaris] ../../gcc/libgcc2.c:1173: Internal compiler error in extract_insn, at recog.c:2130 bangerth
18:06 Re: bootstrap/5112: [IA64] gcc-ss-20011210, ia64-linux, CFLAGS="-O2 -g" does not build bangerth
18:05 Re: bootstrap/4634: Internal compiler error when compiling gcc-3.0 for m68k bangerth
18:04 Re: bootstrap/3801: mn10200-elf fails to build on 3.0-CVS bangerth
18:03 Re: bootstrap/3799: [fr30-elf] fails to build on 3.0-CVS bangerth
18:02 Re: bootstrap/3758: GCC-3.0 doesn't build under cygwin / Bad diagnostic reporting bangerth
16:10 Re: pending/8649: [PATCH] Fix PR 8639 (3.2.1 material) bangerth
16:09 Re: middle-end/8611: Internal compiler error reichelt
16:01 Re: bootstrap/3374: Bootstrap failure with -O -fomit-frame-pointer bangerth
15:56 Re: bootstrap/4068: [linux-x86] bootstrapping on libc5 systems Joseph S. Myers
15:48 Re: bootstrap/3355: [alphaev6-dec-osf5.0] Build of gcc3.0 fails bangerth
15:46 RE: bootstrap/3355: Build of gcc3.0 fails Paul.Jackway
15:41 Re: bootstrap/4068: [linux-x86] bootstrapping on libc5 systems bangerth
15:26 fortran/8587 toon
15:26 fortran/8587 toon
15:26 fortran/8587 toon
15:25 Re: fortran/8587: (double complex zero)**(double prec number) = NAN instead of zero toon
15:10 Re: c++/8648: gcc -v -save-temps piece.ii bangerth
15:07 Re: bootstrap/3380: [LinuxPPC] bootstrap comparison failed on java/parse.o bangerth
14:46 c++/8648: gcc -v -save-temps piece.ii Hermann
14:36 Re: bootstrap/2236: config.if (gcc 2.95.2, possibly others) pukesif it can't find gl*bc Joseph S. Myers
14:36 RE: other/864: --program-suffix is ignored Bosscher Steven Civ USAFA/DFAN
14:36 Re: bootstrap/4068: bootstrap fails on older Linux (Red Hat 5.2) Joseph S. Myers
14:16 Re: other/864: --program-suffix is ignored Joseph S. Myers
14:06 Re: c/8605: <integer>-1 evaluates wrong or causes compiler error (attachment) - Problem solved Flemming Esbensen
13:36 Re: bootstrap/3380: [LinuxPPC] bootstrap comparison failed on java/parse.o Andrew Klein
13:36 Re: bootstrap/3374: Bootstrap failure with -O -fomit-frame-pointer Laurynas Biveinis
13:26 c/8647: ICE in GNU99 mode Nr. #2 bkausbk
13:26 c/8646: ICE in GNU99 mode bkausbk
13:26 Re: bootstrap/2378: gcc fails bootstrap with error 139 on s- Dan Chester
13:25 Re: fortran/8445: optimizer bug? toon
12:46 Re: bootstrap/3587: [arc-elf] GCC 3.0-CVS multilib problem Joel Sherrill
12:46 <offlist> Re: bootstrap/3590: [m32r-elf] GCC 3.0-CVS bad assembly Joel Sherrill
12:46 Re: bootstrap/3591: [mcore-elf] GCC 3.0-CVS configuration problem Joel Sherrill
12:46 Re: bootstrap/3592: [mn10200-elf] GCC 3.0-CVS ICE Joel Sherrill
12:46 Re: bootstrap/3591: [mcore-elf] GCC 3.0-CVS configuration problem Joel Sherrill
12:46 Re: bootstrap/3587: [arc-elf] GCC 3.0-CVS multilib problem Joel Sherrill
12:44 Re: bootstrap/3592: [mn10200-elf] GCC 3.0-CVS ICE bangerth
12:40 Re: bootstrap/3591: [mcore-elf] GCC 3.0-CVS configuration problem bangerth
12:38 Re: bootstrap/3587: [arc-elf] GCC 3.0-CVS multilib problem bangerth
12:36 Re: bootstrap/3367: [m68k-coff] fails to compile on gcc 3.0 CVS branch Joel Sherrill
12:36 libstdc++/8645: unnecessary non-0 checks in stl_tree.h erseklaszlo
12:36 Re: bootstrap/3372: v850-elf fails to compile on gcc 3.0 CVS branch Joel Sherrill
12:35 Re: bootstrap/3367: [m68k-coff] fails to compile on gcc 3.0 CVS branch bangerth
12:33 Re: bootstrap/3592: [mn10200-elf] GCC 3.0-CVS ICE bangerth
12:32 Re: bootstrap/3591: [mcore-elf] GCC 3.0-CVS configuration problem bangerth
12:31 Re: bootstrap/3590: [m32r-elf] GCC 3.0-CVS bad assembly bangerth
12:30 Re: bootstrap/3587: [arc-elf] GCC 3.0-CVS multilib problem bangerth
12:29 Re: bootstrap/3372: v850-elf fails to compile on gcc 3.0 CVS branch bangerth
12:28 Re: bootstrap/3364: [a29k-coff] fails to compile on gcc 3.0 CVS branch bangerth
12:26 Re: bootstrap/3364: [a29k-coff] fails to compile on gcc 3.0 CVS branch Joel Sherrill
12:25 Re: bootstrap/3437: [vxworks] cross-compile problem because of fixincludes bangerth
12:23 Re: bootstrap/3412: [i586-pc-sco3.2] -mcoff in CRTSTUFF_T_CFLAGS_S bangerth
12:21 Re: bootstrap/3382: couldn't build compiler collection bangerth
12:20 Re: bootstrap/3380: [LinuxPPC] bootstrap comparison failed on java/parse.o bangerth
12:19 Re: bootstrap/3375: [sparc-sun-solaris2.7] gcc-3.0 fails to compile on Solaris 2.7 bangerth
12:17 Re: bootstrap/3374: Bootstrap failure with -O -fomit-frame-pointer bangerth
12:16 Re: bootstrap/3372: v850-elf fails to compile on gcc 3.0 CVS branch bangerth
12:16 c/8588 ebotcazou
12:15 Re: bootstrap/3367: [m68k-coff] fails to compile on gcc 3.0 CVS branch bangerth
12:15 Re: bootstrap/3364: [a29k-coff] fails to compile on gcc 3.0 CVS branch bangerth
12:06 Re: bootstrap/2236: config.if (gcc 2.95.2, possibly others) pukesif it can't find gl*bc Wolfgang Bangerth
12:06 Re: bootstrap/2236: config.if (gcc 2.95.2, possibly others) pukesif it can't find gl*bc Wolfgang Bangerth
11:58 Re: bootstrap/2236: config.if (gcc 2.95.2, possibly others) pukes if it can't find gl*bc bangerth

November 11, 2002
09:50 Re: libstdc++/8529: wontcompile copy() of map to ostream_iterator bangerth
09:50 Re: ada/7337: ICE in reg-stack.de / a-flteio.ads fw
09:48 Re: ada/6983: ada compiler missing after gcc build fw
09:47 Re: bootstrap/8527: gcc 3.2 compilation on solaris 2.7 bangerth
09:45 Re: c++/8526: parsing error bangerth
09:43 Re: ada/8223: problem building the GtkAda library with GCC 3.1 fw
09:43 Re: ada/8177: GNAT BUG DETECTED compiling GtkAda on FreeBSD 4.7 rc2 fw
09:42 Re: ada/8358: Ada accesses freed memory fw
09:39 Re: ada/8088: Internal error in GCC 3.2 ada compiler fw
09:36 libstdc++/8529: wontcompile copy() of map to ostream_iterator j.tevessen
09:36 Re: ada/8368: PR's 8223, 8177, 8088, 6452, 5679, Gtk-Ada fails withGigi unknown error Florian Weimer
09:35 Re: ada/8519: Internal compiler error fw
09:16 target/8528: Internal compiler error in extract_insn, at recog.c:2148 kisch
08:56 other/8527: gcc 3.2 compilation on solaris 2.7 asthana
07:56 Re: target/8520: -mips64 not forcing -mgp64 under mips*-*-linux* target Daniel Jacobowitz
07:46 c++/8526: parsing error jozef.kosoru
04:46 c++/7788 nathan
04:46 c++/7788 nathan
04:16 Re: c++/8500: Allows cast to private base class Gabriel Dos Reis
03:53 Re: c++/8523: gcc 3.2 hang after parse error (C++) reichelt
03:46 Re: c++/8522: GCC 3.2: g++ ICE on possibly illegal template class forward declaration reichelt
01:16 Re: optimization/8525: cmov instruction used with i686 Devin Bayer
01:09 Re: optimization/8525: cmov instruction used with i686 paolo
00:34 Re: optimization/8525: cmov instruction used with i686 paolo

November 10, 2002
22:56 optimization/8525: cmov instruction used with i686 gcc
22:46 preprocessor/4890 neil
22:44 Re: preprocessor/8524: _Pragma within macros is improperly expanded neil
22:38 Re: preprocessor/4890: inconsistent int-to-pointer warning neil
22:36 preprocessor/8524: _Pragma within macros is improperly expanded Matthias Klose
22:03 Re: other/8314: m68k-elf/rtems should multilib crt[begin|end].o mmitchel
21:56 c++/8523: gcc 3.2 hang after parse error peter.karl.mueller
21:56 c++/8522: GCC 3.2: g++ ICE on possibly illegal template class forward declaration peter.karl.mueller
21:56 Re: libstdc++/7942: ostream core dump with hex/internal/showbaseformatted output Bill Clarke
21:46 c/8439 mmitchel
21:00 NewImage GYTang
18:36 Re: c/8467: Bug in sibling call optimization Mark Mitchell
16:16 bootstrap/8521: [3.4-bib] Bootstrap failure on irix6.5 - .gpword expression references global symbol David.Billinghurst
14:56 target/8520: -mips64 not forcing -mgp64 under mips*-*-linux* target jbr
14:16 Re: c++/1687: Extreme compile time regression from 2.95.2 Zack Weinberg
14:06 ada/8519: Internal compiler error thlsmith
13:59 Re: c++/1980: Error assigning const array bangerth
13:56 Re: c++/1924: [parser]compiler fails to parse valid (I think) construct bangerth
13:56 Re: c++/1687: Extreme compile time regression from 2.95.2 Wolfgang Bangerth
13:26 java/7830 jakub
13:16 Re: c++/1056: spurious warning on implicit conversion followed bypromotion and comparison Wolfgang Bangerth
13:16 Re: c++/8511: (hopefully) reproducible cc1plus SIGSEGV. Volker Reichelt
13:06 Re: c++/924: -Wuninitialized does not seem to warn on uninitializeclass members. Wolfgang Bangerth
12:59 Re: c++/984: GCC cannot efficently initialize a big array bangerth
12:56 Re: c++/924: -Wuninitialized does not seem to warn on uninitialize class members. Neil Booth
12:46 Re: c++/8511: (hopefully) reproducible cc1plus SIGSEGV. Zack Weinberg
12:46 Re: c++/950: Template lookup problem Wolfgang Bangerth
12:29 Re: c++/924: -Wuninitialized does not seem to warn on uninitialize class members. bangerth
12:26 Re: c++/880: Return type of type operator is not equivalent to return type of member function. bangerth
12:16 c/8518: Segmentation fault in gcc when compiling mplayer klaas.decanniere
12:06 Re: c++/689: this warning is not helpful: `class xxxx' only definesa private destructor and has no friend Wolfgang Bangerth
11:46 Re: target/605: [Solaris] '-Y' option broken Wolfgang Bangerth
11:26 Re: c++/99: Bug in type in error message. Wolfgang Bangerth
11:16 Re: c++/7385: g++ problems with enum and __attribute__ Wolfgang Bangerth
11:16 Re: c++/80: g++ enum and attributed __packed__ Wolfgang Bangerth
10:56 Re: c++/57: [parser] default arguments and templates bangerth
10:46 Re: libstdc++/8399: sync_with_stdio(false) breaks unformatted input Paolo Carlini
10:38 Re: c++/7756: Core dump before main on Solaris 2.6 when using g++ 3.2 and binutils 2.13 bangerth
10:26 c/8517: XFree86 4.2.1 fails compilation with ICE on gcc 3.2 brblueser
07:16 libstdc++/8516: broken links in libstdc++ html documentation Matthias Klose
06:16 Re: c++/7756: Core dump before main on Solaris 2.6 when using g++ 3.2 and binutils 2.13 Christian Ehrhardt
05:26 Re: c++/8511: (hopefully) reproducible cc1plus SIGSEGV. wwieser
02:46 Re: debug/7078: debug info is not generated correctly with c++ namespacesare used Wolfgang Müller
01:08 Re: c++/8389: [mainline regression] Access to members of base class & templates lerdsuwa

November 09, 2002
23:47 Re: c++/8513: g++ internal compiler error paolo
22:46 target/8515: incomming altivec vectors on the stack unaligned to 16 pinskia
22:36 target/8514: Coldfire : Internal compiler error in reload_cse_simplify_operands cjohns
20:26 c++/8513: g++ internal compiler error pss
16:26 Re: c++/4207: ICE at syntax error in enum declaration Volker Reichelt
15:54 Re: c++/8511: (hopefully) reproducible cc1plus SIGSEGV. reichelt
10:06 c++/8512: libstdc++-v3 fails to build with HP assembler dave.anglin
08:16 Re: bootstrap/7143: real.c: In function `make_nan': `TFbignan' undeclared John David Anglin
08:08 Re: bootstrap/7143: real.c: In function `make_nan': `TFbignan' undeclared neil
07:09 Re: c++/8503: strange behaviour of function types. paolo
07:01 Re: c++/8503: strange behaviour of function types. paolo
07:00 Re: c++/8503: strange behaviour of function types. paolo
04:36 c++/8511: (hopefully) reproducible cc1plus SIGSEGV. wwieser
04:18 Re: bootstrap/7143: real.c: In function `make_nan': `TFbignan' undeclared neil
04:16 Re: c/5593: GCC miscompiles bitshifts on unsigned struct members when creating a 64-bit value neil
03:56 c++/8389 lerdsuwa
03:56 c++/8389 lerdsuwa
03:56 Re: c++/8503: strange behaviour of function types. John Maddock
02:55 Re: c++/8510: g++ fails when trying to compile a child class containing a vector or queue paolo
02:26 Re: c/8467: Bug in sibling call optimization Franz Sirl
02:16 c++/8510: g++ fails when trying to compile a child class containing a vector or queue darkepaw

November 08, 2002
21:26 Re: c++/8509: regexp.h file needs tweaked to allow it to compile Phil Edwards
20:46 Re: c/5593: GCC miscompiles bitshifts on unsigned struct memberswhen creating a 64-bit value Byron Stanoszek
18:56 c++/8509: regexp.h file needs tweaked to allow it to compile bakers
17:06 Re: bootstrap/8146: gcc 3.2 miscompiles gcc 2.95.3 Joe Buck
15:29 Re: preprocessor/8505: cross cpp0 use PREFIX_INCLUDE_DIR=$prefix/include neil
15:17 Re: optimization/7591: function-related struct copy bug jbuck
15:17 Re: c/5351: function pass-by-value structure copy corrupts structure on stack jbuck
14:46 preprocessor/8501 neil
14:46 preprocessor/8497 neil
14:37 Re: preprocessor/8501: [mainline regression] Crash in -traditional mode at Imakefile neil
14:37 Re: preprocessor/8497: traditional preprocessor #if/#endif bug neil
14:18 Re: other/8283: Failed to build native GCC-3.2 on i686 linux machine reichelt
14:07 Re: other/7367: Internal compiler error in failed_reload, at reload1.c:5050 reichelt
13:56 Re: bootstrap/8146: gcc 3.2 miscompiles gcc 2.95.3 Joe Buck
13:47 Re: other/7575: gcc crashes when trying to compile static constants stored in .cpp files reichelt
13:44 Re: other/8388: GCC- internal compiler error reichelt
13:07 Re: preprocessor/8497: traditional preprocessor #if/#endif bug neil
13:06 Re: preprocessor/8501: [mainline regression] Crash in -traditional mode at Imakefile neil
12:56 target/8507: -fno-undersocring, -fno-underscore don't work bkausbk
12:46 Re: c++/764: g++ 2.95.2 fails to find a friend operator whendereferencing a pointer Wolfgang Bangerth
12:06 Re: c++/8500: Allows cast to private base class Wolfgang Bangerth
11:59 Re: c/8506: 3.3 (1104) disallowing omission of parameters in fn def pme
10:54 Re: c++/7403: An ambiguity error is flagged during cast with proper perfect single match. jdennett
10:36 Re: c/8506: 3.3 (1104) disallowing omission of parameters in fn def Christian Ehrhardt
10:16 Re: c/8506: 3.3 (1104) disallowing omission of parameters in fn def Richard Earnshaw
10:06 Re: c/8506: 3.3 (1104) disallowing omission of parameters in fn def Phil Edwards
09:56 c/8506: 3.3 (1104) disallowing omission of parameters in fn def jdonner0
09:06 Re: c++/7131: Wrong virtual method calls bangerth
09:03 Re: c++/7244: Internal compiler error bangerth
07:08 Re: c/8494: Big array allocation in gcc2.95 make compiler fail in assign_stack_temp_for_type bangerth
07:06 Re: c++/2330: static_cast<>() to a private base is allowed Wolfgang Bangerth
07:02 Re: c++/8500: Allows cast to private base class bangerth
06:58 Re: c++/8500: Allows cast to private base class bangerth
06:46 preprocessor/8505: cross cpp0 use PREFIX_INCLUDE_DIR=$prefix/include stephane.carbillet
06:26 libstdc++/8504: ios::app + pipes papadopo
06:16 Re: libstdc++/7669: [Solaris 2.7, gcc-3.1.1] libstdc++.so segfaultsin _init() Dimitri Papadopoulos
06:16 Re: libstdc++/7669: [Solaris 2.7, gcc-3.1.1] libstdc++.so segfaultsin _init() Dimitri Papadopoulos
05:07 Re: c++/8503: strange behaviour of function types. paolo
04:46 c++/8503: strange behaviour of function types. john_maddock
04:11 Re: target/8441: GCC 3.2 fails in building of H8300 target kazu
03:22 Re: middle-end/6679: wrong code generated for dead code reichelt
03:19 Re: middle-end/8502: wrong code generated for switch statement reichelt
03:16 middle-end/8502: wrong code generated for switch statement reichelt
02:56 preprocessor/8501: [mainline regression] Crash in -traditional mode at Imakefile jh
02:46 c++/8500: c++ bug Harald.Soleng
02:16 c/8499: [mainline regression] Tree checking failure on after error reported jh
02:12 Re: c++/5655: 11.1.3 not enforced lerdsuwa
02:06 Re: c++/3663: G++ doesn't check access control during template instanation lerdsuwa
01:06 Re: c/5593: GCC miscompiles bitshifts on unsigned struct members when creating a 64-bit value Christian Ehrhardt
00:56 target/8498: g77, objc Testsuite failures from Unresolved symbols. rbrown64
00:48 Re: pending/8478: c/c++ error paolo
00:47 Re: c/8495: Big array allocation in gcc2.95 make compiler fail in assign_stack_temp_for_type paolo

November 07, 2002
22:06 Re: other/8484: gcc 3.2: log(0) => NaN ; -(Inf) => NaN; should return -Inf Tim Prince
19:56 preprocessor/8497: traditional preprocessor #if/#endif bug rth
18:16 Re: objc/8496: Crash if an object is declared instead of a pointer to an object Andrew Pinski
18:06 objc/8496: Crash if an object is declared instead of a pointer to an object lminder
17:46 c++/8338 mmitchel
17:46 c++/8338 mmitchel
17:45 Re: c++/8338: Infinite loop on illegal code mmitchel
16:16 c/8495: Big array allocation in gcc2.95 make compiler fail in assign_stack_temp_for_type delanoy_f
16:16 c/8494: Big array allocation in gcc2.95 make compiler fail in assign_stack_temp_for_type delanoy_f
15:26 Re: c++/8493: Bad interaction of strlen and overload resolution Wolfgang Bangerth
15:26 Re: c++/8332: strlen/template interaction causes ICE Wolfgang Bangerth
15:15 Re: c++/8493: Bad interaction of strlen builtin and overload resolution bangerth
15:06 Re: middle-end/6679: wrong code generated for dead code Volker Reichelt
14:54 Re: pending/8490: SSA-BRANCH-Crash on typecasting code blocks simple paolo
14:53 Re: pending/8491: Re: SSA-BRANCH-Crash on typecasting code blocks simple paolo
14:35 Re: middle-end/6679: wrong code generated for dead code reichelt
14:22 Re: c++/8024: G++ 3.2 vtable layout of implicit destructors is not ABI compliant mmitchel
14:06 Re: libstdc++/8469: Obsolete iostream.h and fstream.h? R. D. Nichols, Jr.
13:16 Re: c/8467: Bug in sibling call optimization Franz Sirl
13:16 c++/8493: Outputing strlen() to ostream causes bogus compiler error rutt
09:30 Re: optimization/5230: Spurious warning compiling duffs device with optimization thorpej
09:26 Re: c++/8488: invalid reference cast being accepted with -pedanticon Wolfgang Bangerth
09:26 Re: c++/7307: -pedantic makes errors to warnings Wolfgang Bangerth
08:36 optimization/8492: GCC spins forever compiling loop thorpej
08:29 Re: c++/8453: ABI Issue: Destructors for already constructed objects not called when the exception is thrown inside constructor. mmitchel
07:13 Re: c++/8488: invalid reference cast being accepted with -pedantic on bangerth
06:40 Re: pending/8482: PR 8146 reichelt
06:36 Re: spam/8487: HSNU reichelt
06:33 Re: spam/8487: HSNU reichelt
06:14 Re: optimization/7896: [H8300] C compiler generates wrong code kazu
06:06 Re: target/8441: GCC 3.2 fails in building of H8300 target Kazu Hirata
05:58 Re: target/7533: gcc 3.0.2 h8300 right shift 15 is wrong kazu
03:38 Re: preprocessor/8449: Ellipsis in 3...5 not recognized properly neil
03:16 Re: preprocessor/8449: Ellipsis in 3...5 not recognized properly Andreas Schwab
02:05 Re: c++/3851: Problem with generic member. reichelt
01:26 Re: preprocessor/8449: Ellipsis in 3...5 not recognized properly Christian Ehrhardt
00:26 Re: preprocessor/8449: Ellipsis in 3...5 not recognized properly Neil Booth
00:06 Re: c++/7307: -pedantic makes errors to warnings Neil Booth

November 06, 2002
23:02 Re: optimization/8252: gcc 3.2 ICE on AltiVec code with optimisation turned on aldyh
22:06 c++/8488: invalid reference cast being accepted with -pedantic on mrnobo1024
21:26 Re: libstdc++/3195: STL warning needs fixinc assistance Bruce Korb
20:46 libgcj/8481 tromey
20:22 Re: libgcj/8481: java.Random.nextInt(int) may return negative tromey
18:07 Re: c++/8021: undefined reference to virtual thunk mmitchel
18:05 Re: c++/8338: Infinite loop on illegal code mmitchel
17:06 Re: bootstrap/7343: error in bootstrapping on powerpc-apple-darwin5.5 Andrew Pinski
16:42 Re: c++/3856: GNU/Linux i586 cross compiler powerpc dje
16:38 Re: target/5427: compiling gcc for --target=ppc-linux --host=i686-pc-cygwin dje
16:36 Re: bootstrap/7343: error in bootstrapping on powerpc-apple-darwin5.5 dje
16:35 Re: target/8480: reload ICEs for LAPACK code on powerpc64-linux dje
16:29 Re: middle-end/8362: hard reg not substituted for all pseudos on PowerPC dje
16:26 optimization/7520 rth
16:16 Re: c++/8476: SIGSEGV on explicit call of dtor of static member intemplate Joe Buck
16:12 Re: c++/8476: SIGSEGV on explicit call of dtor of static member in template jbuck
15:25 Re: libstdc++/8486: file i/o using c++ iostream crashes when option malign-double is used paolo
15:25 Re: fortran/8485: g77 doesn't accept INTEGER*8 constant in PARAMETER multiplication toon
14:57 Re: libstdc++/3195: STL warning on Solaris with GCC 3.0 bangerth
14:56 Re: libstdc++/3195: STL warning on Solaris with GCC 3.0 Wolfgang Bangerth
14:46 Re: libstdc++/3181: Unable to use sqrt,cos,sin,... with int argument. Phil Edwards
14:46 Re: c++/8477: autoconf script chooses wrong value for gcc_gxx_include_path Phil Edwards
14:46 Re: libstdc++/3195: STL warning on Solaris with GCC 3.0 Phil Edwards
14:36 libstdc++/8486: file i/o using c++ iostream crashes when option malign-double is used colin
14:16 Re: c/4210: bad warning with dead code Wolfgang Bangerth
14:07 Re: c++/8419: Erroneous warning: left shift count >= width of type bangerth
14:06 fortran/8485: g77 doesn't accept INTEGER*8 constant in PARAMETER multiplication pmarguinaud
14:00 Re: c++/8476: SIGSEGV on explicit call of dtor of static member in template bangerth
13:57 Re: c++/8472: Internal compiler error bangerth
13:53 Re: libstdc++/6047: weird behaviour when reading from a pipe through an ifstream bangerth
13:06 other/8484: gcc 3.2: log(0) => NaN ; -(Inf) => NaN; should return -Inf kabal
12:07 Re: bootstrap/6768: stage2 xgcc segfaults on PowerPC NetBSD 1.5.2 dje
12:06 Re: target/1801: gcc on AIX 4.3.3 doesn`t support "long double" type dje
12:05 Re: libstdc++/4435: Object file has undefined basic_string symbol as local. dje
12:00 Re: libstdc++/3570: Undefined symbol: "std::string::_Rep::_S_max_size" on AIX with g++ 3.0 dje
11:57 Re: libstdc++/6991: Seg fault in std::num_put (called from ostringstream::operator<<) while putting numbers dje
11:54 Re: libstdc++/8373: C++ I/O doesn't work under AIX dje
11:36 Re: libstdc++/7824: Temporary ostream doesn't work properly with operator<< and const char* Benjamin Kosnik
11:31 Re: libstdc++/7824: Temporary ostream doesn't work properly with operator<< and const char* bkoz
11:06 Re: c/5351: function pass-by-value structure copy corrupts structureon stack Wolfgang Bangerth
10:56 Re: c/7591: function-related struct copy bug Wolfgang Bangerth
10:29 Re: libstdc++/3181: Unable to use sqrt,cos,sin,... with int argument. bangerth
10:16 Re: libstdc++/3181: Unable to use sqrt,cos,sin,... with int argument. Gabriel Dos Reis
10:06 Re: libstdc++/3181: Unable to use sqrt,cos,sin,... with int argument. Gabriel Dos Reis
09:56 Re: libstdc++/7824: Temporary ostream doesn't work properly withoperator<< and const char* Martin Sebor
09:50 Re: libstdc++/5090: linking fails when using std::basic_stringstream<wchar_t> bangerth
09:46 libgcj/8481: java.Random.nextInt(int) may return negative svens
09:36 Re: c/8407: gcc3.2 ia64 (itanium-2) Internal compiler error in simplify_gen_subreg, at simplify-rtx.c:2711 Janis Johnson
09:36 Re: libstdc++/3181: Unable to use sqrt,cos,sin,... with int argument. Wolfgang Bangerth
09:36 Re: libstdc++/3181: Unable to use sqrt,cos,sin,... with int argument. Gabriel Dos Reis
09:35 Re: libstdc++/3181: Unable to use sqrt,cos,sin,... with int argument. bangerth
09:32 Re: libstdc++/4886: Solaris largefile support for fopen removed by include/g++-v3/bits/std_cstdio.h bangerth
09:27 Re: libstdc++/4764: std::wstring missing on Solaris bangerth
09:26 Re: libstdc++/4435: Object file has undefined basic_string symbolas local Wolfgang Bangerth
09:26 Re: libstdc++/3570: Undefined symbol: "std::string::_Rep::_S_max_size"on AIX with g++ 3.0 Wolfgang Bangerth
09:26 optimization/8480: reload ICEs for LAPACK code on powerpc64-linux janis187
09:26 Re: libstdc++/3181: Unable to use sqrt,cos,sin,... with int argument. Wolfgang Bangerth
09:20 Re: libstdc++/3195: STL warning on Solaris with GCC 3.0 bangerth
09:16 Re: libstdc++/3181: Unable to use sqrt,cos,sin,... with int argument. Wolfgang Bangerth
09:16 Re: libstdc++/3042: static class members in V3 shared library Wolfgang Bangerth
09:06 optimization/8479: [new-ra] ICE in select_spill, at ra-colorize.c:1001 bangerth
09:06 Re: libstdc++/8475: hash_map error message at run time about __default_alloc_template/force_new not defined Loren James Rittle
09:02 Re: libstdc++/8463: std::ios_base has a non-virtual destructor bkoz
09:02 Re: libstdc++/7372: Contents of sparc-sun-solaris2.8/sparcv9/libstdc++-v3 not installed bkoz
09:01 Re: libstdc++/6934: c++ increment operator, map bug ? bkoz
08:59 Re: libstdc++/7843: Memory not freed when printing complex number bkoz
08:53 Re: libstdc++/8258: basic_istream::readsome() with default buffer change stream state to ios_base::eofbit bkoz
08:47 Re: libstdc++/8071: basic_ostream::operator<<(streambuf*) loops forever if streambuf::underflow() leaves gptr() NULL bkoz
08:43 Re: libstdc++/7824: Temporary ostream doesn't work properly with operator<< and const char* bkoz
08:16 Re: libstdc++/8475: hash_map error message at run time about __default_alloc_template/force_new not defined Frederic Dumas
07:18 Re: middle-end/5833: Internal compiler error in `create_reg_dead_note',at haifa-sched.c:4496 Wolfgang Bangerth
07:18 Re: optimization/5244: Dead code in simplify_logical() Wolfgang Bangerth
06:43 Re: c/8335: problems with __builtin_frame_address when -fomit-frame-pointer used bangerth
06:17 Re: libstdc++/8475: hash_map error message at run time about __default_alloc_template/force_new not defined ljrittle
05:06 c++/8477: autoconf script chooses wrong value for gcc_gxx_include_path ian.grant
04:51 Re: libstdc++/8475: hash_map error message at run time about __default_alloc_template/force_new not defined paolo
04:46 c++/8476: SIGSEGV on explicit call of dtor of static member in template Detlef Vollmann
04:46 Re: c/4890: inconsistent int-to-pointer warning Christian Ehrhardt
04:16 libstdc++/8475: hash_map error message at run time about __default_alloc_template/force_new not defined fdumas
02:36 Re: other/8335: problems with __builtin_frame_address when -fomit-frame-pointer used Davin McCall

November 05, 2002
23:36 Re: c/8387: [mainline regression] -finline-limit behavior changed;new inlining flags need doc Gerald Pfeifer
23:36 optimization/8474: -mcup=i686 produces much faster code than -mcpu=pentium4 on a P4 machine davejf
23:16 java/8473: syntax error on anonymous array subscript jmr
19:46 Re: libstdc++/7843: Memory not freed when printing complex number Jeffrey Oldham
19:33 Re: libstdc++/7942: ostream core dump with hex/internal/showbase formatted output bkoz
19:30 Re: libstdc++/7843: Memory not freed when printing complex number bkoz
17:16 c++/8472: Internal compiler error sblack
16:16 Re: libstdc++/8469: Obsolete iostream.h and fstream.h? Phil Edwards
16:16 libstdc++/8258 bkoz
16:06 java/6388 tromey
16:02 Re: java/6388: Integer.MIN_VALUE == 0x80000000 optimized to false on powerpc tromey
15:56 libstdc++/7219 bkoz
15:56 libstdc++/8258 bkoz
15:53 Re: target/8471: metacity-2.4.3 causes ICE on powerpc with gcc-3.2 sirl
15:46 target/8471: metacity-2.4.3 causes ICE on powerpc with gcc-3.2 nall
15:42 Re: libstdc++/7986: Problems with demangling (__cxa_demangle()) bkoz
15:36 Re: libstdc++/8466: basic_stringbuf::str(basic_string const&) modifies its argument paolo
15:36 Re: libstdc++/8318: Not all wide character based prototypes are included within #ifdef _GLIBCPP_USE_WCHAR_T bkoz
15:36 libstdc++/8466 paolo
15:36 libstdc++/8466 paolo
15:26 Re: c/8467: Bug in sibling call optimization Franz Sirl
15:24 Re: libstdc++/8470: istream::get does not handle empty lines correctly paolo
15:17 Re: libstdc++/8258: basic_istream::readsome() with default buffer change stream state to ios_base::eofbit bkoz
15:06 libstdc++/8470: istream::get does not handle empty lines correctly james
14:59 Re: libstdc++/8469: Obsolete iostream.h and fstream.h? paolo
13:46 libstdc++/8469: Obsolete iostream.h and fstream.h? rdnjr
13:34 Re: libstdc++/8466: basic_stringbuf::str(basic_string const&) modifies its argument paolo
13:06 preprocessor/8468: Segmentation Fault during compilation immediatly after preprocessing ben
12:36 Re: c++/3784: function not found if integer template parameterdeclared as unsigned in a different function Wolfgang Bangerth
12:26 c/8467: Bug in sibling call optimization Franz.Sirl-kernel
12:06 libstdc++/8466: basic_stringbuf::str(basic_string const:) modifies its argument gnats
12:03 Re: c++/8216: Code accepted by gcc is rejected by g++ bangerth
11:46 Re: c++/8448: Regression from gcc 2.96 concerning nested namespaces Martin Sebor
11:30 Re: c++/8465: GCC 3.2 rejects legal overloads of template member functions bangerth
11:26 Re: c++/8448: Regression from gcc 2.96 concerning nested namespaces Wolfgang Bangerth
10:56 c++/8465: GCC 3.2 rejects legal overloads of template member functions jacques.bouchard
09:56 Re: c++/8448: Regression from gcc 2.96 concerning nested namespaces Roberto Bagnara
09:28 Re: c++/7782: [mainline regression] C++ compiler internal error in delete_insn, at cfgrtl.c:139 reichelt
09:16 Re: c++/8164: internal error: segmentation fault Volker Reichelt
09:16 Re: c++/8464: Bus Error (SIGBUS) due to misaligned access Andreas Schwab
09:16 Re: c/2678: gcc/g++ should stick compilation options into the .ofile Wolfgang Bangerth
09:08 Re: c/2678: gcc/g++ should stick compilation options into the .o file bangerth
09:06 Re: c/2678: gcc/g++ should stick compilation options into the .o file Phil Edwards
08:56 libstdc++/8463 bkoz
08:49 Re: c++/8464: Bus Error (SIGBUS) due to misaligned access bangerth
08:44 Re: c/6813: Internal compiler error in extract_insn, at recog.c:2132 bangerth
08:42 Re: c/6614: [-Wconversion] incorrect conversion warning for function taking a short bangerth
08:33 Re: c++/5602: g++3.0.3 internal compiler error emit_move_insn_1, at expr.c:2975 bangerth
08:29 Re: libstdc++/8463: std::ios_base has a non-virtual destructor bkoz
08:26 c++/8464: Bus Error (SIGBUS) due to misaligned access kyle_s_hoyt
08:15 Re: c/5593: GCC miscompiles bitshifts on unsigned struct members when creating a 64-bit value bangerth
08:11 Re: libstdc++/8172: undefined reference to operator+ for string bkoz
08:10 Re: libstdc++/8197: std::sin(float) causes undefined reference to sinf bkoz
08:09 Re: c/5480: -Wall doesn't issue warning for enumerated type mismatch bangerth
08:05 Re: c/5351: function pass-by-value structure copy corrupts structure on stack bangerth
07:59 Re: c/5277: NaN unexpectedly bangerth
07:57 Re: c/5111: Misleading error message for "unsigned long double" bangerth
07:48 Re: c/4412: possible warning of logic errors not given bangerth
07:46 Re: c/2678: gcc/g++ should stick compilation options into the .ofile Wolfgang Bangerth
07:45 Re: c/2699: gcc does not warn of dead code bangerth
07:43 Re: c/4210: bad warning with dead code bangerth
07:40 Re: c/4008: ICE: variable sized type and nested function bangerth
07:39 Re: c++/5565: g++ crashes on struct that is defined twice reichelt
07:31 Re: c++/2200: -finstrument-functions doesn't work with exceptions? bangerth
06:46 Re: c++/8442: Wrongful compiler error - file available Reichelt
06:09 Re: c++/8461: [mainline regression] internal compiler error stabilize_throw_expr reichelt
05:06 libstdc++/8463: std::ios_base has a non-virtual destructor john_maddock
04:36 c/8462: ice in illegal array initializer ehrhardt
04:06 c++/8461: internal compiler error stabilize_throw_expr rassahah
04:03 Re: c++/8460: Internal compiler error in rest_of_compilation, at toplev.c:3491 paolo
04:01 Re: c/8458: ICE caused by typedef X = 3 paolo
03:36 c++/8460: Internal compiler error in rest_of_compilation, at toplev.c:3491 alain.touret
02:56 c/8458: ICE caused by typedef X = 3 ehrhardt
01:43 Re: pending/8455: II Congreso Internacional de Telemática, CITEL 2002 paolo
01:43 Re: pending/8456: II Congreso Internacional de Telemática, CITEL 2002 paolo
01:26 java/8457: Internal compiler error in generate_bytecode_insns, at java/jcf-write.c:1850 martin_aliger
00:36 Re: c++/8442: Wrongful compiler error - file available Juan Carlos Arevalo-Baeza

November 04, 2002
23:06 Re: c++/7954: g++ 2.95.4 bug while compiling QT library for Linux 2.4.19 stéphane duverger
17:16 Re: libstdc++/8197: std::sin(float) causes undefined reference to sinf B. Kosnik
16:56 libstdc++/8318 bkoz
16:56 libstdc++/8197 bkoz
16:56 libstdc++/8172 bkoz
16:56 ada/8358 grahams
15:43 Re: c++/8046: ICE on (admittedly very silly) input bangerth
15:37 Re: c++/8046: ICE on (admittedly very silly) input bangerth
15:17 Re: c++/7954: g++ 2.95.4 bug while compiling QT library for Linux 2.4.19 bangerth
15:15 Re: c++/8019: g++ CRASHES on an illegal initialization in a template class instead of reporting an error bangerth
15:12 Re: c++/8021: undefined reference to virtual thunk bangerth
15:10 Re: c++/8026: -fstack-check dumps when throw out of scope with bangerth
15:04 Re: c++/8453: ABI Issue: Destructors for already constructed objects not called when the exception is thrown inside constructor. bangerth
15:01 Re: c++/8454: G++ 2.95 gives an ICE while compiling the copy constructor of template class CTTT(see attach) bangerth
14:58 Re: c++/8117: member function pointers and multiple inheritance bangerth
14:56 c++/8454: G++ 2.95 gives an ICE while compiling the copy constructor of template class CTTT(see attach) jesteves
14:49 Re: c++/8211: -Weffc++ warns about copyable classes with func ptr members bangerth
14:46 Re: c++/8205: using declaration & mulitiple inheritance bangerth
14:46 c++/8453: ABI Issue: Destructors for already constructed objects not called when the exception is thrown inside constructor. sunil.k.davasam
14:39 Re: c++/8129: Compiler seems unable to process function pointers to member functions. bangerth
14:32 Re: libstdc++/8231: iostream header position causes bad code generation ljrittle
13:46 bootstrap/8452: Internal Compiler Error building GCC 3.2 on Tru64 5.0A lwe
12:47 Re: c++/8325: [mainline regression] ICE in cp_expr_size, at cp/cp-lang.c:307 reichelt
12:46 Re: c++/8244: [mainline regression] ICE of g++ 3.3 using -O reichelt
12:46 Re: c++/7959: [mainline regression] g++ 3.3: ICE in cp_expr_size reichelt
12:45 Re: c++/8186: [mainline regression] ICE in cp_expr_size, at cp/cp-lang.c:304 reichelt
11:36 Re: c/8407: gcc3.2 ia64 (itanium-2) Internal compiler error in simplify_gen_subreg, at simplify-rtx.c:2711 Janis Johnson
11:26 Re: c/8439: using an empty struct causes Internal compiler error in instantiate_virtual_regs_1, at function.c:4126 Raimar Falke
10:56 Re: c/4943: pointer address corruption in function call bangerth
10:54 Re: c/8253: gcc 3.3 snapshot ICE on AltiVec code aldyh
10:52 Re: other/8451: altivec ice in gcc 3.2 aldyh
09:46 other/8451: altivec ice in gcc 3.2 hartwood
09:06 Re: c/8395: gcc 2.95.4 and 3.2 generate wrong code for double onintel Joseph S. Myers
09:06 Re: c/8395: gcc 2.95.4 and 3.2 generate wrong code for double onintel Marco Bernardo
08:56 Re: c++/8442: Wrongful compiler error - file available Wolfgang Bangerth
08:56 Re: preprocessor/8449: Ellipsis in 3...5 not recognized properly Christian Ehrhardt
08:56 Re: c++/8442: Wrongful compiler error - file available Juan Carlos Arevalo-Baeza
08:46 target/8450: Command line switch which disables underscoring bkausbk
08:26 preprocessor/8449: Ellipsis in 3...5 not recognized properly ehrhardt
08:15 Re: c++/8171: pointers to member functions comparison bangerth
08:01 Re: c++/8448: Regression from gcc 2.96 concerning nested namespaces bangerth
07:55 Re: c++/8442: Wrongful compiler error - file available bangerth
07:46 Re: c++/8438: Internal compiler error building Trolltech Qt library bangerth
07:46 Re: c/4943: pointer address corruption in function call Matthias Posseldt
07:43 Re: c++/8448: Regression from gcc 2.96 concerning nested namespaces paolo
07:17 Re: c++/8427: internal error on ambiguous function template bangerth
07:13 Re: c++/8427: internal error on ambiguous function template bangerth
06:56 c++/8448: Regression from gcc 2.96 concerning nested namespaces bagnara
04:59 Re: libstdc++/8399: sync_with_stdio(false) breaks unformatted input paolo
04:53 Re: libstdc++/8399: sync_with_stdio(false) breaks unformatted input paolo
04:07 Re: middle-end/8408: [mainline regression] simple legal c program ice in fixup_var_refs_1, at function.c:1938 rth
04:06 java/8447: java/lang/Thread.java:0: Internal error: Segmentation fault vruiz
03:06 Re: c/8395: gcc 2.95.4 and 3.2 generate wrong code for double onintel Bruce Allen
02:36 debug/8446: stabs generation crashes when class inherits from typedef struct hb
01:26 Re: libstdc++/8319: warnings out of system headers Sebastian Setzer

November 03, 2002
23:46 fortran/8445: optimizer bug? eckmann
22:36 other/8444: fastjar needs an ANSI compiler to build rbrown64
20:48 Re: libgcj/8443: StringTokenizer does not return delimeters green
20:36 libgcj/8443: StringTokenizer does not return delimeters brian_252
20:26 Re: c++/7327: -isystem and template linkage Ben Hines
17:56 c++/8442: Wrongful compiler error - file available jcab
17:06 target/8441: GCC 3.2 fails in building of H8300 target evanlanglois
16:42 Re: java/7912: invalid verification error for arrays tromey
16:26 c/7128 sayle
16:09 Re: libstdc++/8399: sync_with_stdio(false) breaks unformatted input paolo
10:52 Re: c/8440: Internal GCC 3.2 compiler error caused by Asm-Statement paolo
10:48 Re: c/8436: Internal GCC 3.2 compiler error caused by Asm-Statement paolo
10:46 c/8440: Internal GCC 3.2 compiler error caused by Asm-Statement bkausbk
10:31 Re: c/8439: using an empty struct causes Internal compiler error in instantiate_virtual_regs_1, at function.c:4126 paolo
10:26 c/8439: using an empty struct causes Internal compiler error in instantiate_virtual_regs_1, at function.c:4126 rf13
10:13 Re: c/8436: Internal GCC 3.2 compiler error caused by Asm-Statement paolo
10:08 Re: c++/8431: compile short program to get internal compilation error paolo
09:26 c++/8438: Internal compiler error building Trolltech Qt library bennyb
07:56 Re: c++/8431: compile short program to get internal compilation error William J. Evans
06:16 Re: c++/8434: Template Inclusion - keyword 'export' not implemented Gabriel Dos Reis
05:36 other/8437: GCC 3.2 don't produces builtin code for __builtin_alloca bkausbk
05:16 c/8436: Internal GCC 3.2 compiler error caused by Asm-Statement bkausbk

November 02, 2002
22:26 Re: c/8395: gcc 2.95.4 and 3.2 generate wrong code for double onintel Bruce Allen
22:26 Re: c/8395: gcc 2.95.4 and 3.2 generate wrong code for double onintel Bruce Allen
21:09 Re: c++/8435: Template Inclusion - keyword 'export' not implemented zack
21:08 Re: c++/8434: Template Inclusion - keyword 'export' not implemented zack
20:56 c++/8435: Template Inclusion - keyword 'export' not implemented mjmaterna60193
20:56 c++/8434: Template Inclusion - keyword 'export' not implemented mjmaterna60193
17:58 Re: java/8051: Infinite loop after error reporting on extending final tromey
17:46 java/8433: Static initializers must be able to complete normally ebb9
17:36 java/8432: Misleading error message for undeclared variable in inner class jmr
17:23 Re: c++/8431: compile short program to get internal compilation error paolo
15:36 c++/8431: compile short program to get internal compilation error wje
15:35 Re: libgcj/8142: '$' in class names vs. dlopen 'dynamic string tokens' tromey
15:06 Re: libstdc++/7691: --enable-cxx-flags configure option broken Phil Edwards
15:06 optimization/8423 dnovillo
13:43 Re: libstdc++/8231: iostream header position causes bad code generation paolo
13:36 java/8415 tromey
13:36 java/8415 tromey
13:36 java/6388 tromey
13:34 Re: java/8415: reflection bug: exception info for Method tromey
13:16 Re: libstdc++/8231: iostream header position causes bad code generation brister
12:48 Re: libstdc++/8231: iostream header position causes bad code generation paolo
10:08 Re: libstdc++/8429: Found a memory leak in libstdc++-v3 paolo
10:06 Re: libstdc++/8430: Found a memory leak in libstdc++-v3 B. Kosnik
09:06 libstdc++/8430: Found a memory leak in libstdc++-v3 sefer
08:36 libstdc++/8429: Found a memory leak in libstdc++-v3 sefer
08:26 Re: libstdc++/8197: std::sin(float) causes undefined reference to sinf Christian Ehrhardt
08:26 Re: c/8395: gcc 2.95.4 and 3.2 generate wrong code for double on intel Tim Prince
07:56 Re: c/8395: gcc 2.95.4 and 3.2 generate wrong code for double onintel Toon Moene
07:46 Re: c/8395: gcc 2.95.4 and 3.2 generate wrong code for double onintel Marco Bernardo
07:46 Re: c++/8427: internal error on ambiguous function template Ray Lischner
07:22 Re: pending/8425: [ssa branch]Fwd: [Introspector-developers] Build instructions for the cywin ssa branch lerdsuwa
07:02 Re: libstdc++/7849: libstdc++.so: undefined reference to std::messages<wchar_t>::do_get[...] causes failure during building of abi_check bkoz
05:16 Re: libstdc++/7849: libstdc++.so: undefined reference to std::messages<wchar_t>::do_get[...]causes failure during building of abi_check Nicholas Wourms
03:46 c++/8428: Segmentation fault while building a c++ file marioluca
03:15 Re: fortran/6742: Generation of C++ Prototype for FORTRAN and extern "C" toon
02:36 c/7353 zack
01:38 Re: libstdc++/4367: Sparc atomicity.h routines can lock up on some OS. davem

November 01, 2002
19:16 Re: libstdc++/7444: Build of gcc 3.1.1 failed while configuring libstdc++ Peter van Hoof
18:46 Re: libstdc++/8348: fail() flag is set in istringstream when eof() flag is set ! bkoz
18:27 Re: libstdc++/5625: exception unwinding creates invalid pointer on mips bkoz
18:26 libstdc++/8172 bkoz
18:26 c/7353 zack
18:19 Re: libstdc++/8172: undefined reference to operator+ for string bkoz
18:05 Re: libstdc++/4367: Sparc atomicity.h routines can lock up on some OS. bkoz
18:02 Re: libstdc++/4144: istream on solaris, ifstream vs. cin bkoz
18:01 Re: libstdc++/1823: program compiled with -ftrapv aborts in std::queue<>.size() bkoz
17:58 Re: libstdc++/3750: stream input operator>> fails in g++ 3.0 on solaris 5.6 only bkoz
17:56 Re: libstdc++/6934: c++ increment operator, map bug ? bkoz
17:55 Re: libstdc++/7669: [Solaris 2.7, gcc-3.1.1] libstdc++.so segfaults in _init() bkoz
17:54 Re: libstdc++/8172: undefined reference to operator+ for string bangerth
17:53 Re: libstdc++/7444: Build of gcc 3.1.1 failed while configuring libstdc++ bkoz
17:50 Re: libstdc++/7691: --enable-cxx-flags configure option broken bkoz
17:50 Re: c++/8417: g++ 3.2 generating different (and incorrect?) code from g++ 2.95.4 bangerth
17:49 Re: libstdc++/7849: libstdc++.so: undefined reference to std::messages<wchar_t>::do_get[...] causes failure during building of abi_check bkoz
17:46 libstdc++/7926 bkoz
17:45 Re: libstdc++/7926: i486 instructions in header files make c++ programs crash on i386 bkoz
17:40 Re: c++/2183: gcc-3_0-branch compiles 2x slower than 2.95 bangerth
17:38 Re: c++/6361: Internal compiler error in g++-v3/bits/locale_facets.tcc with GCC 3.0.4 on IRIX bangerth
17:37 Re: bootstrap/6145: Error compiling jni.cc on i386-pc-solaris2.7 bangerth
17:32 Re: c++/4659: Eroneous extra warning for -Woverloaded-virtual bangerth
17:17 Re: c++/8391: [regression] infinite loop in cp/decl2.c(finish_file) mmitchel
17:06 c++/8391 mmitchel
17:06 c++/8391 mmitchel
17:06 c++/8391 mmitchel
17:06 c++/8391 mmitchel
16:26 java/8415 tromey
15:35 Re: c++/8427: internal error on ambiguous function template bangerth
15:33 Re: c++/6570: gcc-3.1 crash with template and namespace bangerth
15:26 c++/8427: internal error on ambiguous function template rl
15:14 Re: c++/5339: [parser] Internal error on illegal code (argument list for template missing) bangerth
15:12 Re: c++/5249: sorry, not implemented: `component_ref' bangerth
15:08 Re: c++/5236: ICE in arg_assoc, at cp/decl2.c:4781 bangerth
14:58 Re: c++/4044: vector<int[]> causes internal compiler error bangerth
14:57 Re: c++/4043: g++ seg fault with user basic_ostream constructor bangerth
14:54 Re: c++/3606: template causes compilation of illegal code to generate ICE bangerth
14:53 Re: c++/3767: ICE in c_expand_expr, at c-common.c:3521 bangerth
14:46 Re: c++/765: Friend function can not have same name of a memeberfunction Wolfgang Bangerth
14:46 c/8426: GCC segfault Linards Ticmanis
13:46 Re: optimization/6162: gcc 3.0.4: certain i386 asm reloader ice Kevin Ryde
12:56 Re: java/8415: reflection bug: exception info for Method Tom Tromey
12:46 Re: c++/3869: Segmentation fault on specialized outer template withinner member template Wolfgang Bangerth
12:36 Re: c++/4926: Segmentation Fault on Legal Code Wolfgang Bangerth
12:06 Re: c++/4526: ICE in g++ 3.0.1 when using typeof() as templateparameter Wolfgang Bangerth
12:06 Re: c++/8007: Internal compiler error in walk_tree Wolfgang Bangerth
12:06 Re: c++/5750: g++ segfaults when using the gcc-extention of typeof()in a template class Wolfgang Bangerth
10:26 Re: libstdc++/8348: fail() flag is set in istringstream when eof() flag is set ! Adam Wilkshire
09:56 libstdc++/8197 bkoz
09:44 Re: libstdc++/8197: std::sin(float) causes undefined reference to sinf bkoz
09:39 Re: libstdc++/7813: Build fails paolo
09:36 Re: libstdc++/7942: ostream core dump with hex/internal/showbase formatted output paolo
09:36 libstdc++/8318 bkoz
09:17 Re: libstdc++/8318: Not all wide character based prototypes are included within #ifdef _GLIBCPP_USE_WCHAR_T bkoz
09:05 Re: c++/8424: initialising a pointer-to-member to an array element does not work bangerth
08:39 Re: libstdc++/8359: STL container can fault at runtime destroying contained objects with virtual destructors bkoz
08:38 Re: libstdc++/8319: warnings out of system headers bkoz
08:36 libstdc++/8348 bkoz
08:34 Re: libstdc++/8348: fail() flag is set in istringstream when eof() flag is set ! bkoz
07:36 c++/8424: initialising a pointer-to-member to an array element does not work andyc
07:27 Re: libstdc++/7961: compare( char *) implemented incorrectly. paolo
07:26 libstdc++/7961 paolo
07:26 libstdc++/7961 paolo
07:03 Re: c++/4595: internal compiler error in c_expand_expr [c-common.c:4121] bangerth
07:00 Re: target/7856: [arm] invalid offset in constant pool reference rearnsha
06:57 Re: c++/253: `foo' is not a member of type `test<int>'...but it is!! lerdsuwa
06:56 optimization/8423: CSE1 not propagating __builtin_constant_p enough arjanv
06:54 Re: c++/7745: gcc 3.2 rejects legal member template overload lerdsuwa
06:48 Re: c++/4569: ICE in c_expand_expr, at c-common.c:3395 bangerth
06:46 target/7856 rearnsha
06:46 target/7856 rearnsha
06:45 Re: c++/3169: GCC crashes when assigning a template function to a pointer to function variable bangerth
06:45 Re: c++/8422: g++ 3.2 fails with internal compiler error on suse 8.1 paolo
06:44 Re: c++/2402: Problem with compile-time sizeof evaluation and templates lerdsuwa
06:36 Re: c++/2023: ICE in lookup_template_class, at cp/pt.c:3986 Wolfgang Bangerth
06:36 Re: c++/495: [parser] ICE in in lookup_template_class, at cp/pt.c:3961 Wolfgang Bangerth
06:28 Re: c++/8389: [mainline regression] Access to members of base class & templates lerdsuwa
06:16 c++/8422: g++ 3.2 fails with internal compiler error on suse 8.1 niallm-wan
06:08 Re: c++/8273: g++ can not generate an instance of a template containg a template instance lerdsuwa
04:16 c/8421: scm5d6 segfaults when eval.c is compiled with -O2 optimisation Martin.Ward
02:55 Re: libstdc++/7961: compare( char *) implemented incorrectly. paolo
02:36 Re: libstdc++/7961: compare( char *) implemented incorrectly. paolo
02:23 Re: libstdc++/7961: compare( char *) implemented incorrectly. paolo
02:16 c/8420: volatile after the type specifier for an unnamed structure is rejected ehrhardt
02:10 Re: c++/38: matching of function signatures nathan
00:46 Re: c++/8417: g++ 3.2 generating different (and incorrect?) code from g++ 2.95.4 Giovanni Bajo


Indexes: [Date Index] [Subject Index] [Author Index] [Thread Index]
Site Nav: [Browse other archives for this mailing list]
[Browse other mailing lists at this site]
Search: Limit to:

Mail converted by MHonArc 2.5.13