gcc-prs archive
date index for September, 2002

This is the mail archive of the gcc-prs@gcc.gnu.org mailing list for the GCC project.

Indexes: [Date Index] [Subject Index] [Author Index] [Thread Index]
Site Nav: [Browse other archives for this mailing list]
[Browse other mailing lists at this site]
Search: Limit to:

September 30, 2002
23:46 Re: target/7940: Test gcc.dg/nest.c fails on cygwin Tim Prince
21:46 libstdc++/8104: cann't use wcout and wprintf to print wchat_t* in gcc-3.2 and gcc-3.1 dragzhb
17:26 Re: target/8087: sparc-sun-solaris2.7 C testsuite failures inexecute/20020720-1.c w/-m64 or on sparcv9/sparc64 Roger Sayle
16:56 Re: target/8087: sparc-sun-solaris2.7 C testsuite failures in execute/20020720-1.c w/-m64 or on sparcv9/sparc64 Richard Henderson
16:36 Re: target/8087: sparc-sun-solaris2.7 C testsuite failures inexecute/20020720-1.c w/-m64 or on sparcv9/sparc64 David S. Miller
16:26 Re: target/8087: sparc-sun-solaris2.7 C testsuite failures in execute/20020720-1.c w/-m64 or on sparcv9/sparc64 Richard Henderson
15:54 Re: optimization/6759: ice when compiling 32 bit sparc code davem
15:52 Re: target/8087: sparc-sun-solaris2.7 C testsuite failures in execute/20020720-1.c w/-m64 or on sparcv9/sparc64 davem
14:46 Re: c++/8100: a valid operator definition is rejected. paolo
14:46 Re: preprocessor/4917: Make -print-search-dirs show include dirs zack
14:46 Re: other/8091: gcc is no longer installed as gcc Richard Henderson
14:44 Re: other/8077: Problems with -o option, unrecognized option -auxbase-strip zack
14:36 Re: other/8091: gcc is no longer installed as gcc Andrew Pinski
14:32 Re: c++/8101: va_start undeclared rth
14:26 c++/8101: va_start undeclared jpatel
14:25 Re: c/8093: Wrong warning by gcc suggests adding dead code to end of function rth
14:20 Re: optimization/8092: cross-jump triggers too often rth
14:17 Re: other/8091: gcc is no longer installed as gcc rth
14:06 Re: c++/8100: a valid operator definition is rejected. Christophe de Vienne
13:46 Re: debug/8095: missing dwarf info for parent class Daniel Jacobowitz
13:36 Re: c++/7944: gcc 3.2: Internal compiler error in Pop Sébastian
13:06 Re: c++/8067: g++ 3.2 internal error: Segmentation fault Pop Sébastian
11:53 Re: libstdc++/8096: deque::at() throws std::range_error instead of std::out_of_range paolo
11:46 Re: other/8091: gcc is no longer installed as gcc Daniel Jacobowitz
11:06 c++/8100: a valid operator definition is rejected. cdevienne
10:45 Re: c++/7952: obnoxious warning on -I nathan
10:42 Re: c++/8050: g++ instantiates template too late nathan
10:40 Re: c++/7430: if method signature lies "I return SomeClass by value" but actually there is no 'return' then construct-destruct asymmetry results! nathan
10:38 Re: c++/8064: unable to build pwlib 1.3.3 with g++ 3.0 nathan
10:36 Re: c++/8067: g++ 3.2 internal error: Segmentation fault Pop Sébastian
10:21 Re: c/8002: internal compiler error: in trunc_int_for_mode, at explow.c:54 (Alpha) rth
10:16 c++/8099: Friend classes and template specializations bangerth
10:10 Re: c++/8033: compile error when calling base class protected constructor from derived class function nathan
10:07 Re: c++/7991: Exception in destructor gets caught twice nathan
09:56 Re: c++/8053: don't called copy constructor nathan
09:56 Re: c++/8067: g++ 3.2 internal error: Segmentation fault Reichelt
08:46 c++/8098: gcc is crashing fojtik
07:56 optimization/8097: ICE in flow_depth_first_order_compute, at cfganal.c:973 spigel
07:36 libstdc++/8096: deque::at() throws std::range_error instead of std::out_of_range johnb
06:44 Re: bootstrap/5508: ARM cross-compiler build fails due to compiler error rearnsha
06:42 Re: debug/7032: arm-elf-gcc 3.1 generates wrong DWARF-2, unlike 3.0.4 rearnsha
06:38 Re: target/4702: arm-elf-gcc generates undefined for __gxx_personality_sj0 rearnsha
06:35 Re: bootstrap/5143: build of linux x arm seg faults cc1 in libstdc++-v3/src rearnsha
05:58 Re: debug/5544: i386-linux hosted arm-elf cross fails to create dwarf2 debug info rearnsha
05:50 Re: target/4024: gcc 3.0 arm-coff is unable to build executables, undefined symbols in libgcc2.c rearnsha
05:46 debug/8095: missing dwarf info for parent class tom.horsley
05:39 Re: other/7249: -Wl, and -Xlinker options to arm-aout-gcc rearnsha
05:36 debug/8094: bad dwarf for inlined constructors tom.horsley
05:26 c/8093: Wrong warning by gcc suggests adding dead code to end of function andreaha-bugs
05:16 Re: bootstrap/6777: can't cross-compile latest CVS GCC for linux-arm on linux-x86 rearnsha
05:11 Re: target/6920: gcc-arm-elf v3.1 Wrong assembler code with -mthumb -Os (-O2) rearnsha
05:10 Re: target/6916: Wrong assembler code for ARM/Thumb rearnsha
05:08 Re: target/3218: ARM/Thumb: Illegal byte-oriented stack instructions rearnsha
05:04 Re: target/5531: [ARM/Thumb] gcc 3.0.2 -O3 -mthumb gererates invalid asm instructions rearnsha
04:58 Re: target/7240: gcc 3.1 ARM thumb target generates 32bis code sometimes rearnsha
04:56 Re: c++/7929: ICE on struct initialization Andreas Rottmann
03:06 Re: c++/7944: gcc 3.2: Internal compiler error in Reichelt
02:56 Re: c++/7944: gcc 3.2: Internal compiler error in find_reloads_toplev, at reload.c:4462 Reichelt
02:46 Re: c++/7929: ICE on struct initialization Reichelt
02:36 Re: c++/7647: Internal compiler error Reichelt
01:26 c/8092: -fno-gcse doesn't fix computed goto problems in GCC 3.2 Bernd Paysan

September 29, 2002
16:56 other/8091: gcc is no longer installed as gcc Andrew Pinski
13:36 Re: fortran/7278: g77 "bug"; the executable misbehave sayle
13:35 Re: c/8023: Miscompilation of function grokdeclarator in c-decl.c at -O1 and above danglin
12:19 Re: c++/7743: g++-3.2 - Segmentation fault nathan
11:56 Re: c++/7788: g++-3.2 internal error: Segmentation fault Pop Sébastian
11:46 c++/8090: std::ofstream::write() wont compile when passed unsigned char[] as an argument in gcc-3.2 jsantiago
11:36 c++/7788 nathan
11:28 Re: c++/7788: g++-3.2 internal error: Segmentation fault nathan
11:26 c++/8089: c++ code with syntax error causes internal compiler error segfault jsantiago
11:19 Re: c/8083: GCC 3.2 Optimization bug nathan
10:44 Re: c++/7788: g++-3.2 internal error: Segmentation fault nathan
10:16 c/8083 GCC Aliasing bug Bruce Korb
09:42 Re: optimization/7147: ifcvt.c problem (regression) sayle
09:40 Re: middle-end/7245: ICE in find_reloads sayle
08:46 ada/8088: Internal error in GCC 3.2 ada compiler ash
08:06 Re: c++/7679: The compiler crashes wen a right parentesis is missing Pop Sébastian
08:05 Re: target/6362: mips-irix6 gcc-3.1 C testsuite failure with -mips4 in compile/920501-4.c ghazi
08:04 Re: target/8084: Regression: mips-sgi-irix6.5 failure in execute/20001124-1.c w/-O3 ghazi
08:04 Re: target/8085: Regression: mips-sgi-irix6.5 failure in execute/921117-1.c w/-O2 ghazi
08:04 Re: target/6222: mips-irix6 gcc-3.1 testsuite failure in gcc.c-torture/execute/20020307-2.c ghazi
08:03 Re: target/8086: Regression: mips-sgi-irix6.5 failure in execute/ieee/fp-cmp-5.c w/-O -mips4 ghazi
07:46 Re: c++/7721: Very simple (but incorrect) template chokes g++ Gabriel Dos Reis
03:46 Re: c++/7721: Very simple (but incorrect) template chokes g++ Pop Sébastian
02:16 Re: c++/7788: g++-3.2 internal error: Segmentation fault Pop Sébastian
01:36 Re: c++/7754: ICE SIGSEGV on union with template parameter Pop Sébastian
00:44 Re: libstdc++/7920: std::numeric_limits<char>::digits10 is incorrect (7, not 3) paolo

September 28, 2002
22:56 Re: c++/7807: g++ 3.2 Fails to compile legal code that compiled OK with g++ 3.1 Pop Sébastian
21:46 target/8087: sparc-sun-solaris2.7 C testsuite failures in execute/20020720-1.c w/-m64 or on sparcv9/sparc64 ghazi
18:47 Re: java/7738: cannot build jython from source green
18:46 target/8086: Regression: mips-sgi-irix6.5 failure in execute/ieee/fp-cmp-5.c w/-O -mips4 ghazi
18:06 target/8085: Regression: mips-sgi-irix6.5 failure in execute/921117-1.c w/-O2 ghazi
17:56 target/8084: Regression: mips-sgi-irix6.5 failure in execute/20001124-1.c w/-O3 ghazi
16:56 Re: c/8083: GCC 3.2 Optimization bug Bruce Korb
15:56 Re: c/8083: GCC 3.2 Optimization bug Bruce Korb
15:06 Re: c/8083: GCC 3.2 Optimization bug Bruce Korb
14:56 c/8083: GCC 3.2 Optimization bug bkorb
10:46 other/8082: Error when building powerpc-eabi target b.colvin
10:46 Re: fortran/7388: Incorrect output with 0 based array of characters. Hans-Peter Nilsson
10:26 c/8081: ICE using GNU C nested functions. naveens
09:55 Re: c++/7994: <synopsis of the problem (one line)> lerdsuwa
08:36 Re: c++/8076: -Wmissing-declarations is C-only, conflicts with documentation Gabriel Dos Reis
08:30 Re: fortran/7179: No error on DIMENSION A(250 000, 250 000) on 32-bit target. toon
08:29 Re: fortran/7388: Incorrect output with 0 based array of characters. toon
08:16 c++/8080: g++ 3.3 ICE in make_decl_rtl snyder
07:36 Re: c++/8078: Ice on illegal class definition lerdsuwa
07:36 Re: c++/8079: Ice on illegal class definition lerdsuwa
07:34 Re: c++/7923: g++ - inline cast of double to long returns incorrect value lerdsuwa
07:26 c++/8079: Ice on illegal class definition Peter Schmid
07:26 c++/8078: Ice on illegal class definition Peter Schmid
07:25 Re: c++/7931: [Regression] The compiler ices on some legal code lerdsuwa
07:22 Re: c++/7939: ICE on invalid template usage lerdsuwa
07:20 Re: c++/7959: g++ 3.3: ICE in cp_expr_size lerdsuwa
07:18 Re: c++/7964: g++ 3.3: ICE in build_base_path lerdsuwa
07:16 Re: c++/7965: Mistaken attempt to call a class template default constructor lerdsuwa
07:11 Re: c++/7975: Segmentation fault lerdsuwa
07:08 Re: c++/7982: core dump due to recursive definition (using stl set) lerdsuwa
07:06 Re: c++/8006: ice in mangle_conv_op_name_for_type boost regression lerdsuwa
07:04 Re: c++/7983: ICE for friend declaration using typedef in class template lerdsuwa
07:03 Re: c++/7994: <synopsis of the problem (one line)> lerdsuwa
07:00 Re: c++/7996: [parser] Parse error in throw statement with parenthesis lerdsuwa
06:57 Re: c++/8007: Internal compiler error in walk_tree lerdsuwa
06:51 Re: c++/8020: comma instead of bracket produces ice lerdsuwa
06:45 Re: c++/8057: Templates/non-templates and warnings about statements without effects lerdsuwa
06:42 Re: c++/8059: g++ SEGV while compiling lerdsuwa
06:38 Re: c++/8061: ICE lerdsuwa
06:34 Re: c++/8066: ICE when compiling incorrect template class initialization lerdsuwa
06:32 Re: c++/8067: g++ 3.2 internal error: Segmentation fault lerdsuwa
06:16 preprocessor/8077: Problems with -o option, unrecognized option -auxbase-strip Peter Schmid

September 27, 2002
17:36 preprocessor/8055 zack
17:36 preprocessor/8055 zack
17:33 Re: preprocessor/8055: PATCH: cpp0 dies with SIG11 when building FreeBSD kernel zack
16:46 c++/8076: -Wmissing-declarations is C-only, conflicts with documentation austern
15:56 Re: preprocessor/8055: CPP0 segfault on FreeBSD + PATCH Mark Mitchell
15:16 Re: preprocessor/8055: CPP0 segfault on FreeBSD + PATCH Zack Weinberg
14:56 other/8075: __builtin_ia32_* functions are missing for MOVDQA and MOVDQU iano
14:46 optimization/7520 rth
13:56 Re: preprocessor/8055: CPP0 segfault on FreeBSD + PATCH Mark Mitchell
13:16 Re: preprocessor/8055: CPP0 segfault on FreeBSD + PATCH Alexander Kabaev
12:56 Re: preprocessor/8055: CPP0 segfault on FreeBSD + PATCH Zack Weinberg
11:36 Re: java/8063: Compiler chokes with -O3, "fatal error reading class for second time" Andrew Haley
11:27 Re: java/8025: ICE when bytecode does array access on null aph
11:26 Re: java/8063: Compiler chokes with -O3, "fatal error reading class for second time" Adam Megacz
11:26 Re: bootstrap/7615: sparc-solaris 3.1.1 builds but 3.2 does not Jeff Deifik
10:56 Re: java/8063: Compiler chokes with -O3, "fatal error reading class for second time" Andrew Haley
10:46 Re: java/8063: Compiler chokes with -O3, "fatal error reading class for second time" Adam Megacz
10:41 Re: other/8058: unrecognizable insn rth
10:06 Re: c++/5050: template instantiation depth exceeds/maybe recursion problem Tim Bagot
09:30 Re: c++/8070: Gcc [ throw generate core dump ( TRU64 5.1 ) ] pme
09:16 Re: libstdc++/8071: basic_ostream::operator<<(streambuf*) loops forever if streambuf::underflow() leaves gptr() NULL Jonathan Lennox
08:56 libstdc++/8071: basic_ostream::operator<<(streambuf*) loops forever if streambuf::underflow() leaves gptr() NULL lennox
08:46 Re: java/8063: Compiler chokes with -O3, "fatal error reading class for second time" Tom Tromey
08:25 Re: java/8063: Compiler chokes with -O3, "fatal error reading class for second time" aph
07:36 Re: libstdc++/7989: ios::showbase doesn't work when outputting 0 Jonathan Lennox
07:26 c++/8070: Gcc [ throw generate core dump ( TRU64 5.1 ) ] eric.thomas
04:26 bootstrap/8069: won't make java ger
00:46 c/8068: GCC 2.96 and 3.x release crach (cc1) with the attached code Laurent.Deniau
00:06 c++/8067: g++ 3.2 internal error: Segmentation fault y_fedor

September 26, 2002
23:56 c++/8066: ICE when compiling incorrect template class initialization d98peter
21:18 Re: optimization/7335: Sparc: ICE in verify_wide_reg (flow.c:557) with long double and optimization davem
21:16 optimization/7335 davem
21:16 optimization/7335 davem
20:18 Re: c++/8040: g++ with -O3 produces duplicate symbol rth
20:16 c++/8064: c++ ../common/pchannel.cxx:1001: Internal error: Segmentation fault olivier at home
20:12 Re: c/8030: strange behaviour of side effect operator rth
19:46 java/8063: Compiler chokes with -O3, "fatal error reading class for second time" adam
18:36 other/8062: double precision loads and stores missing from xmmintrin.h iano
18:15 Re: c++/5538: c++ internal compiler error in subst_stack_regs_pat, at reg-stack.c: 1397 rth
18:14 Re: target/6197: gcc3.0.3 error: it says:Internal compiler error in subst_stack_regs_pat, at reg-stack.c:1397 rth
18:11 Re: optimization/8044: gcc 3.1.1 -O2 error: "Internal compiler error in subst_stack_regs_pat, at reg-stack.c:1441" rth
18:10 Re: c/7160: gcc 3.1 gives an ICE when optimizing valid code rth
17:30 Re: optimization/7520: internal compiler error in verify_local_live_at_start rth
16:36 c++/8061: ICE dave
15:54 Re: optimization/7335: Sparc: ICE in verify_wide_reg (flow.c:557) with long double and optimization davem
15:16 Re: java/8025: ICE when bytecode does array access on null Eric Blake
15:05 Re: bootstrap/8060: configure/make preference for /usr/ccs/bin/{as|ld} davem
14:56 bootstrap/8060: configure/make preference for /usr/ccs/bin/{as|ld} chuck
14:56 c++/8059: g++ SEGV while compiling tomek
13:26 other/8058: unrecognizable insn busa.blade
12:44 Re: libstdc++/7989: ios::showbase doesn't work when outputting 0 paolo
11:56 c++/8057: Templates/non-templates and warnings about statements without effects bangerth
11:56 c++/8056: Friends and partial specializations bangerth
08:26 preprocessor/8055: CPP0 segfault on FreeBSD + PATCH ak03
08:09 Re: c++/8031: ICE in comptypes, at cp/typeck.c:913 lerdsuwa
08:06 Re: c++/8036: internal compiler error lerdsuwa
08:00 Re: c++/8046: ICE on (admittedly very silly) input lerdsuwa
03:42 Re: other/7619: Compilation in Sparc fails with message "configure: error: ../../../../gcc-3.2/libjava/libltdl/configure failed for libltdl" davem
03:40 Re: middle-end/7617: shared libgcc binary incompatibility on sparc-sun-solaris2.8 davem
03:36 Re: bootstrap/7615: sparc-solaris 3.1.1 builds but 3.2 does not davem
03:30 Re: c/7407: libpng triggers ICE on sparc-sun-solaris2.8 davem
03:27 Re: target/7842: [REGRESSION] sparc code gen bug davem
03:26 target/7842 davem
03:26 target/7842 davem
03:26 c++/8054: Object layout: excess padding bytes grigory
03:26 target/7842 davem
03:26 target/7842 davem
03:22 Re: target/7842: [REGRESSION] sparc code gen bug davem

September 25, 2002
23:56 Re: libstdc++/7995: ICE in gcc cvs trunk 20020921 when compiling libstdc++-v3/src/complex_io.cc on sparc64-linux Christian Jönsson
21:46 c++/8053: don't called copy constructor shulga
20:16 Re: optimization/8049: SSE unaligned vector stores crash with -O0 Tim Prince
20:06 Re: c++/8040: g++ with -O3 produces duplicate symbol Andrew Pinski
19:56 Re: c++/8050: g++ instantiates template too late Marc Horowitz
19:56 Re: c++/8050: g++ instantiates template too late Marc Horowitz
19:36 target/8052: NEC v850 has bogus default insn length miles
16:46 Re: c++/8050: g++ instantiates template too late Andrew Pinski
16:16 c++/8050: g++ instantiates template too late marc
16:06 optimization/8049: SSE unaligned vector stores crash with -O0 iano
15:46 Re: c++/8047: loop with many exceptions causes segfault Andreas Kloeckner
15:46 Re: c++/8047: loop with many exceptions causes segfault Andrew Pinski
15:36 Re: c++/8047: loop with many exceptions causes segfault Andrew Pinski
15:26 other/8048: xmmintrin.h typos iano
15:06 c++/8047: loop with many exceptions causes segfault kloeckner
14:56 Re: optimization/8044: gcc 3.1.1 -O2 error: "Internal compiler error in subst_stack_regs_pat, at reg-stack.c:1441" Eric Botcazou
14:36 c++/8046: ICE on (admittedly very silly) input andrewp
14:16 libgcj/7786 tromey
14:10 Re: libgcj/7786: TimeZone.getDSTSavings() from JDK1.4 not implemented tromey
14:06 libgcj/7709 tromey
14:00 Re: libgcj/7709: NullPointerException in _Jv_ResolvePoolEntry tromey
13:36 c++/8045: Missing "unused variable" warning austern
13:26 optimization/8044: gcc 3.1.1 -O2 error: "Internal compiler error in subst_stack_regs_pat, at reg-stack.c:1441" andy
13:16 libgcj/7766 tromey
13:10 Re: libgcj/7766: ZipInputStream.available returns 0 immediately after construction tromey
12:56 Re: libgcj/7870: Incorrect constructor invoked in inherited class. Tom Tromey
12:48 Re: java/8043: gcj rejects call to legal method (getTimeInMillis) in Calendar class tromey
12:06 java/8043: gcj rejects call to legal method (getTimeInMillis) in Calendar class chris.niziol
11:36 c++/8042: g++ rejects legal code wrt "expression" templates. daniel.johnston
11:26 c++/8041: Array to pointer conversion in cast expression austern
09:26 c++/8040: g++ with -O3 produces duplicate symbol bdubbs
09:06 Re: libgcj/7870: Incorrect constructor invoked in inherited class. Ivan Gyurdiev
07:46 c/8037: GCC crashes on compiling compute.c perl_dummy
07:41 Re: libstdc++/8034: hash_map missing from namespace std paolo
06:56 c++/8036: internal compiler error meixner
05:56 c++/8035: optimizing access to a const member causes illegal code to be generated on powerpc robt
05:36 libstdc++/8034: hash_map missing from namespace std ethaky
04:36 c++/8033: compile error when calling base class protected constructor from derived class function swoh
03:56 c/8032: GCC >= 3.0 incorrectly initializes static structs in the presence of flexible arrays wolfgang.thaller
03:52 Re: c++/7538: Constructors of static members are not called always nathan
03:46 c++/8031: ICE in comptypes, at cp/typeck.c:913 V.Haisman
02:46 c/8030: strange behaviour of side effect operator achille.fouilleul
02:06 c++/8029: g++ produces ICE on kernel asm implementations of string functions kirill

September 24, 2002
19:36 c/8028: GCC 3.x __builtin_apply() passes wrong arguments achurch
19:26 libgcj/8027: SharedLibLoader is prematurely finalized, causing a core dump jsturm
17:16 c++/8026: -fstack-check dumps when throw out of scope with ostringstream Adam Fanello
16:36 java/8025: ICE when bytecode does array access on null ericb
11:16 c++/8024: G++ 3.2 vtable layout of implicit destructors is not ABI compliant uday.b.ivaturi
09:46 c/8023: Miscompilation of function grokdeclarator in c-decl.c at -O1 and above dave
09:36 c/8022: gcc 3.2 Solaris 64 bit shared libraries hyc
07:56 c++/8021: undefined reference to virtual thunk grigory
07:06 c++/8020: comma instead of bracket produces ice petridis
03:46 bootstrap/8018: 'install-headers-dir' should default to 'install-headers-cp' raul

September 23, 2002
18:26 bootstrap/8017: ICE at cp/search.c:282 building complex_io.o on sparcv9-sun-solaris2.8 lucier
18:26 c/8016: Error with level 2, -O2, optimization relson
18:26 c/8015: Error with level 1, -O1, optimization relson
18:06 c++/8014: Internal compiler error in `output_die' milgramjh
15:36 optimization/8013: writing all bitfields in a word jreiser
13:46 Re: c/8002: internal compiler error: in trunc_int_for_mode, at explow.c:54 (Alpha) Falk Hueffner
12:26 Re: java/7763: ICE on stray semicolon inside statement tromey
11:26 optimization/8012: Internal Compiler Error on vax-netbsdelf-gcc: error: Wrong amount of branch edges after unconditional jump 0 matt
11:26 target/8011: linker searches for a non-existent gcrt0.o on 64 bit HPUX11.00 georgaj
11:16 fortran/8010: Internal Compiler Error on vax-netbsdelf-g77 matt
11:13 Re: libgcj/7870: Incorrect constructor invoked in inherited class. tromey
11:06 libgcj/6576 tromey
11:01 Re: libgcj/6636: libgcj doesn't test gij tromey
10:58 Re: libgcj/6576: java.util.ResourceBundle.getResource ignores locale tromey
08:02 Re: c++/7992: Internal compiler error in arm_rtx_costs rearnsha
07:36 Re: c++/7992: Internal compiler error in arm_rtx_costs Iker Arizmendi
03:46 Re: libstdc++/7995: ICE in gcc cvs trunk 20020921 when compiling libstdc++-v3/src/complex_io.cc on sparc64-linux Christian Jönsson
00:56 bootstrap/8009: Can't find library for -lintl ralf.hildebrandt
00:16 optimization/8008: gcc pushes arguments without updating SP matt

September 22, 2002
23:13 Re: java/8003: gcj segfaults on simple java line of code tromey
18:26 c++/8007: Internal compiler error in walk_tree sneechy
18:06 c++/8006: ice in mangle_conv_op_name_for_type boost regression Peter Schmid
17:52 Re: libgcj/6217: java.util.ResourceBundle.getBundle seg-faults while reading a "zipped" jar file. tromey
10:56 target/8004: All C++ binaries crash in __register_frame_info_bases on Sparc Solaris 2.7 aaronw
10:09 Re: bootstrap/7770: m68k ICE during bootstrap kristerw
09:56 java/8003: gcj segfaults on simple java line of code hesham
09:56 c/8002: Alpha: internal compiler error: in trunc_int_for_mode, at explow.c:54 Falk Hueffner
09:55 Re: bootstrap/3714: gcc 3.0 ICE during bootstrap for arm-unknown-netbsd1.5.1 kristerw

September 21, 2002
13:45 Re: target/6018: [ARM] crash in arm_rtx_consts rearnsha
13:41 Re: c++/7992: Internal compiler error in arm_rtx_costs rearnsha
13:37 Re: optimization/7930: ICE in ARM backend rearnsha
11:06 c++/7996: Parse error in throw statement with parenthesis marcus
09:23 Re: target/4866: [ARM; C++] doubles not passed to cout correctly rearnsha
09:21 Re: target/491: [ARM; 2.95] unrecognizable insn with -march=armv4 rearnsha
06:36 libstdc++/7995: ICE in gcc cvs trunk 20020921 when compiling libstdc++-v3/src/complex_io.cc on sparc64-linux christian
06:16 c++/7994: <synopsis of the problem (one line)> V.Haisman
04:50 Re: c++/7745: gcc 3.2 rejects legal member template overload lerdsuwa
04:09 Re: c/7677: Gcc 3.2 generate the wrong target machine code, TOO, making the target crash rearnsha

September 20, 2002
17:56 objc/7993: private variables cannot be shadowed in subclasses lminder
14:31 Re: target/5717: ppc-eabi-g++ emits wrong relocation type for typeid(std::bad_exception) when -meabi specified. dje
14:30 Re: libstdc++/7383: atomic operations not atomic on ppc405 dje
14:28 Re: bootstrap/7990: tradcif.y fails on AIX 4.3.3 build using native compiler dje
14:26 Re: other/7771: Build on AIX fails dje
14:24 Re: c++/7663: AIX-LD fails with TOC overflow dje
14:22 Re: bootstrap/7634: gcc-3.2/aix-4.2.1: Core dump while compiling libgcc/_muldi3.o dje
13:46 c++/7992: Internal compiler error in arm_rtx_costs iker
13:26 Re: c/7677: Gcc 3.2 generate the wrong target machine code, TOO, making the target crash Daniel Jacobowitz
13:16 c++/7991: Exception in destructor gets caught twice nospam
12:06 bootstrap/7990: tradcif.y fails on AIX 4.3.3 build using native compiler herbie
12:06 Re: preprocessor/7988: POSIX broken in gcc cs720 Administrator
10:26 Re: preprocessor/7988: POSIX broken in gcc Neil Booth
09:16 libstdc++/7989: ios::showbase doesn't work when outputting 0 lennox
08:06 preprocessor/7988: POSIX broken in gcc cs720
06:36 c++/7987: Linker command has wrong directory order smithjc5
04:46 libstdc++/7986: Problems with demangling (__cxa_demangle()) johnb
04:06 ada/7985: make gnatlib fails on mips-sgi-irix5.3 Jan-Jaap.vanderHeijden
02:36 ada/7984: Internal compiler error in loc_descriptor_from_tree duncan.sands

September 19, 2002
17:36 Re: bootstrap/7899: make bootstrap fails on configure-target-libiberty jeff deifik
17:16 c++/7983: ICE for friend declaration using typedef in class template austern
16:56 c++/7982: core dump due to recursive definition (using stl set) jolly
16:26 Re: c++/7981: -Wsequence-point broken for C++ Joseph S. Myers
16:16 c++/7981: -Wsequence-point broken for C++ austern
14:16 bootstrap/7980: configure: error: *** unable to determine endianness m.kovalenko
13:46 bootstrap/7979: OpenUNIX8/Unixware stage 3 failing in eh_alloc.cc wantbottom
13:26 c++/7978: gcc 3.2 dynamic link path problem on Solaris 8 with g++ eggert
12:36 c++/7977: g++-3.2 has problems with structs in anonymous union ehlert
12:03 Re: middle-end/7720: gcc Internal compiler error when compiling binutils-2.13/gas/config/tc-ppc.c with -O2 dalej
12:01 Re: optimization/7339: ICE on simple code with GCC 3.1 dalej
12:00 Re: middle-end/7705: Internal compiler error in simplify_subreg dalej
07:56 Re: fortran/7681: ICE in compensate_edge, at reg-stack.c:2591 bud davis
07:10 Re: c++/7841: gcc accepts illegal member function syntax for template classes lerdsuwa
06:46 Re: preprocessor/7976: macro definition Andreas Schwab
06:20 Re: preprocessor/7976: macro definition neil
06:13 Re: preprocessor/7976: macro definition neil
06:11 Re: preprocessor/7976: macro definition neil
04:46 preprocessor/7976: macro definition stoppel
01:26 c++/7975: Segmentation fault adrians

September 18, 2002
18:36 Re: middle-end/7315: DEC floating point support in real.c is broken Richard Henderson
18:21 Re: c/7963: gnu99 doesn't allow compound literals for static initializers rth
16:36 Re: libstdc++/7972: > v.size(), where v is vector, incorrectly returns true Phil Edwards
16:16 Re: middle-end/7315: DEC floating point support in real.c is broken John David Anglin
16:06 c++/7974: cannot reference an element of a vector in a class object from an iterator for a vector of such objects (the -> operator fails) nixonj
16:06 c/7973: installation failure on Solaris7 alex
15:56 Re: optimization/7390: ICE with gcc 3.1, happens only with -marchathlon Steven Bosscher
15:46 Re: middle-end/7315: DEC floating point support in real.c is broken Steven Bosscher
15:36 Re: middle-end/7675: Internal compiler error in fixup_var_refs_1 Steven Bosscher
14:56 Re: middle-end/7720: gcc Internal compiler error when compiling binutils-2.13/gas/config/tc-ppc.cwith -O2 Steven Bosscher
14:46 Re: libstdc++/7961: compare( char *) implemented incorrectly. John Carter
14:36 Re: libstdc++/7961: compare( char *) implemented incorrectly. John Carter
14:11 Re: web/2281: Bug in the "Suboptimal code for complex conditionals" proposal zack
09:16 libstdc++/7972: > v.size(), where v is vector, incorrectly returns true nathan.holladay
08:28 Re: c++/7969: Internal error #19990916. paolo
08:25 Re: c++/7968: Internal error #19990916. paolo
08:22 Re: optimization/7967: optimization produces wrong code (ARM) rearnsha
08:06 target/7971: Fixing pthread.h for Solaris v2.6 ahelm
07:06 optimization/7967 rearnsha
07:06 optimization/7967 rearnsha
06:56 debug/7970: Arc profiling doesn't work reliably on global destructors asuffield
06:26 c++/7969: Internal error #19990916. prashkatti_2000
06:26 c++/7968: Internal error #19990916. prashkatti_2000
05:36 optimization/7967: optimization produces wrong code (ARM) jeroen.dobbelaere
05:28 Re: bootstrap/7868: xgcc: Internal error: Bus Error (program as) hp
03:22 Re: pending/7918: Questionnaire neil
03:19 Re: preprocessor/7962: -traditional's handling of unbalanced " in unused #if blocks neil
02:16 libgcj/7966: install gcc3.2 on SCO 5.0.5--some bugs fixed, but libgcj can't be generated marshalking
01:46 Re: libstdc++/7961: compare( char *) implemented incorrectly. Andreas Schwab
00:56 Re: preprocessor/7962: -traditional's handling of unbalanced " in unused #if blocks Neil Booth
00:46 Re: preprocessor/7962: -traditional's handling of unbalanced " in unused #if blocks Mike Stump
00:16 c++/7965: Mistaken attempt to call a class template default constructor nmusatti

September 17, 2002
23:26 Re: preprocessor/7962: -traditional's handling of unbalanced " in unused #if blocks Zack Weinberg
23:16 c++/7964: g++ 3.3: ICE in build_base_path snyder
22:56 c/7963: gnu99 doesn't allow compound literals for static initializers mrs
22:56 preprocessor/7962: -traditional's handling of unbalanced " in unused #if blocks mrs
20:36 libstdc++/7961: compare( char *) implemented incorrectly. john.carter
19:56 c/7960: GCC-3.2 for ARM does not work with c-code interrupt function dong_geming
19:11 Re: c/7958: gnu99 doesn't allow compound literals for static initializers rth
19:07 Re: c/7955: Incorrect & for unsigned long long rth
18:56 c++/7959: g++ 3.3: ICE in cp_expr_size snyder
18:46 c/7958: gnu99 doesn't allow compound literals for static initializers mrs
18:26 other/7957: change request: more flexible %D specs directive bh
18:06 other/7956: unreadable error on -m64 with --disable-multilib bh
16:56 c/7955: Incorrect & for unsigned long long lshankar
16:39 Re: optimization/7829: -march=athlon causes GCC3 to fail with ICE rth
14:46 c++/7954: g++ 2.95.4 bug while compiling QT library for Linux 2.4.19 stephane.duverger
14:29 Re: libf2c/7384: DATE_AND_TIME milliseconds field inactive on Windows toon
14:06 java/7950 tromey
14:01 Re: java/7950: jc1 parses files ending in 0x0d incorrectly tromey
12:46 Re: preprocessor/7947: cpp0 -std=gnu99 rejects # comments Marcus Brinkmann
12:36 optimization/7953: labels-as-values, GCSE, and tail de-duplication slowdowns anton
12:26 Re: preprocessor/7947: cpp0 -std=gnu99 rejects # comments Neil Booth
11:56 Re: preprocessor/7947: cpp0 -std=gnu99 rejects # comments Marcus Brinkmann
11:46 c++/7952: obnoxious warning on -I bh
11:26 Re: c++/7841: gcc accepts illegal member function syntax for template classes Martin Sebor
11:22 Re: preprocessor/7947: cpp0 -std=gnu99 rejects # comments neil
10:56 Re: c++/7435: g++ rejects certain integral constant expressions Martin Sebor
10:36 optimization/7951: ICE on -march=pentium4 -O2 -mfpmath=sse krelisnet
09:26 Re: optimization/7829: -march=athlon causes GCC3 to fail with ICE Alexander Kabaev
09:07 Re: objc/3133: Invalid loader fixup for symbol "__objc_class_name_Object" nicola
08:56 Re: c++/7935: floating point test of ">" fails on -O0, not on -O{1,2,3} for certain values double precision float accessed by operator[] in wrapper class (on ix86) Richard Henderson
08:36 Re: objc/3133: Invalid loader fixup for symbol "__objc_class_name John David Anglin
08:27 Re: c/7948: gcc fails to fault gnu extension with -std=c99 jsm28
08:24 Re: c/7946: -std=gnu99 and casted empty srtuct initializers jsm28
08:14 Re: libobjc/1077: libobjc's Makefile tries to make thr-.o from thr-.c nicola
08:06 Re: objc/3133: Invalid loader fixup for symbol "__objc_class_name_Object" nicola
07:32 Re: objc/4527: Objc 3.0.1 segfaults on Linux i386 nicola
07:29 Re: objc/7836: problem casting id as id<protocol> nicola
07:28 Re: objc/7808: Compiler ignores cast from 'id<Protocol>' to 'id' or from 'id<Protocol1>' to 'id<Protocol2>' nicola
07:26 Re: objc/7014: Wrong compiler's warning nicola
07:23 Re: java/3087: Re: java eh crash in gcc3 branch green
07:22 Re: java/6699: recompile xerces with gcj green
07:16 java/7950: jc1 parses files ending in 0x0d incorrectly green
07:06 c/7949: Mishandled double != 0.0 at -O1 Ake.Sandgren
06:56 c/7948: gcc fails to fault gnu extension with -std=c99 Richard Earnshaw
06:36 preprocessor/7947: cpp0 -std=gnu99 rejects # comments marcus
06:26 c/7946: -std=gnu99 and casted empty srtuct initializers marcus
06:16 Re: c++/7935: floating point test of ">" fails on -O0, not on -O{1,2,3} for certain values double precision float accessed by operator[] in wrapper class (on ix86) Simon Alexander
02:26 c++/7945: ICE at cp/cp-lang.c:130 for struct initialization msmakela
01:16 c++/7944: gcc 3.2: Internal compiler error in find_reloads_toplev, at reload.c:4462 ulrich

September 16, 2002
23:06 Re: fortran/3924: g77 generates code which is rejected by GAS if COFF debugging info is requested rth
23:06 fortran/3924 rth
22:26 Re: c++/7935: floating point test of ">" fails on -O0, not on -O{1,2,3} for certain values double precision float accessed by operator[] in wrapper class (on ix86) rth
21:36 c++/7943: Compilation gives many strange errors postmaster
21:16 Re: c++/6705: Internal Compiler Error ljrittle
21:10 Re: optimization/7829: -march=athlon causes GCC3 to fail with ICE ljrittle
20:59 Re: c++/7925: Problem with compiling Openoffice on FreeBSD ljrittle
20:46 libstdc++/7942: ostream core dump with hex/internal/showbase formatted output llib
20:26 optimization/6984 amodra
20:26 optimization/7130 amodra
20:02 Re: libstdc++/7922: Problems with rope and hash_map ljrittle
19:36 c/7941: GCC-3.2 does not work well with c-code interrupt function dong_geming
17:06 Re: libstdc++/7922: Problems with rope and hash_map Peter Schmid
16:46 target/7940: Test gcc.dg/nest.c fails on cygwin David.Billinghurst
16:33 Re: libstdc++/7922: Problems with rope and hash_map ljrittle
14:56 c++/7939: ICE on invalid template usage kparz
14:26 libgcj/7938: java-rmi-problem norbertf
13:16 c++/7640 nathan
13:14 Re: c++/7640: g++ 3.3 ICE: SEGV in integer_zerop nathan
13:06 c++/7718 nathan
12:56 Re: c++/7718: 'complex' template instantiation causes internal compiler error (gcc 3.1, gcc 3.2) nathan
12:30 Re: c++/7640: g++ 3.3 ICE: SEGV in integer_zerop nathan
12:26 c++/7935: floating point test of ">" fails on -O0, not on -O{1,2,3} for certain values double precision float accessed by operator[] in wrapper class (on ix86) simon
12:21 Re: c++/6645: Bad code generation with -O1 and STL nathan
12:19 Re: c++/7466: gcc does not create a destructor call for a temporary nathan
12:16 middle-end/7934: definition of static member for template class missing in obj file michael_gu
12:16 middle-end/7933: Internal compiler error in eliminate_regs, at reload1.c:2608 mike.ward
10:56 c++/7932: Emit debug information about non-type template parameters bangerth
10:16 c++/7931: [Regression] The compiler ices on some legal code Theodore.Papadopoulo
09:53 Re: libstdc++/7926: i486 instructions in header files make c++ programs crash on i386 pme
07:36 c++/7015 nathan
07:16 optimization/7930: ICE in ARM backend scottb
07:16 Re: c/7860: few new suggested warnings Jarkko Hietaniemi
06:46 c++/7929: ICE on struct initialization a.rottmann
06:26 Re: c++/7538: Constructors of static members are not called always Christian Neubauer
06:08 Re: c++/7538: Constructors of static members are not called always nathan
05:36 c/7928: Regression: spurious external references generated with switch statement ghazi
05:36 target/7927: Internal compiler error when bootstrapping 3.2 for sparc64-sun-solaris2.9 joe
04:56 Re: c++/7538: Constructors of static members are not called always Nathan Sidwell
01:46 Re: c++/7538: Constructors of static members are not called always Christian Neubauer
01:15 Re: c++/7015: certain __asm__ constructs rejected nathan
00:56 Re: c/7888: wrong code produced by GCC 3.1 Nathan Sidwell
00:52 Re: c++/5486: ICE in modified_type_die, at dwarf2out.c:7549 nathan
00:26 libstdc++/7926: i486 instructions in header files make c++ programs crash on i386 mschill4
00:16 Re: c++/5882: g++ 2.95.2 craches with fatal signal 11 compiling very large function Jörg Eckart
00:16 Re: optimization/7924: internal compiler error Andrew Pinski
00:06 c++/7925: Problem with compiling Openoffice on FreeBSD kwiatek

September 15, 2002
23:56 optimization/7924: internal compiler error mschill4
21:16 c++/7923: g++ - inline cast of double to long returns incorrect value Ian.Nowland
17:56 Re: c/7888: wrong code produced by GCC 3.1 Andrew Pinski
16:16 Re: c++/5486: ICE in modified_type_die, at dwarf2out.c:7549 John David Anglin
16:00 Re: c++/7917: ICE on ilegal code nathan
15:56 libstdc++/7922: Problems with rope and hash_map Peter Schmid
15:54 Re: c++/3086: [parser]Suggested extension to a template related warning. nathan
15:52 Re: c++/3178: Dump format for typedefs of class types is very awkward nathan
15:48 Re: c++/3639: gcov .bb info incorrect for C++ static initialization nathan
15:42 Re: c++/4494: Possible problem with compiler warnings on main() nathan
15:40 Re: c++/4642: Very strange annoying warning about templates nathan
15:39 Re: c++/4652: [parser]anonymous struct names conflict with namespaces nathan
15:06 Re: c++/7904: Internal compiler error in compensate_edge, at reg-stack.c nathan
13:35 Re: c/7860: few new suggested warnings jsm28
13:31 Re: c/7508: GCC refuses to compile a declartion right after a 'case' in switch jsm28
13:29 Re: c/6970: Unable to compile gcc-2.x.x using the make utility in DEC platform. jsm28
13:26 RE: c++/7904: Internal compiler error in compensate_edge, at reg-stack.c Quentin Bennett
13:21 Re: c++/4778: g++ 3.0.* bug nathan
13:13 Re: ada/6919: Ada patches applied to 3.1 branch only jsm28
13:09 Re: ada/6558: Wrongly reverted patches jsm28
12:41 Re: c++/4818: Segmentation fault nathan
12:37 Re: c++/4898: adding an option to verify exception specifications nathan
12:35 Re: c++/4973: weird template instantiation nathan
12:29 Re: c++/5086: -Wctor-dtor-privacy gives spurious warnings nathan
12:26 Re: c++/5284: missing warning on uninitialized variable nathan
12:25 Re: c++/5310: Wierd warnings about using (int)NULL nathan
12:23 Re: c++/5406: --pedantic-error fails things --pedantic likes nathan
12:21 Re: c++/5436: explicit instatiation nathan
12:16 Re: c++/5486: ICE in modified_type_die, at dwarf2out.c:7549 nathan
12:13 Re: c++/5509: -Wunused-parameter and tree inlining nathan
12:11 Re: c++/5520: There's a warning I miss with "if{} else{}" statement nathan
12:08 Re: c++/5525: C++ parse fails when simple class header included with GCC_EXEC_PREFIX nathan
12:06 Re: c++/5554: corrupt this pointer after function call nathan
12:04 Re: c++/5577: [new-parser] Parse error nathan
11:58 Re: c++/5605: Wrong constructor is called when anonymous object is created in catch block. nathan
11:55 Re: c++/5818: cc1plus crashes if it runs out of memory nathan
11:48 Re: c++/5882: g++ 2.95.2 craches with fatal signal 11 compiling very large function nathan
11:36 Re: c++/6079: Access error message discrepancy between template & plain class nathan
11:31 Re: c++/6088: templates calling static member functions won't compile nathan
11:29 Re: c++/6095: [parser] New C++ parser nathan
11:28 Re: c++/6125: template parameter of type ptr-to-member does not match nathan
11:26 c++/7919 nathan
11:25 Re: c++/6216: seg fault when using new to create a memory array nathan
11:23 Re: libstdc++/6257: C-library symbols enter global namespace nathan
11:07 Re: c++/7919: using declarations screw this pointer nathan
08:26 Re: c/7860: few new suggested warnings Jarkko Hietaniemi
05:46 c/7921: gcc 3.2 ICE when compiling mozilla on SunBlade 100 yasuaki
05:35 Re: c++/6321: no warning for bad main function declaration nathan
05:31 Re: c++/6334: Internal compiler error in `reg_save', at dwarf2out.c:951 nathan
05:29 Re: c++/6337: Fails to distinguish between operator[](int) and operator T*(). nathan
05:17 Re: c++/6355: g++ 2.95.4 allows creation of pure virtual object by autoconversion nathan
05:16 Re: c++/6372: private inheritance makes class totally inaccessible, even as parameter nathan
05:14 Re: c++/6375: GCC errouneously chooses operators nathan
05:10 Re: c++/6402: Qualified reference to variable causes copy nathan
05:07 Re: c++/6451: function template argument deduction wrong nathan
05:01 Re: c++/6473: g++ seg faulting compiling qt-3.0.3 nathan
05:00 Re: c++/6529: MQ and c++ nathan
04:59 Re: c++/6555: Copy constructor is called before the object (being copied) is initialized nathan
04:51 Re: c++/6599: g++ crash when compiles qt-x11-free-3.0.4/tools/designer nathan
04:49 Re: c++/6602: GCC/Linux shared lib + EH bug example nathan
04:47 Re: c++/6629: gcc 3.1 20020509 exception handling bug nathan
04:44 Re: c++/6645: Bad code generation with -O1 and STL nathan
04:38 Re: c++/6674: gcc-3.1 segfault nathan
04:34 Re: c++/6787: seg fault when loading dynamic library that contains dynamic_cast nathan

September 14, 2002
23:46 Re: c++/6857: Missing space after pointer/reference types in warning. Gabriel Dos Reis
22:36 Re: optimization/7909: ia64 warning 'Use of 'mov' may violate WAW dependency' on -O2 and above tprinceusa
20:46 libstdc++/7920: std::numeric_limits<char>::digits10 is incorrect (7, not 3) sbeasley
16:26 c++/7768 nathan
16:24 Re: c++/7768: __PRETTY_FUNCTION__ for template destructor is wrong nathan
15:54 Re: c++/5607: No pointer adjustment in covariant return types nathan
15:51 Re: c++/5622: ICEs due to host_integerp not checked before tree_cst_low nathan
15:49 Re: c++/5635: no initialization for array new with initializer nathan
15:47 Re: c++/5637: gcc/c++ won't internal error when compiling POSE (PalmOS Emulator) nathan
15:44 Re: c++/5645: gcc warns that pure virtual class not explicitly initialized nathan
15:43 Re: c++/5786: array template argument deduction from temporary nathan
15:40 Re: c++/5763: [parser]Compiler uses the wrong type nathan
15:28 Re: c++/6807: G++ doesn't recognize templated reference conversion operators nathan
15:22 Re: c++/6857: Missing space after pointer/reference types in warning. nathan
15:20 Re: c++/6859: g++ 3.1 fails to diagnose an rvalue to lvalue conversion nathan
15:11 Re: c++/6940: taking sizeof array parameter should trigger a warning nathan
15:09 Re: c++/6951: g++3 with threads and system() breaking when statically linked nathan
15:08 Re: c++/6982: outlined code in text section nathan
14:59 Re: c++/7015: certain __asm__ constructs rejected nathan
14:56 Re: c++/7019: erroneous failure to compile nathan
14:56 Re: c++/7307: -pedantic makes errors to warnings Gabriel Dos Reis
14:50 Re: c++/7023: C++ structure initialization problem if too few initializers given nathan
14:44 Re: c++/7009: please provide command line option to turn off new include warnings nathan
14:36 Re: c++/7086: g++ -O2 locks up nathan
14:26 Re: c++/7313: variable declared but not defined with "C" linkage placed in enclosing namespace at link time nathan
14:18 Re: c++/7100: Class constructors considered during argument-dependent lookup nathan
14:16 Re: c++/7105: g++ 2.95.3 misses candidate function in virtual base of class template nathan
14:14 Re: c++/7148: Seg fault with static class member nathan
13:48 Re: c++/7152: Compiler trap when comparing class instance to zero nathan
13:45 Re: c++/7188: Segfault with template class and recursive (incorrect) initalizer list. nathan
13:43 Re: c++/7191: internal compiler failure nathan
13:36 Re: c++/7307: -pedantic makes errors to warnings Neil Booth
13:11 Re: c++/7209: Faulty array dereferencing nathan
13:04 Re: c++/7228: ICE when using member template and template function nathan
13:01 Re: c++/7313: variable declared but not defined with "C" linkage placed in enclosing namespace at link time nathan
12:59 Re: c++/7311: inline functions do not give control reaches end of nathan
12:24 Re: c++/7919: using declarations screw this pointer nathan
12:17 Re: c++/7768: __PRETTY_FUNCTION__ for template destructor is wrong nathan
12:16 c++/7919: using declarations screw this pointer nathan
12:16 Re: c++/7911: Internal compiler error in force_store_init_value, at cp/typeck2.c:443 Meno.Abels
08:16 c++/7917: ICE on ilegal code V.Haisman
06:06 Re: c++/7307: -pedantic makes errors to warnings Gabriel Dos Reis
05:52 Re: libf2c/7384: DATE_AND_TIME milliseconds field inactive on Windows toon
05:16 Re: c++/7307: -pedantic makes errors to warnings nathan
05:14 Re: c++/7309: Cannot create instances of privatly inherited grand-parent classes in a method of a class. nathan
05:10 Re: c++/7346: templated conversion operator to dependent type nathan
05:09 Re: c++/7385: g++ problems with enum and __attribute__ nathan
05:05 Re: c++/7393: gcc / g++ says "Internal compiler error" nathan
05:04 Re: c++/7394: <synopsis of the problem (one line)> nathan
04:37 Re: c++/7551: g++ does not mind non-void functions which return no value. nathan
03:18 Re: c++/7835: internal compiler error lerdsuwa
02:31 Re: pending/7834: Re: Test 18_support/numeric_limits.cc execution fails on cygwin neil
02:29 Re: pending/7902: [arm-thumb] About "-fpic" neil
02:29 Re: pending/7903: [arm-thumb] About "-fpic" neil
02:28 Re: pending/7913: Congreso Internacional de Telemática, CITEL 2002 neil
02:28 Re: pending/7914: Congreso Internacional de Telemática, CITEL 2002 neil
02:28 Re: pending/7915: Congreso Internacional de Telemática, CITEL 2002 neil
01:36 Re: c++/7551: g++ does not mind non-void functions which return n ovalue. Andreas Jaeger
01:16 RE: c++/7551: g++ does not mind non-void functions which return no value. Tim Barnett

September 13, 2002
22:16 c++/7916: internal compiler error in instatiate_virtual_register_1 hope2see
17:26 Re: c++/7080: g++ ICE compiling Qt Gabriel Dos Reis
17:17 Re: c++/7080: g++ ICE compiling Qt gdr
16:56 Re: c++/7080: g++ ICE compiling Qt Janis Johnson
16:52 Re: c++/7470: Vtable: virtual function pointers not in declaration order nathan
16:39 Re: c++/7435: g++ rejects certain integral constant expressions nathan
16:35 Re: c++/7468: prototype "doesn't match" a candidate that is actually a perfect match. nathan
16:33 Re: c++/7471: exception specification violation error when using function try block nathan
16:30 Re: c++/3518: default conversion applied too soon nathan
16:29 Re: c++/7477: Type information thrown away nathan
16:26 Re: c++/7485: Documentation of "-Wreorder" is incomplete nathan
16:25 Re: c++/7497: ice on large bool array, not on small or huge array nathan
16:23 Re: c++/7517: g++ incompatible options and multiple compilations nathan
16:21 Re: c++/7518: Problem on opening a shared library with Gcc3.1.1 nathan
16:18 Re: c++/7524: "f(const float arg[3])" fails nathan
16:15 Re: c++/7538: Constructors of static members are not called always nathan
16:12 Re: c++/7546: g++: Internal compiler error in make_typename_type, at cp/decl.c:5715 nathan
16:11 Re: c++/7550: g++ 3.1 does not compile legal struct declaration under special circumstances nathan
16:07 Re: c++/7551: g++ does not mind non-void functions which return no value. nathan
16:06 Re: c++/7567: g++ 3.3 ICE in decl_jump_unsafe nathan
16:05 Re: c++/7581: ICE in grokdeclarator nathan
16:03 Re: c++/7584: Erroneous ambiguous base error on using declaration nathan
15:59 Re: c++/7590: -Wpadded causes internal warning in g++ nathan
15:56 Re: c++/7609: c++ compiler crashes when compiling libcrypto4.2 on redhat 7.0 nathan
15:54 Re: c++/7614: Warning when function returning reference to volatile called in void context nathan
15:48 Re: c++/7618: GCC 3.x vararg disallowed in virtual function nathan
15:44 Re: c++/7631: gcc 2.95.3 crashes when compiling a file in the Palm OS emulator nathan
15:40 Re: c++/7640: g++ 3.3 ICE: SEGV in integer_zerop nathan
15:18 Re: c++/7648: Incorrect error claiming that const structure member is uninitialized nathan
15:15 Re: c++/7674: unjustified syntax error when a class contains a reference AND a pointer to member nathan
15:13 Re: c++/7676: Member template function overloading problem nathan
15:11 Re: c++/7679: The compiler crashes wen a right parentesis is missing nathan
15:09 Re: c++/7684: ICE on dir.cpp from commoncpp2-0.99.7 (CommonC++ "2" nathan
15:07 Re: c++/7694: g++ gives ICE 65 when compiling legal (I think) templated code nathan
15:03 Re: c++/7704: template match difference on function pointer template args nathan
14:59 Re: c++/7707: GCC 3.1.1 Optimization incomplete/incorrect : leaks temporary object nathan
14:58 Re: c++/7466: gcc does not create a destructor call for a temporary nathan
14:56 java/7912: invalid verification error for arrays Eric Blake
14:54 Re: c++/7711: Flags -save-temps and -fmem-report togather ICEs compiler. nathan
14:39 Re: c++/7711: Flags -save-temps and -fmem-report togather ICEs compiler. nathan
14:32 Re: c++/7711: Flags -save-temps and -fmem-report togather ICEs compiler. nathan
14:30 Re: c++/7718: 'complex' template instantiation causes internal compiler error (gcc 3.1, gcc 3.2) nathan
14:28 Re: c++/7712: Problems with template templates (ice in cp_expr_size) nathan
14:27 Re: c++/7721: Very simple (but incorrect) template chokes g++ nathan
14:25 Re: c++/7722: static array of label addresses in function templates nathan
14:24 Re: c++/7801: Internal compiler error in cp_expr_size, at cp/cp-lang.c nathan
14:23 Re: c++/7850: g++-3.2 ends with "Internal compiler error" @ KDE 3.0.x nathan
14:23 Re: c++/7859: Internal compiler error at cp/cp-lang.c nathan
14:22 Re: c++/7734: ICE in cp_expr_size, at cp/cp-lang.c:130 nathan
14:20 Re: c++/7743: g++-3.2 - Segmentation fault nathan
14:18 Re: c++/7746: static members of template classes not allways constructed nathan
14:04 Re: c++/7754: ICE SIGSEGV on union with template parameter nathan
14:02 Re: c++/7760: Crash with Debian's prerelease gcc 3.2 (20020809) nathan
13:54 Re: c++/7761: gcc reports internal error code 383 on invalid namespace usage. nathan
13:53 Re: c++/7761: gcc reports internal error code 383 on invalid namespace usage. nathan
13:44 Re: c++/7764: Destructors not run during dynamic loading/unloading of libraries nathan
13:41 Re: c++/7768: __PRETTY_FUNCTION__ for template destructor is wrong nathan
13:39 Re: c++/7788: g++-3.2 internal error: Segmentation fault nathan
13:37 Re: c++/7803: Please submit a full bug report nathan
13:35 Re: c++/7807: g++ 3.2 Fails to compile legal code that compiled OK with g++ 3.1 nathan
13:30 Re: c++/7816: Wrong installation of man page g++.1 nathan
13:05 Re: c++/7911: Internal compiler error in force_store_init_value, at cp/typeck2.c:443 paolo
10:06 c++/7911: Internal compiler error in force_store_init_value, at cp/typeck2.c:443 meno.abels
09:49 Re: c++/7758: g++ crashes on operation on incomplete type lerdsuwa
09:48 Re: c++/7699: Inner class scopting not working correctly for function prototype matching lerdsuwa
09:46 Re: c++/6057: expression mangling doesn't work for operator new Richard Smith
09:45 Re: c++/7827: incorrect warning "will never be executed" when optimizing nathan
09:44 Re: c++/7703: [parser] gcc gives parse errors when compiling a class function with recursively templated default value for a function parameter lerdsuwa
09:42 Re: c++/7828: g++ 3.3: bad non-lvalue error (non_cast_lvalue_or_else) nathan
09:39 Re: c++/7855: Wrong line number specified in error / warning message nathan
09:37 Re: c++/7858: g++ rejects legal code (regression from gcc 3.*) nathan
09:35 Re: c++/7869: faults typedef redefinition in struct nathan
09:35 Re: c++/7745: gcc 3.2 rejects legal member template overload lerdsuwa
09:31 Re: c++/7841: gcc accepts illegal member function syntax for template classes lerdsuwa
09:30 Re: c++/7875: function overloading dropped for temp object from ctor nathan
09:26 Re: c++/7844: Function declarations parsed incorrectly Krzysztof Parzyszek
09:22 Re: c++/7863: Member function template argument deduction broken by declaration of name in different scope lerdsuwa
09:18 Re: c++/7866: [parser] compile error when bit field has same name as namespace lerdsuwa
09:17 Re: c++/7876: g++ doesn't diagnose One Reference Rule violation nathan
09:03 Re: c++/7844: Function declarations parsed incorrectly lerdsuwa
08:16 c++/7910: Seg fault of g++ 3.2 when compiling OpenSceneGraph 0.9.1 o.lauffenburger
08:01 Re: c++/6611: Non-weak emission of `std::__default_alloc_template[...]' on platform(s) where it should be weak gerald
07:59 Re: c++/7877: Incorrect parameter passing to specializations of member function templates nathan
07:54 Re: c++/7880: Internal compiler error when passing template class to new operator nathan
07:53 Re: c++/7885: Internal compiler error nathan
07:51 Re: c++/7886: g++ 3.2 indicates ambigous base ctor when its not ambiguous nathan
07:31 Re: c++/7904: Internal compiler error in compensate_edge, at reg-stack.c nathan
07:29 Re: c++/7320: g++ 3.2 relocation problem nathan
07:28 Re: c++/6057: expression mangling doesn't work for operator new nathan
07:27 Re: c++/6611: Non-weak emission of `std::__default_alloc_template[...]' on platform(s) where it should be weak nathan
07:25 Re: c++/6794: internal error: Segmentation fault nathan
07:24 Re: c++/7874: g++ finds otherwise names otherwise invisible by ordinary name lookup nathan
07:23 Re: c++/7906: Templated class with nested non-templated class having an operator() fails to compile nathan
06:46 optimization/7909: ia64 warning 'Use of 'mov' may violate WAW dependency' on -O2 and above ben
06:46 optimization/7908: ia64 warning 'Use of 'mov' may violate WAW dependency' on -O2 and above ben
06:16 Re: middle-end/7898: readdir_r gives bad results with gcc-3.1 and 3.2 Sadinoff, Daniel
06:12 Re: c++/7861: Failure to compile on the second attempt nathan
04:56 middle-end/7907: Exception thrown from one shared object does not get caught in a different shared object dickman
03:56 Re: c/6326: gcc compile illegal code gdr
03:56 Re: c/6326: gcc compile illegal code Gabriel Dos Reis
02:56 Re: c/7888: wrong code produced by GCC 3.1 Raul Tabasso
01:06 optimization/7120 amodra
00:46 c++/7906: Templated class with nested non-templated class having an operator() fails to compile loose

September 12, 2002
23:56 other/7114 amodra
22:26 other/7905: STLport 4.5.3 exception handling tests fail on Irix georgez
19:26 c++/7904: Internal compiler error in compensate_edge, at reg-stack.c quentin.bennett
18:06 Re: c++/7769: using static libraries sometimes loses static initialization Hal Black
17:26 Re: c/6326: gcc compile illegal code Joseph S. Myers
14:36 bootstrap/7901: make[2]: *** [/dev_tools/gcc3.2/src/gcc/gengtype-yacc.c] Error 1 asoleyma
13:16 bootstrap/7899: make bootstrap fails on configure-target-libiberty jeff.deifik
12:36 middle-end/7898: gcc-3.2 readdir_r regression on solaris 2.6 sadinoff
11:36 optimization/7897: gcc3.2 fails building kdeaddons when using the -march=pentium4 flag mhillary
06:46 c/7895: Bit-field initialization incorrect after padding with :0 eckart
05:42 Re: c/7888: wrong code produced by GCC 3.1 nathan
05:36 Re: c++/7884: code compiled with optimization flag causes segmentation violation Gabriel Dos Reis
04:16 Re: c++/7884: code compiled with optimization flag causes segmentation violation Gabriel Dos Reis
02:56 other/7894: When configured for cross-compiling ("<target>-" program-prefix), install of gcov as <prefix>/bin/<target>-gcov first removes <prefix>/bin/gcov Thibaud.GAILLARD
02:36 Re: c/7888: wrong code produced by GCC 3.1 Raul Tabasso
01:46 Re: c++/7884: code compiled with optimization flag causes segmentation violation arnez
01:06 bootstrap/7893: Internal compiler error in simplify_gen_subreg br

September 11, 2002
14:36 Re: c++/6531: attribute error Klaus Pedersen
12:55 Re: java/7833: Bug in multiplying int and long when int is too small for result tromey
12:46 java/5794 tromey
12:41 Re: java/5794: gcj fails to verify .class file generated by Sun JDK 1.4 compiler tromey
12:33 Re: fortran/7891: f771 unconditionally fails on powerpc64 with assertion failure toon
12:06 Re: optimization/7632: gcc 3.2 for PowerPC: instruction scheduling ignores dependency in variable asignments dje
12:03 Re: c++/7542: compiling for powerpc Altivec dje
12:01 Re: debug/7310: "inline" with "-g -gdwarf -O" for PowerPC fails to be linked dje
09:16 fortran/7891: f771 unconditionally fails on powerpc64 with assertion failure pthomas
09:16 ada/7890: Instantiation of Generic Granchild Package fails tim.green
09:16 ada/7889: Instantiation of Generic Granchild Package fails tim.green
09:01 Re: c/7888: wrong code produced by GCC 3.1 nathan
08:06 c/7888: wrong code produced by GCC 3.1 tabasso
06:46 optimization/7887: Undefined labels with -O2 -fpic breaks Mercury bootstrap fjh
05:26 c++/7886: g++ 3.2 indicates ambigous base ctor when its not ambiguous catherin
02:19 Re: optimization/7884: code compiled with optimization flag causes segmentation violation on powerpc nathan
02:16 Re: c/7751: iconv.c:434: Internal compiler error in extract_insn,at recog.c:2148 Gerald Pfeifer
01:56 c++/7885: Internal compiler error Serge.Steer
01:36 optimization/7884: code compiled with optimization flag causes segmentation violation on powerpc aloeff

September 10, 2002
23:36 java/7883: ICE in size_binop, at fold-const.c:1441 jmr
16:34 Re: c/6326: gcc compile illegal code gdr
11:16 Re: bootstrap/7882: HP bootstrap failure when building on PA 2.0 for PA 1.1 Jeff Law
10:56 Re: bootstrap/7882: HP bootstrap failure when building on PA 2.0for PA 1.1 Dave Cuthbert
10:46 Re: bootstrap/7882: HP bootstrap failure when building on PA 2.0 for PA 1.1 Jeff Law
09:56 bootstrap/7882: HP bootstrap failure when building on PA 2.0 for PA 1.1 dacut
08:56 bootstrap/7881: gcc-3.2 problem on Compaq Tru64 root
08:47 Re: c/7873: arm-linux-gcc fails when assigning address to a bit field rearnsha
08:46 c/7873 rearnsha
07:36 c++/7880: Internal compiler error when passing template class to new operator celliott
05:16 c++/7828 - testcase Ritzert
03:26 java/7879: Segmentation fault: jc1 -> java/mangle.c:228 -> No such file or directory cedric.dufour
02:56 Re: c/7873: arm-linux-gcc fails when assigning address to a bit field Richard Earnshaw
02:56 optimization/7878: GCC 3.2 Internal compiler error in simplify_subreg claude.boulade
02:36 c++/7877: Incorrect parameter passing to specializations of member function templates anthwil
01:55 Re: fortran/7278: g77 "bug"; the executable misbehave toon
01:06 c++/7876: g++ doesn't diagnose One Reference Rule violation gdr

September 09, 2002
21:46 c++/7875: function overloading dropped for temp object from ctor dave_whipp
19:20 Re: c++/7874: g++ finds otherwise names otherwise invisible by ordinary name lookup gdr
15:56 c++/7874: g++ finds otherwise names otherwise invisible by ordinary name lookup gdr
15:26 c/7873: arm-linux-gcc fails when assigning address to a bit field alex.zatsman
14:36 c/7872: ICE on legal code, regression from 3.0 and 2.9* Richard Zidlicky
14:36 c/7871: ICE on legal code, global register variables problems Richard Zidlicky
13:56 Re: c++/7828: g++ 3.3: bad non-lvalue error (non_cast_lvalue_or_else) Nathan Sidwell
13:46 web/7596 gerald
13:42 Re: web/7596: Broken links on g77 web page gerald
13:26 Re: c++/7858: g++ rejects legal code (regression from gcc 3.*) Andrew Pinski
13:21 Re: other/4895: Athlon not supported by configure. Athlon options undocumented gerald
12:56 Re: c++/7858: g++ rejects legal code (regression from gcc 3.*) Peter Schmid
12:36 Re: c++/7858: g++ rejects legal code (regression from gcc 3.*) Paolo Carlini
12:26 libgcj/7870: Incorrect constructor invoked in inherited class. ivg2
12:09 Re: c++/7820: Compiler bails out with internal error 373 paolo
11:59 Re: c++/7840: ICE in g++ 3.2 paolo
11:43 Re: pending/7845: gcc problem report #4427 -- how is this 'correct behaviour'? paolo
11:38 Re: pending/7846: gcc problem report #4427 -- how is this 'correct behaviour'? paolo
11:36 Re: optimization/7673: extract_insn Jim Gifford
11:29 Re: target/7864: ICE on very simple legal code paolo
11:26 Re: optimization/7673: extract_insn Jim Gifford
11:09 Re: c++/7859: Internal compiler error at cp/cp-lang.c paolo
10:56 c++/7869: faults typedef redefinition in struct algrant
10:56 bootstrap/7868: xgcc: Internal error: Bus Error (program as) ahelm
10:26 Re: c++/7859: Internal compiler error at cp/cp-lang.c Gerasimos Melissaratos
08:56 c/7867: Internal compiler error in `gen_tagged_type_instatiateion_die', at dwarf2out.c:9315 Steven.Collins
08:36 c++/7866: compile error when bit field has same name as namespace wilsonjd
07:36 c++/7865: internal error on legal code vdspek
07:16 Re: target/7856: [arm] invalid offset in constant pool reference Richard Earnshaw
06:56 target/7864: ICE on very simple legal code mattias
06:36 c++/7863: Member function template argument deduction broken by declaration of name in different scope timb
05:30 Re: preprocessor/7862: Interrupting gcc -MD removes .d file but not .o jason
05:26 Re: libstdc++/4764: std::wstring missing on Solaris richard.mouli
05:26 preprocessor/7862: Interrupting gcc -MD removes .d file but not .o jason
03:56 Re: target/7856: [arm] invalid offset in constant pool reference rearnsha
00:26 Re: c++/7859: Internal compiler error at cp/cp-lang.c paolo

September 08, 2002
18:16 c++/7861: Failure to compile on the second attempt paulf.johnson
16:26 Re: c++/7858: g++ rejects legal code (regression from gcc 3.*) Andrew Pinski
16:06 Re: c/7860: few new suggested warnings Jarkko Hietaniemi
16:06 Re: c++/7858: g++ rejects legal code (regression from gcc 3.*) Peter Schmid
16:06 Re: c/7860: few new suggested warnings Andrew Pinski
15:06 c/7860: few new suggested warnings jhi
15:06 c++/7859: Internal compiler error at cp/cp-lang.c gmelis
12:06 Re: c++/7858: g++ rejects legal code (regression from gcc 3.*) Andrew Pinski
11:47 Re: optimization/6405: Loop-unrolling related performance regressions sayle
11:46 c++/7858: g++ rejects legal code (regression from gcc 3.*) Peter Schmid
11:36 optimization/6405 sayle
07:46 c/7857: Different behaviour if compiled with optimization! jcas
06:46 target/7856: [arm] invalid offset in constant pool reference pb
06:06 Re: c/7741: ICE on conflicting types Jonathan Wakely
03:06 c++/7855: Wrong line number specified in error / warning message jfischer110
00:36 libgcj/7854: fastjar update (-u) should be implemented 116145
00:06 c/7853: gcc reports multiple symbol definitions on the wrong line Matthias Klose

September 07, 2002
23:03 Re: target/7374: __builtin_fabsl broken on alpha sayle
22:36 target/7374 sayle
22:26 target/7374 sayle
20:44 Re: optimization/7814: incorrect scheduling for glibc-2.2.92 stpcpy test rth
16:26 c++/7852: compiler internal error rkantor
13:48 Re: libgcj/2509: Socket.setKeepAlive() is not supported green
12:57 Re: libgcj/7752: connection with a POST http request green
12:01 Re: optimization/7291: off-by-one in generated inline bzero code for i386 (64bit) sayle
10:26 libstdc++/7851: Problems with numeric_limits<wchar_t>::min() and max() Peter Schmid
07:46 Re: libstdc++/7849: libstdc++.so: undefined reference to std::messages<wchar_t>::do_get[...] causes failure during building of abi_check Andrew Pinski
06:46 c++/7850: g++-3.2 ends with "Internal compiler error" @ KDE 3.0.x peter512
04:56 libstdc++/7849: libstdc++.so: undefined reference to std::messages<wchar_t>::do_get[...] causes failure during building of abi_check nwourms

September 06, 2002
22:15 Re: libstdc++/7805: Test 18_support/numeric_limits.cc execution fails on cygwin billingd
08:48 Re: libobjc/1727: Invoking methods of instances created with @protocol nicola
07:56 other/7848: Linking with gnat/gnarl libs causes crash at run-time dave.tuson
05:26 c/7847: pragma pack / attribute(packed): unaligned access to packed structure on SPARC jk

September 05, 2002
19:26 Re: java/7838: Internal compiler error in make_class_data, at java/class.c Tom Tromey
15:36 c++/7844: Function declarations parsed incorrectly kparz
14:36 libstdc++/7811 paolo
14:19 Re: libstdc++/7811: default locale not taken from environment paolo
14:16 libstdc++/7811 paolo
13:46 libstdc++/7843: Memory Leak When Printing Complex Number oldham
13:36 target/7842: [REGRESSION] sparc code gen bug mattias
13:16 c++/7841: gcc accepts illegal member function syntax for template classes bangerth
12:06 Re: libstdc++/7805: Test 18_support/numeric_limits.cc execution fails on cygwin Loren James Rittle
11:06 c++/7840: ICE in g++ 3.2 ekraus02
10:46 target/7839: Misaligned stack in expand_call() on i386, i486 and i586 rschiele
10:36 java/7838: Internal compiler error in make_class_data, at java/class.c cassio
10:29 Re: java/7837: Throwing an exception aborts tromey
10:26 Re: java/7837: Throwing an exception aborts Robin Green
09:26 Re: c++/7828: g++ 3.3: bad non-lvalue error (non_cast_lvalue_or_else) Scott Snyder
08:46 Re: java/7837: Throwing an exception aborts Tom Tromey
07:16 java/7837: Throwing an exception aborts greenrd
06:27 Re: target/7079: Won't compile gcc 3.1 for host=i686-pc-linux-gnu, target=arm-linux rearnsha
06:26 objc/7836: problem casting id as id<protocol> pauljohn
04:33 Re: bootstrap/7821: make bootstrap fails with fatal error in all-target-libjava ro
03:36 c++/7835: internal compiler error Gunter Winkler
02:26 pending/7834: Re: Test 18_support/numeric_limits.cc execution fails on cygwin Gabriel Dos Reis
02:26 Re: libstdc++/7805: Test 18_support/numeric_limits.cc execution fails on cygwin Gabriel Dos Reis

September 04, 2002
22:56 java/7833: Problem multiplying int and long when int is too small for result Martin Kahlert
20:46 target/7832: libc not found when linking libgcc.so mhabets
19:05 Re: libstdc++/7805: Test 18_support/numeric_limits.cc execution fails on cygwin ljrittle
18:56 c/7831: GCC 3.2 MIPS64 endian issues cvansch
16:36 Re: optimization/7829: GCC 3.1, 3.2 and 3.2.1-pre ICE with -march=athlon + PATCH Alexander Kabaev
15:46 java/7830 tromey
15:40 Re: java/7830: Off-by-one buffer overruns in fastjar tool tromey
15:26 Re: c/7102: unsigned char divisision results in floating exception rth
15:26 c/7102 rth
15:06 java/7830: Off-by-one buffer overruns in fastjar tool greenrd
14:46 optimization/7829: GCC 3.1, 3.2 and 3.2.1-pre ICE with -march=athlon + PATCH ak03
12:26 Re: c++/7828: g++ 3.3: bad non-lvalue error (non_cast_lvalue_or_else) Andrew Pinski
12:06 c++/7828: g++ 3.3: bad non-lvalue error (non_cast_lvalue_or_else) snyder
09:46 c++/7827: incorrect warning "will never be executed" when optimizing duchier
09:06 Re: libf2c/6367 bugfix - thanks Jim McDonald
08:54 Re: optimization/6713: Regression wrt 3.0.4: g++ -O2 leads to seg fault at run time paolo
05:37 Re: other/7826: Decimal constant -2147483648 cause a warning "decimal constant is so large that it is unsigned" nathan
05:35 Re: libstdc++/7811: default locale not taken from environment paolo
05:26 other/7826: Decimal constant -2147483648 cause a warning "decimal constant is so large that it is unsigned" carlo
03:46 c++/7825: Gcc bug report: ice in static struct initialisation Phil Armstrong
00:26 c++/7824: Temporary ostream doesn't work properly with operator<< and const char* phil

September 03, 2002
20:16 c++/7823: Itanium linux gcc 3.2 optimizer bug at -O2 level and above. dennis
16:46 Re: bootstrap/7821: make bootstrap fails with fatal error in all-target-libjava Rainer Orth
16:06 libstdc++/7822: build failure gcc-3.2 CVS 20020830 on m68k-linux doko
16:06 Re: libstdc++/7813: Build fails Phil Edwards
15:46 bootstrap/7821: make bootstrap fails with fatal error in all-target-libjava kk
15:06 c++/7820: Compiler bails out with internal error 373 a.keese
13:30 Re: libstdc++/7793: Problems with numeric_limits<long double>::min() rth
13:28 Re: c/6201: What precision should a float have? rth
11:46 other/7819: make install failed when installing gcc 3.2 hhuang
05:46 c++/7818: Bug collection for unbound template friend member functions that cannot access protected members (gcc 3.x) David Decotigny
05:36 Re: target/7815: ARM Bug Richard Earnshaw
05:26 Re: target/5138: -mno-eabi option not working for powerpc targets Veselin Shishkov
03:41 Re: objc/5956: selectors aren't matched properly when added to the selector table nicola
01:36 c++/7817: Problem with gcc 3.2 installation Joachim Backes
01:34 Re: target/7815: ARM Bug rearnsha
01:16 c++/7816: Install gcc-3.2 man pages backesćrhrk

September 02, 2002
16:16 target/7815: ARM Bug matt
13:26 Re: other/7814: incorrect scheduling for glibc-2.2.92 stpcpy test Glen Nakamura
12:46 Re: other/7814: incorrect scheduling for glibc-2.2.92 stpcpy test Glen Nakamura
12:26 other/7814: incorrect scheduling for glibc-2.2.92 stpcpy test glen
10:56 libstdc++/7813: Build fails masterxor
09:46 c/7812: insane compilation times V.Haisman
09:26 libstdc++/7811: default locale not taken from environment Martin von Loewis
08:56 optimization/7810: "gcc-3.2 -Wall -funroll-loops -mcpu=k6 -O1 -c bug.c" causes ICE in extract_insn bunk
08:16 Re: c++/7807: g++ 3.2 Fails to compile legal code that compiled OKwith g++ 3.1 Anthony Williams
08:06 Re: c++/7807: g++ 3.2 Fails to compile legal code that compiled OKwith g++ 3.1 Andris Pavenis
06:46 c++/7809: g++ 3.2 accepts friend declarations concerning inaccessible methods bagnara
05:05 Re: target/7798: unable to find a register to spill in class `FLOAT_REGS' paolo
03:36 objc/7808: Compiler ignores cast from 'id<Protocol>' to 'id' or from 'id<Protocol1>' to 'id<Protocol2>' Nicola Pero
03:19 Re: objc/3503: ice on libFoundation-090 source nicola
02:36 c++/7807: g++ 3.2 Fails to compile legal code that compiled OK with g++ 3.1 anthony
01:46 Re: target/7798: unable to find a register to spill in class`FLOAT_REGS' Gwenole Beauchesne

September 01, 2002
21:26 libstdc++/7805: Test 18_support/numeric_limits.cc execution fails on cygwin David.Billinghurst
20:56 c++/7804: bad printing of fp constant in warning message rth
20:06 c++/7803: Please submit a full bug report carlo
19:03 Re: target/7797: mips-sgi-irix6.5 warnings from genrecog/mips.md during bootstrap echristo
15:26 Re: c++/7801: Internal compiler error in cp_expr_size, at cp/cp-lang.c paolo
13:46 Re: c++/7801: Internal compiler error in cp_expr_size, at cp/cp-lang.c Nicolai Guba
12:56 bootstrap/7802: stage2 bootstrap of gcc-3-3 (20020901) failure on sparc32-linux christian
11:45 Re: c++/7801: Internal compiler error in cp_expr_size, at cp/cp-lang.c paolo
11:16 c++/7801: Internal compiler error in cp_expr_size, at cp/cp-lang.c nicolai
10:46 Re: bootstrap/7800: underscore.c:0: malformed option `-A system=posix' Zack Weinberg
10:26 bootstrap/7800: underscore.c:0: malformed option `-A system=posix' mikerushford
10:16 optimization/7799: Loop bug with optimization flag -Os in gcc Nejat AYDIN
09:46 target/7798: unable to find a register to spill in class `FLOAT_REGS' j_r_fonseca
06:06 target/7797: mips-sgi-irix6.5 warnings from genrecog/mips.md during bootstrap ghazi
05:56 middle-end/7796: Regression: sparc-sun-solaris2.7 extra failure w/-m64 on execute/930921-1.c in unroll.c ghazi
05:46 c/7795: Linux/Alpha kernel with gcc-3.2.1 failes martin
05:46 target/7794: Regression: sparc-sun-solaris2.7 RTL checking failures w/-m64 on compile/960704-1.c & execute/991019-1.c ghazi
05:22 Re: objc/6960: Compiler doesn't correct allocate object from -fconstant-string-class= nicola
05:15 Re: objc/6959: ObjC compiler doesn't corretly work with -fconstant-string-class= nicola
04:26 Re: libstdc++/7793: Problems with numeric_limits<long double>::min() Gabriel Dos Reis


Indexes: [Date Index] [Subject Index] [Author Index] [Thread Index]
Site Nav: [Browse other archives for this mailing list]
[Browse other mailing lists at this site]
Search: Limit to:

Mail converted by MHonArc 2.5.12