gcc-prs archive
date index for January - March, 2001

This is the mail archive of the gcc-prs@gcc.gnu.org mailing list for the GCC project.

Indexes: [Date Index] [Subject Index] [Author Index] [Thread Index]
Site Nav: [Browse other archives for this mailing list]
[Browse other mailing lists at this site]
Search: Limit to:


2001-03-31 Re: c/2371: Hang with long long function argument. Dave Korn
2001-03-31 other/2448: Bus errors on Solaris 8 vivienm
2001-03-31 RE: fortran/2408: g77.f-torture/execute/short.f -Os failure Billinghurst, David \(CRTS\)
2001-03-31 re: fortran/946 Fails with -Os Billinghurst, David \(CRTS\)
2001-03-31 c++/2447: g++ don't handle execption when using with -fomit-frame-pointer chmouel
2001-03-31 re: fortran/2408 g77.f-torture/execute/short.f -Os failure Billinghurst, David \(CRTS\)
2001-03-31 c/2446: error compiling example code for getopt andriesb
2001-03-31 libstdc++/2445: undefined reference to `std::errno' Michael Elizabeth Chastain
2001-03-31 preprocessor/2444: Internal error, <new> vs a directory named 'new' porten
2001-03-31 Re: c++/2440&Body=http://gcc.gnu.org/cgi-bin/gnatsweb.pl?cmd=view&pr=2440&database=gcc Magnus Fromreide
2001-03-31 c++/2443: error while trying to build new kernel linux 2-4-3 kelly
2001-03-31 Re: java/2412: jv-scan reports parse error Alexandre Petit-Bianco
2001-03-30 Re: java/2216 tromey
2001-03-30 Re: java/2280 tromey
2001-03-30 Re: libgcj/2429: java.text.MessageFormat broken Tom Tromey
2001-03-30 RE: libgcj/2388: Problems on cygwin. Case insensitive file system? Billinghurst, David \(CRTS\)
2001-03-30 Re: libgcj/2388: Problems on cygwin. Case insensitive file system? Tom Tromey
2001-03-30 Re: c++/2440: istringstream problems after eof encountered Phil Edwards
2001-03-30 Re: java/2412: jv-scan reports parse error Tom Tromey
2001-03-30 libgcj/2441: RegisterNatives fails without interpreter tromey
2001-03-30 c++/2440: istringstream problems after eof encountered ian.wakeling
2001-03-30 Re: java/2412: jv-scan reports parse error Alexandre Petit-Bianco
2001-03-30 objc/2438: Internal compiler error when compiling Objective C code prikryl
2001-03-30 c++/2437: template name binding problem kenny.simpson
2001-03-30 optimization/2435: GCC 3.0 20010326 emits duplicate template instantiations with -O Andreas Zeller
2001-03-30 Re: c++/2296: gcc-2.95.3.test3: internal error--unrecognizable insn: Bernd Schmidt
2001-03-30 c++/2434: Compilation with large file support (solaris & aix) pnobili
2001-03-30 optimization/2433: wrong function param handling in UltraSPARC optimized code gawrilow
2001-03-30 c++/2432: "c++ -O t_010330_1.c && ./a.out" fails, without "-O" the test runs o.k. Andreas.Krakowczyk
2001-03-30 Re: c++/2417 lerdsuwa
2001-03-30 Re: c++/2352 lerdsuwa
2001-03-30 Re: c++/2353 lerdsuwa
2001-03-30 Re: c++/2384 lerdsuwa
2001-03-30 libgcj/2431: static initializers torsten.rueger
2001-03-30 Re: c++/2393 lerdsuwa
2001-03-30 c++/2430: subscripting very much slower than pointer arithmetic warren
2001-03-30 Re: c++/2294 lerdsuwa
2001-03-30 Re: c++/2289 lerdsuwa
2001-03-29 Re: c++/2410 lerdsuwa
2001-03-29 Re: c++/2418 lerdsuwa
2001-03-29 libgcj/2429: java.text.MessageFormat broken torsten.rueger
2001-03-29 Re: c++/2421 lerdsuwa
2001-03-29 Re: c++/2417 lerdsuwa
2001-03-29 libgcj/2428: Classloader is not set torsten.rueger
2001-03-29 target/2427: Extra loop failures with -mcpu=athlon Joseph Myers
2001-03-29 java/2424: gjc thinks a final variable is reassigned when it is not sdlee
2001-03-29 java/2423: false reporting of "Final variable initialization error" in constructor sdlee
2001-03-29 c++/2422: Adding PlutoTimeValue::operator timeval(void) const causes Internal compiler error in `fixup_var_refs_1', at function.c:2070 drew
2001-03-29 Re: java/1315 apbianco
2001-03-28 c++/2421: can't declare ordinary nested class as friend of template class jhl
2001-03-28 c/2420: Internal compiler error received compiling mkreiserfs.c mark.post
2001-03-28 Re: c/2397: big char array causes segfault Kiril Vidimce
2001-03-28 c/2419: GCC 2.96 FP bit manipulation snafu cchen
2001-03-28 c++/2418: Internal compiler error reported when unbalanced parentheses are encountered. blackw
2001-03-28 Re: java/2066 apbianco
2001-03-28 java/2066 apbianco
2001-03-28 java/2066 apbianco
2001-03-28 Re: target/2395 neil
2001-03-28 Re: c/2371 neil
2001-03-28 Re: optimization/412 neil
2001-03-28 c++/2417: GCC 2.95.3 gives internal compiler error imad.ossaily
2001-03-28 target/2416: asm error while compiling gcc-2.95.3 on AIX-4.3.3.6 ogernand
2001-03-28 optimization/2415: ICE (regression 2.95.2->gcc3.0) when compiling fdlibm Jan Vroonhof
2001-03-28 c++/2413: Under AIX 4.3.0: Global object constructors not executed jerry.terlouw
2001-03-28 Re: fortran/2339 toon
2001-03-28 java/2412: jv-scan reports parse error Mika.Riekkinen
2001-03-28 other/2411: 2.95.2 runs, change in .h leads to compile error of 2.95.3 ckrackowiz
2001-03-28 Re: target/2396 Richard Earnshaw
2001-03-28 Re: java/2400 apbianco
2001-03-27 Re: other/1955 neil
2001-03-27 RE: libgcj/1736 Billinghurst, David \(CRTS\)
2001-03-27 RE: libgcj/1736 Billinghurst, David \(CRTS\)
2001-03-27 re: other/1955 Billinghurst, David \(CRTS\)
2001-03-27 c++/2410: ICE caused by mismatched class types on externs matt
2001-03-27 other/2409: Tests g++.old-deja/g++.mike/p3708*.C crash dejagnu on cygwin David.Billinghurst
2001-03-27 fortran/2408: g77.f-torture/execute/short.f -Os failure David.Billinghurst
2001-03-27 optimization/2407: compile fails in emit_move_insn_1 if optimization is on (-O) cmg
2001-03-27 c++/2406: == operator does not work on vector<class x> Joe Buck
2001-03-27 Re: c++/2405: "using std::rel_ops" blows up std::vector Joe Buck
2001-03-27 Re: java/2400: Linked list don't compile Bryce McKinlay
2001-03-27 Re: java/2333 bryce
2001-03-27 c++/2405: "using std::rel_ops" blows up std::vector jbuck
2001-03-27 Re: c/2404: arm-linux-gcc ice Philip Blundell
2001-03-27 Re: other/2378: gcc fails bootstrap with error 139 on s- Daniel Chester
2001-03-27 Re: c/2404: arm-linux-gcc ice bkohlen
2001-03-27 Re: target/2396 Ted Merrill
2001-03-27 Re: c/2404: arm-linux-gcc ice Philip Blundell
2001-03-27 Re: java/1213 apbianco
2001-03-27 Re: java/2400: Linked list don't compile Alexandre Petit-Bianco
2001-03-27 Re: java/2400 apbianco
2001-03-27 c/2404: arm-linux-gcc ice bkohlen
2001-03-27 c/2403: Bug in __mulhi3 causes it to give wrong answer for certain values for Atmel AVR Target lee
2001-03-27 Re: libstdc++/2383: Problems with istrstream Martin Sebor
2001-03-27 c++/2402: Problem with compile-time sizeof evaluation and templates stephen
2001-03-27 RE: libgcj/1736 Billinghurst, David \(CRTS\)
2001-03-27 Re: target/2396 rearnsha
2001-03-27 c++/2401: Internal compiler error in `scan_region', at except.c:2566 adam
2001-03-27 Re: target/2396 rearnsha
2001-03-27 RE: libgcj/1736 Billinghurst, David \(CRTS\)
2001-03-27 java/2400: Linked list don't compile torsten.rueger
2001-03-27 Re: c++/2144 neil
2001-03-26 re: pending/2144 Cygwin testsuite regressions: -dirafter and system files Billinghurst, David \(CRTS\)
2001-03-26 Re: c/2308 neil
2001-03-26 optimization/2399: 23 superflouis moves in a C++ function that needs 1 crosby
2001-03-26 c++/2398: external name gets put in wrong namespace snyder
2001-03-26 Re: c/2397: big char array causes segfault Kiril Vidimce
2001-03-26 c/2397: big char array causes segfault vkire
2001-03-26 Re: libgcj/1736 Bryce McKinlay
2001-03-26 Re: libgcj/1736 Bryce McKinlay
2001-03-26 c/2396: ARM/thumb 5th function argument access problem ted
2001-03-26 Re: libgcj/1736 Bryce McKinlay
2001-03-26 RE: libgcj/1736 Billinghurst, David \(CRTS\)
2001-03-26 Re: java/2360: Internal compiler error make_class_data (constant stress test?) Alexandre Petit-Bianco
2001-03-26 target/2395: x86_64 opcode generated for i686 drepper
2001-03-26 Re: c++/907 Ruediger Werner
2001-03-26 c/2394: -O2 -mcpu=ultrasparc can generate std's to non-8-byte aligned stack offsets grubba
2001-03-26 c++/2393: Missing constant value for array bounds yields "internal compiler error" Bill.R.Emshoff
2001-03-26 c/2392: mcpu=ultrasparc causes internal compiler error signal 11 somervil
2001-03-26 Re: target/2342 rearnsha
2001-03-26 optimization/2391: Exponential compilation time explosion in combine Richard Earnshaw
2001-03-26 Re: c++/2137 nathan
2001-03-25 c/2389: Segmentation fault ppar2357
2001-03-25 libgcj/2388: Problems on cygwin. Case insensitive file system? David.Billinghurst
2001-03-25 Re: c/2381: conflicting types for `va_list' (Solaris 8 Intel) Carlo Wood
2001-03-25 c++/2387: Bad codegen for static local references jason_merrill
2001-03-25 c/2386: gcc -mcpu=ultrasparc SIGSEGV's on some code involving long long and pointers. grubba
2001-03-25 Re: c++/2384: Class that throws itself Martin Sebor
2001-03-25 target/2385: [ARM; regression from 2.95] Internal compiler error in find_reloads philb
2001-03-25 c++/2384: Class that throws itself Peter Schmid
2001-03-25 libstdc++/2383: Problems with istrstream schmid
2001-03-25 java/2382: libjava's testsuite returns error case aj
2001-03-25 c/2381: conflicting types for `va_list' (Solaris 8 Intel) Peter_Darren_Bray
2001-03-25 c++/2380: Compiling the Crypto++ "bench.cpp" Causes g++ to Segfault dew
2001-03-24 fortran/2379: sin anc cos functions result in undefined __builtin_sin/cos jaakko.hyvatti
2001-03-24 other/2378: gcc fails bootstrap with error 139 on s- dan
2001-03-24 Re: c/2371 Mark Elbrecht
2001-03-24 debug/2377: Segfault in dbxout.c:1013 schmid
2001-03-24 c++/2376: g++ generates internal compiler error when building KDE-2.1 timp
2001-03-24 java/2375: static inner class doesn't find inherited methods joerg_brunsmann
2001-03-24 c++/2374: template class inheriting from template template parameter Richter.Jens
2001-03-24 c++/2373: Exception rethrow in function-try-block Frank.Uepping
2001-03-24 Re: web/961 gerald
2001-03-24 Re: libgcj/2357 bryce
2001-03-24 Re: libgcj/2357: HashMap does not handle initialCapacity=0 correctly Bryce McKinlay
2001-03-23 c++/2372: const struct parameter causes incorrect code with -O2. suckfish
2001-03-23 c/2371: Hang with long long function argument. snowball3
2001-03-23 Re: target/2247 Jim Wilson
2001-03-23 java/2370: Behavior of main compilation without --main is unfriendly Hans_Boehm
2001-03-23 java/2369: --main should check the following symbol Hans_Boehm
2001-03-23 c++/2368: Internal error #92 (catch clauses) schmid
2001-03-23 c++/2367: Internal compiler error rwgk
2001-03-23 java/1213 apbianco
2001-03-23 java/1213 apbianco
2001-03-23 other/2366: The specs file does not pass the argument -xarch=v8plusa to as when compiling with -mcpu=v9 on SunOS 5.x/sparc grubba
2001-03-23 c/2365: gcc 2.95.3 bison and msgfmt problem as108
2001-03-23 c++/2364: long long and templates schmid
2001-03-23 libstdc++/2363: objdir with colon causes bootstrap failure Gerald Pfeifer
2001-03-23 c++/2362: boost: "gcc can't handle cv-qualified references" schmid
2001-03-23 Re: java/2361: Cannot acces protected field of superclass in a different package Mark Wielaard
2001-03-23 java/2361: Cannot acces protected field of superclass in a different package mark
2001-03-23 java/2360: Internal compiler error make_class_data (constant stress test?) scgmille
2001-03-23 other/2359: Problem building gcc 2.95.3 on AIX 4.3.3.0 tkalix
2001-03-23 java/2358: Inner class extending another in package: Can't find method vegardh
2001-03-23 RE: libgcj/1736 Billinghurst, David \(CRTS\)
2001-03-23 libgcj/2357: HashMap does not handle initialCapacity=0 correctly mark
2001-03-23 c++/2356: Wrong "unused parameter" warnings with -W -Wall Matti Rintala
2001-03-22 libgcj/2355: !#@$!@#^%#$^%&$%&@#$% unhappy
2001-03-22 c++/2354: Compiler passes wrong switches to assembler rovf
2001-03-22 libgcj/1736 bryce
2001-03-22 Re: libgcj/1736 bryce
2001-03-22 libgcj/1736 bryce
2001-03-22 c++/2353: template frient specification causes an internal compiler error john.rusnak
2001-03-22 c++/2352: inheritance on solaris alan_gonzalez
2001-03-22 Re: other/2351: can't build gcc-2.95.2 on redhat 7.0 Carlo Wood
2001-03-22 other/2351: can't build gcc-2.95.2 on redhat 7.0 jeff.deifik
2001-03-22 re: fortran/1645 Billinghurst, David \(CRTS\)
2001-03-22 RE: c++/2350: constant propagation problem accross function call Billinghurst, David \(CRTS\)
2001-03-22 c++/2350: constant propagation problem accross function call hankinsr
2001-03-22 c++/2349: Compiler generated copy-constructor generates warning for unused argument. bumgard
2001-03-22 c++/2348: scalar assignment to struct causes compiler crash philb
2001-03-22 java/2333 apbianco
2001-03-22 c/2347: gcc does not accept "-l m" as POSIX permits (wants -lm) schweikh
2001-03-22 libstdc++/2346: Problems with seekg (rewind)? schmid
2001-03-22 libstdc++/2345: cin.getline doesn't work on solaris, double enter, and single char read only nneul
2001-03-22 c/2344: gcc-3 crash jes
2001-03-21 c++/2343: Internal Compiler Error in typedef processing marka
2001-03-21 Re: java/2066 apbianco
2001-03-21 java/2333 apbianco
2001-03-21 Re: c/2340 neil
2001-03-21 Re: java/1213 Alexandre Petit-Bianco
2001-03-21 target/2342: Build failure of gcc 20010321 for arm-elf larwe
2001-03-21 Re: libgcj/1146 Tom Tromey
2001-03-21 Re: java/1213 Tom Tromey
2001-03-21 c++/2341: Compiler crashes on complex templates with optimization egbert
2001-03-21 c/2340: Internal Error: Segmentation fault mrouthier
2001-03-21 Re: java/2332: valid declaration rejected Tom Tromey
2001-03-21 Re: java/2332 tromey
2001-03-21 libgcj/2338 tromey
2001-03-21 Re: libgcj/2338 tromey
2001-03-21 libgcj/2338 tromey
2001-03-21 Re: libgcj/2338 tromey
2001-03-21 fortran/2339: Large Files on IA32 Linux LJPage
2001-03-21 libgcj/2338: RandomAccessFile does not create the file if not found pedro
2001-03-21 Re: c/2192 neil
2001-03-21 target/2337: Incomplete information in release notes rovf
2001-03-21 target/2336: Tru64 5.1, make bootstrap, linking of cc1 fails jeremie_petit
2001-03-21 Re: c++/2334 Charles Galambos
2001-03-21 c++/2334: Bug in C++ C.Galambos
2001-03-21 Re: c++/2303 Jerome Abela
2001-03-20 Re: c++/1898 George Fleming
2001-03-20 Re: java/2333: ICE in mark_reference_fields Alexandre Petit-Bianco
2001-03-20 Re: c++/2241 rodrigc
2001-03-20 Re: c++/1010 rodrigc
2001-03-20 Re: c++/2120 rodrigc
2001-03-20 Re: java/2333: ICE in mark_reference_fields Jeff Sturm
2001-03-20 Re: c++/2303 rodrigc
2001-03-20 Re: c++/2320 rodrigc
2001-03-20 Re: c++/2325 rodrigc
2001-03-20 Re: c++/2326 rodrigc
2001-03-20 Re: java/2333 apbianco
2001-03-20 Re: java/2333: ICE in mark_reference_fields Alexandre Petit-Bianco
2001-03-20 Re: c++/2292 rodrigc
2001-03-20 java/2333: ICE in mark_reference_fields jsturm
2001-03-20 Re: target/248 dje
2001-03-20 Re: c++/2249 dje
2001-03-20 Re: other/1032 dje
2001-03-20 Re: java/2332: valid declaration rejected Alexandre Petit-Bianco
2001-03-20 java/2332: valid declaration rejected tromey
2001-03-20 Re: java/2008 tromey
2001-03-20 Re: java/2149 tromey
2001-03-20 Re: java/2095 tromey
2001-03-20 Re: c/2331 neil
2001-03-20 c/2331: xgcc: Internal compiler error in 'do_spec_1' at ../../gcc2953/gcc/gcc.c:4028 jcheng
2001-03-20 Re: java/2299 tromey
2001-03-20 c++/2330: static_cast<>() to a private base is allowed philippeb
2001-03-20 Re: other/779 jsm28
2001-03-20 c/2329: Cannot compile simple C program under HP-UX 11.0 rnelson
2001-03-20 Re: libstdc++/2257 gdr
2001-03-19 c/2328: ICE in validate_condition_mode on powerpc-unknown-linux-gnu lucier
2001-03-19 c/2327: problem with cross-compiled linux kernel in gcc 3.0 CVS tree lilo
2001-03-19 Re: c++/2295 bkoz
2001-03-19 Re: libstdc++/2311 bkoz
2001-03-19 Re: c++/1518 dje
2001-03-19 Re: target/2228 dje
2001-03-19 c++/2326: name lookup regression mike
2001-03-19 Re: c++/2323 neil
2001-03-19 Re: c++/812 dje
2001-03-19 c++/2325: Small problem cross-compiling the c++ compiler jeffs
2001-03-19 Re: other/1626 dje
2001-03-19 Re: c++/2322 neil
2001-03-19 Re: target/1801 dje
2001-03-19 Re: target/2203 dje
2001-03-19 other/2324: Strange error with 'make install' gcc-2.95.2 bartelt
2001-03-19 c++/2323: asdfadf adsf adfadafd pp_mm
2001-03-19 c++/2322: asdfadf adsf adfadafd pp_mm
2001-03-19 Re: c++/2320: incorrect order of destruction of function parameters Gabriel Dos Reis
2001-03-19 c/2321: gcc: Internal compiler error: program cc1 got fatal signal 11 robert
2001-03-19 c++/2320: incorrect order of destruction of function parameters James.Kanze
2001-03-19 Re: java/2319: invalid UTF-8 sequences should be rejected Tom Tromey
2001-03-19 Re: java/2319: invalid UTF-8 sequences should be rejected Joseph S. Myers
2001-03-19 Re: java/2313: Java SimpleDateFormat crash with non US locales (french...) Tom Tromey
2001-03-19 java/2319: invalid UTF-8 sequences should be rejected tromey
2001-03-19 middle-end/2318: gcc 2.95.3 build ('make boostrap') fails on Tru64 5.1 jeremie_petit
2001-03-19 optimization/2317: ICE in reload_cse_simplify_operands, at reload1.c:8341 ask
2001-03-18 Re: c++/2301 lerdsuwa
2001-03-18 c++/2316: gcc 2.97 fails to overload on language linkage sebor
2001-03-18 target/2315: ICE with -O on x86 with mainline gcc drepper
2001-03-18 target/2314: -Dinhibit_libc doesn't work for gcc cross-compiler sc843
2001-03-18 Re: java/2313: Java SimpleDateFormat crash with non US locales (french...) Bryce McKinlay
2001-03-18 java/2313: Java SimpleDateFormat crash with non US locales (french...) diam
2001-03-17 java/2312: Check for initialization of all final fields erronously fails bryce
2001-03-17 Re: c++/2220 rodrigc
2001-03-17 Re: c++/2278 rodrigc
2001-03-17 Re: c++/2274 rodrigc
2001-03-17 Re: c++/735 rodrigc
2001-03-17 Re: c++/740 rodrigc
2001-03-17 Re: c++/777 rodrigc
2001-03-17 Re: c++/804 rodrigc
2001-03-17 Re: c++/811 rodrigc
2001-03-17 Re: c++/685 rodrigc
2001-03-17 Re: c++/1002 rodrigc
2001-03-17 Re: c++/1511 rodrigc
2001-03-17 Re: c++/1488 rodrigc
2001-03-17 Re: c++/1508 rodrigc
2001-03-17 Re: c/2308: x86_64 opcode generated for i686 Joseph S. Myers
2001-03-17 libstdc++/2311: isnan(), isinf(), etc, not undefined pcarlini
2001-03-17 Re: c/2308: x86_64 opcode generated for i686 Ulrich Drepper
2001-03-17 c++/2310: Fails to converter char* to signed char* even with -fsigned-char jlnance
2001-03-17 target/2309: arm-linux: unrecognizable insn philb
2001-03-17 Re: web/665 gerald
2001-03-17 Re: c/2308: x86_64 opcode generated for i686 Neil Booth
2001-03-16 c/2308: x86_64 opcode generated for i686 drepper
2001-03-16 Re: web/2304 pme
2001-03-16 other/2307: README points to deprecated INSTALL directory bh
2001-03-16 Re: c++/2301: g++ syntax error ? Ross Smith
2001-03-16 c++/2306: access control lost for virtual bases theonetruekenny
2001-03-16 c++/2305: Binary IO read problem jesch
2001-03-16 web/2304: Broken link on http://gcc.gnu.org/onlinedocs/ dkorn
2001-03-16 c++/2303: ice with templates Jerome.Abela
2001-03-16 libstdc++/2302: Problems with toupper schmid
2001-03-16 c++/2301: g++ syntax error ? philippe.jouguet
2001-03-16 other/2300: gcc_AC_C_FLOAT_FORMAT failed ask
2001-03-16 java/2299: Problem with String Arrays and += Martin Kahlert
2001-03-15 c/2298: m68hc12 bootstrap ICEs jgg
2001-03-15 Re: c++/1783 Brad Lucier
2001-03-15 c++/2296: gcc-2.95.3.test3: internal error--unrecognizable insn: Martin.Spott
2001-03-15 libstdc++/2295: Scope of rand function schmid
2001-03-15 c++/2294: using declaration confusion theonetruekenny
2001-03-15 optimization/2293: ICE in print_rtl_and_abort dmuell
2001-03-15 c++/2292: gcc 2.95.2 ice when using derived template jeffrey.schwab
2001-03-15 Re: libstdc++/1776 George Fleming
2001-03-15 Re: c/2291: Pedantic may be too pedantic Joseph S. Myers
2001-03-15 c/2291: Pedantic may be too pedantic lw
2001-03-15 Re: target/2225 Dieter Meinert
2001-03-15 Re: c++/2202 gdr
2001-03-14 Re: libstdc++/2086 Matthew Schalit
2001-03-14 Re: c++/1622 Craig Rodrigues
2001-03-14 Re: c++/1622 Alex Pelts
2001-03-14 Re: libstdc++/2089 bkoz
2001-03-14 Re: libstdc++/2089 Peter Schmid
2001-03-14 Re: c++/1655 neil
2001-03-14 Re: c++/1622 neil
2001-03-14 Re: c++/1547 neil
2001-03-14 Re: c++/1101 neil
2001-03-14 Re: c++/996 neil
2001-03-14 Re: c++/1055 neil
2001-03-14 Re: c++/983 neil
2001-03-14 Re: c++/990 neil
2001-03-14 Re: c++/872 neil
2001-03-14 Re: c++/841 neil
2001-03-14 Re: c++/839 neil
2001-03-14 Re: c++/840 neil
2001-03-14 Re: c++/797 neil
2001-03-14 Re: c++/832 neil
2001-03-14 Re: c++/782 neil
2001-03-14 Re: c++/766 neil
2001-03-14 Re: c++/750 neil
2001-03-14 Re: c++/724 neil
2001-03-14 Re: c++/709 neil
2001-03-14 Re: c++/703 neil
2001-03-14 Re: c/1051 neil
2001-03-14 Re: c/1001 neil
2001-03-14 Re: c++/1679 neil
2001-03-14 Re: c++/1680 neil
2001-03-14 Re: c++/1700 neil
2001-03-14 Re: c++/1699 neil
2001-03-14 Re: c++/1688 neil
2001-03-14 Re: c++/1916 neil
2001-03-14 Re: libstdc++/2259 bkoz
2001-03-14 Re: libstdc++/2037 bkoz
2001-03-14 Re: libstdc++/2272 bkoz
2001-03-14 Re: libstdc++/847 bkoz
2001-03-14 Re: libstdc++/1776 bkoz
2001-03-14 Re: libstdc++/1805 bkoz
2001-03-14 Re: libstdc++/1822 bkoz
2001-03-14 Re: libstdc++/1815 bkoz
2001-03-14 Re: libstdc++/2103 bkoz
2001-03-14 Re: libstdc++/1834 bkoz
2001-03-14 Re: libstdc++/1885 bkoz
2001-03-14 Re: libstdc++/1884 bkoz
2001-03-14 Re: libstdc++/1886 bkoz
2001-03-14 Re: libstdc++/1893 bkoz
2001-03-14 Re: libstdc++/1894 bkoz
2001-03-14 Re: libstdc++/1967 bkoz
2001-03-14 Re: libstdc++/1897 bkoz
2001-03-14 Re: libstdc++/1968 bkoz
2001-03-14 Re: libstdc++/1972 bkoz
2001-03-14 Re: libstdc++/2020 bkoz
2001-03-14 Re: libstdc++/2038 bkoz
2001-03-14 Re: libstdc++/2064 bkoz
2001-03-14 Re: libstdc++/2067 bkoz
2001-03-14 Re: libstdc++/2086 bkoz
2001-03-14 Re: libstdc++/2089 bkoz
2001-03-14 Re: libstdc++/2148 bkoz
2001-03-14 Re: libstdc++/2181 bkoz
2001-03-14 fortran/2290: Internal compiler error in find_reloads, at reload.c:3487 gdsjaar
2001-03-14 Re: libstdc++/2190 bkoz
2001-03-14 Re: libstdc++/2020 benjamin kosnik
2001-03-14 c++/2289: Incorrect parsing of anonymous union with struct members. vap
2001-03-14 c++/2288: Redereclaration not diagnosed. gdr
2001-03-14 objc/2287: Internal error while building GNUstep with GCC snapshot 5 march 2001 dleeuw
2001-03-14 Re: c++/2045 lerdsuwa
2001-03-14 Re: preprocessor/2277 neil
2001-03-14 Re: c++/2059 lerdsuwa
2001-03-14 Re: c++/2092 lerdsuwa
2001-03-14 Re: c++/2094 lerdsuwa
2001-03-14 Re: c++/2111 lerdsuwa
2001-03-14 Re: c++/2150 lerdsuwa
2001-03-14 Re: c++/2142 lerdsuwa
2001-03-14 Re: libstdc++/2154 lerdsuwa
2001-03-14 Re: c++/2159 lerdsuwa
2001-03-14 debug/2286: Simplified c++/1657: types weirdness (looks like memory corruption with -ggdb) wolfgang.bangerth
2001-03-13 c++/2285: Internal Compiler Error while compiling PalmOS Emulator on Linux gregp
2001-03-13 c++/2284: Spurious unused parameter warning snyder
2001-03-13 debug/2283: -g3 -O1 -finline-function and __attribute__((constructor)) yield bad stabs d
2001-03-13 c++/2282: faulty argument signature matching for catch() mayer
2001-03-13 Re: java/2280: gcj -C does not translate Java 'finally' correctly Tom Tromey
2001-03-13 Re: java/2280 tromey
2001-03-13 Re: java/2279: Verify bytecode after creating it Tom Tromey
2001-03-13 Re: web/2106 gerald
2001-03-13 Re: web/2281 gerald
2001-03-13 Re: java/2279: Verify bytecode after creating it Bryce McKinlay
2001-03-13 web/2281: Bug in the "Suboptimal code for complex conditionals" proposal cbouchon
2001-03-13 RE: c++/1898: IRIX 5 needs a fixincludes hack Bruce Korb
2001-03-13 Re: c++/1898 aoliva
2001-03-13 java/2280: gcj -C does not translate Java 'finally' correctly praun
2001-03-13 Re: c++/1898: IRIX 5 needs a fixincludes hack Alexandre Oliva
2001-03-13 java/2279: Verify bytecode after creating it tromey
2001-03-13 Re: preprocessor/2277: reader complains about input file larger than 8230 bytes Neil Booth
2001-03-13 c++/2278: Incorrect executable generated by compiler tomas.szeredi
2001-03-13 preprocessor/2277: reader complains about input file larger than 8230 bytes Peter.Zienicke
2001-03-13 c++/2276: Crash when a virtual base class constructor throws an exception aph
2001-03-13 optimization/2275: Bad optimization for simple sum loops. -O0 better than -O3 peter.rydesater
2001-03-13 Re: c++/1628 Wolfgang Bangerth
2001-03-13 Re: c++/2172 lerdsuwa
2001-03-13 Re: c++/2171 lerdsuwa
2001-03-13 Re: c++/2198 lerdsuwa
2001-03-13 Re: c++/2201 lerdsuwa
2001-03-13 Re: c++/2254 lerdsuwa
2001-03-13 Re: c++/2267 lerdsuwa
2001-03-13 Re: c++/1917 Theodore.Papadopoulo
2001-03-13 Re: other/2271 bryce
2001-03-13 c++/2274: C++ internal compiler error on alphaev56-dec-osf4.0d matthes
2001-03-13 Re: c++/2117 nathan
2001-03-12 Re: c++/802 neil
2001-03-12 Re: c++/1628 rodrigc
2001-03-12 Re: c++/2135 rodrigc
2001-03-12 Re: c++/2218 rodrigc
2001-03-12 Re: c++/2239 rodrigc
2001-03-12 Re: c++/802 Carlo Wood
2001-03-12 Re: libstdc++/2259 benjamin kosnik
2001-03-12 Re: libstdc++/2020 benjamin kosnik
2001-03-12 Re: libstdc++/2037 benjamin kosnik
2001-03-12 target/2273: [Alpha/Tru64 UNIX V5.1] SEGV in long double code Rainer Orth
2001-03-12 Re: java/2216 tromey
2001-03-12 Re: c/2173 neil
2001-03-12 Re: c++/2258: using namespace std fails for endl in templated function Rob Lowrie
2001-03-12 Re: c++/2270 neil
2001-03-12 Re: c++/2254 benjamin kosnik
2001-03-12 Re: libstdc++/2259 benjamin kosnik
2001-03-12 Re: libstdc++/2272: comparison between signed and unsigned integer expressions in sstream Benjamin Kosnik
2001-03-12 Re: c++/2258: using namespace std fails for endl in templated function Phil Edwards
2001-03-12 Re: c++/2270 neil
2001-03-12 libstdc++/2272: comparison between signed and unsigned integer expressions in sstream boris
2001-03-12 other/2271: Building libjava crashes with: "execvp: /usr/bin/sh: Arg list too long" jarek
2001-03-12 c++/2270: While compiling doxygen under OpenBSD/i386 2.8, the compiler dies with "index.cpp:2397: Internal compiler error in `make_label_edge', at flow.c:1097" jon
2001-03-12 Re: other/2141: set -C in gccbug not portable Richard Earnshaw
2001-03-12 Re: other/2141: set -C in gccbug not portable Joseph S. Myers
2001-03-12 Re: other/2141: set -C in gccbug not portable Rainer Orth
2001-03-12 c++/2269: gcc-20010305 fails to compile qt-2.2.3 toolkit on linux/alpha matze
2001-03-12 c++/2268: g++ 2.95.2/3 gives ICE, today's online compilation SegFaults. horvath_tibor
2001-03-12 Re: c++/1075 rodrigc
2001-03-12 c++/2267: the following program fails to compile, and produces an internal compiler error. anupam.kapoor
2001-03-11 Re: c++/2208 lerdsuwa
2001-03-11 Re: c++/2214 lerdsuwa
2001-03-11 Re: c++/2233 lerdsuwa
2001-03-11 Re: c++/2232 lerdsuwa
2001-03-11 Re: c++/2235 lerdsuwa
2001-03-11 Re: c++/2238 lerdsuwa
2001-03-11 Re: c++/2260 lerdsuwa
2001-03-11 Re: c++/1927 rodrigc
2001-03-11 Re: c++/1927 gilles lamoureux
2001-03-11 libgcj/2266: libgcj does not make CNI header files for inner classes bryce
2001-03-11 middle-end/2265: ICE in reload_cse_simplify_operands - Alpha ev4 root (by way of Thorsten Kranzkowski <dl8bcu@gmx.net>)
2001-03-11 Re: c/2085: sparc-sun-solaris2.7 RTL checking bootstrap failure on 3.1 CVS Kaveh R. Ghazi
2001-03-11 Re: preprocessor/2264 neil
2001-03-11 Re: preprocessor/2264: Macro expansion failure with ## pre-processor operator Zack Weinberg
2001-03-11 Re: c++/1085 rodrigc
2001-03-11 Re: c++/972 rodrigc
2001-03-11 Re: preprocessor/2264: Macro expansion failure with ## pre-processor operator Zack Weinberg
2001-03-11 Re: c++/955 rodrigc
2001-03-11 preprocessor/2264: Macro expansion failure with ## pre-processor operator mm7323
2001-03-11 Re: c++/948 rodrigc
2001-03-11 Re: c++/2063 rodrigc
2001-03-11 Re: c++/1900 aoliva
2001-03-11 Re: c++/1898 aoliva
2001-03-11 Re: c++/1898 aoliva
2001-03-11 Re: c++/2256 rodrigc
2001-03-11 Re: c++/1927 Craig Rodrigues
2001-03-11 Re: c++/1573 rodrigc
2001-03-11 Re: c++/1882 aoliva
2001-03-11 Re: c++/1503 rodrigc
2001-03-11 Re: c++/1796 aoliva
2001-03-11 Re: c++/1878 aoliva
2001-03-11 Re: c++/1075 rodrigc
2001-03-11 Re: c++/1887 aoliva
2001-03-11 Re: c++/1064 rodrigc
2001-03-11 Re: c++/1787 aoliva
2001-03-11 Re: c++/1784 aoliva
2001-03-11 Re: c++/1783 aoliva
2001-03-11 Re: c++/1055 rodrigc
2001-03-11 Re: c++/1031 rodrigc
2001-03-11 Re: c++/1029 rodrigc
2001-03-11 Re: c++/1788 aoliva
2001-03-11 Re: c++/874 rodrigc
2001-03-11 Re: c++/1799 aoliva
2001-03-11 Re: c++/1803 aoliva
2001-03-11 Re: c++/1804 aoliva
2001-03-11 Re: c++/1813 aoliva
2001-03-11 Re: c++/866 rodrigc
2001-03-11 Re: web/1817 aoliva
2001-03-11 Re: c++/857 rodrigc
2001-03-11 Re: c++/851 rodrigc
2001-03-11 Re: libstdc++/1823 aoliva
2001-03-11 Re: c++/831 rodrigc
2001-03-11 optimization/2263: Cross Alpha->68k: Internal compiler error in update_equiv_regs, at local-alloc.c:1097 gcc
2001-03-11 Re: c++/826 rodrigc
2001-03-11 Re: c++/824 rodrigc
2001-03-11 Re: c++/1825 aoliva
2001-03-11 Re: c++/819 rodrigc
2001-03-11 Re: libstdc++/2017 rodrigc
2001-03-11 Re: c++/2017 Rafael Jesus Alcantara Perez
2001-03-11 Re: c++/2017 Craig Rodrigues
2001-03-11 Re: c++/1798 rodrigc
2001-03-11 Re: c++/1925 rodrigc
2001-03-11 Re: c++/1483 rodrigc
2001-03-11 Re: c++/1808 rodrigc
2001-03-11 c++/2262: ICE build_rtti_vtbl_entries, at cp/class.c:7811 ask
2001-03-11 Re: optimization/2122: Error in openssl Alexander Klimov
2001-03-11 Re: c/2179 abaddon
2001-03-11 optimization/2261: optimisation failed for Python-2.0 ask
2001-03-11 Re: libstdc++/2255: libstdc++ incorrectly uses /lib/cpp to identify host compiler version Momchil Velikov
2001-03-11 c++/2260: template template parameters not supported Jens.Richter
2001-03-11 Re: libgcj/2237: serialization doesn't throw exception on failure Bryce McKinlay
2001-03-11 Re: libstdc++/2257: Problems with slices Gabriel Dos Reis
2001-03-11 Re: libstdc++/2079 Gabriel Dos Reis
2001-03-11 Re: c++/1559 neil
2001-03-10 Re: c++/1559 Paul Slootman
2001-03-10 libstdc++/2259: istream::tellg/seekg cause character loss hhuang
2001-03-10 Re: objc/667 aoliva
2001-03-10 c++/2258: using namespace std fails for endl in templated function furboo
2001-03-10 libstdc++/2257: Problems with slices schmid
2001-03-10 Re: libstdc++/2079 Phil Edwards
2001-03-10 Re: libstdc++/2255: libstdc++ incorrectly uses /lib/cpp to identifyhost compiler version Dave Gilbert
2001-03-10 Re: c++/2221 neil
2001-03-10 Re: libstdc++/2255: libstdc++ incorrectly uses /lib/cpp to identify host compiler version Momchil Velikov
2001-03-10 c++/2256: Internal compiler error in `find_function_data', at function.c:542 eric
2001-03-10 libstdc++/2255: libstdc++ incorrectly uses /lib/cpp to identify host compiler version gcc
2001-03-10 Re: java/2216 tromey
2001-03-10 Re: c++/2221 neil
2001-03-10 Re: c++/356 neil
2001-03-10 Re: c++/2215: ICE on compilation of code with -fhonor-std and -ggdb Benjamin Kosnik
2001-03-10 c++/2254: Impossible to compile the qt toolkit steven
2001-03-10 c++/2253: gcc-3.0 cannot compile mysql Franz.Sirl-kernel
2001-03-10 Re: other/2141: set -C in gccbug not portable Joseph S. Myers
2001-03-10 other/2252: If 'as' crashes gcc points you to the gcc bug site gcc
2001-03-10 middle-end/2251: reload.c: unable to generate reloads schmid
2001-03-10 c/2250: Missing space in cygwin specs file David.Billinghurst
2001-03-10 Re: c/2248 neil
2001-03-10 Re: c/2248: gcc 2.95.2 preprocessor bug with -O options Neil Booth
2001-03-10 c++/2249: Generates illecal PPC assembler pere
2001-03-09 c/2248: gcc 2.95.2 preprocessor bug with -O options jdmorgen
2001-03-09 target/2247: IA64 compiler ICE with -O2 sje
2001-03-09 target/2246: Code generated for IA64 doesn't reset NaT bit on scratch reg sje
2001-03-09 Re: libstdc++/2079 David Baron
2001-03-09 c++/2245: Internal compiler error in `refers_to_regno_for_reload_p', at reload.c:5924 fabian
2001-03-09 Re: libgcj/1736 Robert Boehne
2001-03-09 c/2243: Misplacement of label at start of function. voel
2001-03-09 c++/2242: C++ programs built with gcc won't find libstdc++.so eskil
2001-03-09 Re: other/2226 Ervin Németh
2001-03-09 c++/2241: Internal compiler error ndeb
2001-03-08 c++/2240: internal compiler error on static arrays inside templates larry
2001-03-08 c++/2239: Use of an undeclared variable is handled but causes an Internal compiler error in weird places. mat.hounsell
2001-03-08 c++/2238: Use of a class member constant as a size for a member array creation is not handled and causes an Internal compiler error in weird places. mat.hounsell
2001-03-08 Re: libgcj/1736 Bryce McKinlay
2001-03-08 libgcj/1971 tromey
2001-03-08 libgcj/1971 tromey
2001-03-08 libgcj/2237: serialization doesn't throw exception on failure tromey
2001-03-08 other/2236: config.if (gcc 2.95.2, possibly others) pukes if it can't find gl*bc orc
2001-03-08 Re: libgcj/1971 tromey
2001-03-08 c++/2235: GCC 2.95.2 I.C.E. on "friend" template declaration mhfrantz
2001-03-08 Re: preprocessor/2234: incorrect line numbers Neil Booth
2001-03-08 preprocessor/2234: incorrect line numbers schmid
2001-03-08 c++/2233: ice instead of "storage size of x isn't constant" agno
2001-03-08 c++/2232: Numerous g++ internal errors #122 after trivial omissions of closing brackets/braces/parens greg.edwards
2001-03-08 Re: java/2224 neil
2001-03-08 Re: java/2224: error while bootstrapping from cvs Bryce McKinlay
2001-03-08 Re: target/2225 neil
2001-03-08 Re: other/2226 neil
2001-03-08 Re: c++/2229 neil
2001-03-08 Re: c++/2230 neil
2001-03-08 Re: c++/2231 neil
2001-03-08 c++/2231: -fsyntax-only causes "Internal compiler error" on Linux seanm
2001-03-08 Re: preprocessor/2219 Neil Booth
2001-03-08 c++/2230: ICE in `fix_lexical_addr', at function.c:5546 Ruth.Doane
2001-03-08 Re: preprocessor/2219 Neil Booth
2001-03-08 Re: preprocessor/2219 Jeremy Elson
2001-03-08 c++/2229: ld can't find inlined functions leo.dearden
2001-03-08 c++/2228: g++ 3.0 AIX 4.3 PPC internal compiler error rboehne
2001-03-08 c/2227: generates unsigned compare in comparison of int to sizeof() LathamCD
2001-03-08 other/2226: gcc build ignores CPPFLAGS airwin
2001-03-08 c/2225: gcc does not compile on OSF5.1 - mips-tfile: segmentation fault dieter.meinert
2001-03-08 java/2224: error while bootstrapping from cvs Ingo Krabbe
2001-03-08 optimization/2223: overflow in update_equiv_regs foad
2001-03-08 c++/2222: option enable-target-optspace disables _GNU_SOURCE holler
2001-03-08 Re: c++/1726 pbienst
2001-03-08 Re: preprocessor/2219 Jeremy Elson
2001-03-07 Re: preprocessor/2219 Neil Booth
2001-03-07 Re: preprocessor/2219 Jeremy Elson
2001-03-07 Re: preprocessor/2219 Jeremy Elson
2001-03-07 Re: preprocessor/2219 neil
2001-03-07 Re: libgcj/1736 Alexandre Oliva
2001-03-07 Re: libgcj/1736 Alexandre Oliva
2001-03-07 c++/2221: Duplicate symbol pending_lang_change dje
2001-03-07 c++/2220: Internal compiler error on nested template inheritance egnor-gcc
2001-03-07 preprocessor/2219: Using "##" with macro varargs generates spurious warning jelson
2001-03-07 Re: libgcj/2206 bryce
2001-03-07 c++/2218: Problem with pointers on class-member functions stephane.brunet
2001-03-07 java/2216: gcj generates bad bytecode tromey
2001-03-07 c++/2215: ICE on compilation of code with -fhonor-std and -ggdb leo.dearden
2001-03-07 c++/2214: Internal compiler error in finish_function gcoakley
2001-03-07 Re: c++/2199 neil
2001-03-07 c++/2213: Internal Compiler Error: Cast from long long to member function philippeb
2001-03-07 c++/2212: Internal Compiler Error: invalid member pointers philippeb
2001-03-07 libstdc++/2211: Performance regression for cin.read with respect to g++-2.95.2 ? Theodore.Papadopoulo
2001-03-07 c++/2210: ice, abi bug, virtual functions, optimization off schmid
2001-03-07 libstdc++/2209: Diagnostic regression with respect to g++-2.95.2 ? Theodore.Papadopoulo
2001-03-07 c++/2208: Problem with g++ and templates B.Touron
2001-03-07 Re: java/2194: error: redefinition of symbol ".LLBB0" Tom Tromey
2001-03-07 Re: libgcj/2206: Bootrsap fails. Tom Tromey
2001-03-07 Re: c++/1917 Theodore Papadopoulo
2001-03-07 Re: c++/1679 pbienst
2001-03-07 Re: c++/1653 pbienst
2001-03-07 Re: c++/1680 pbienst
2001-03-07 c++/2207: dtor and operator delete have different object teemu
2001-03-07 Re: c++/1686 pbienst
2001-03-07 Re: c++/1700 pbienst
2001-03-07 Re: c++/1712 pbienst
2001-03-07 Re: c++/1726 pbienst
2001-03-07 Re: c++/1917 pbienst
2001-03-07 Re: c++/1944 pbienst
2001-03-07 libgcj/2206: Bootrsap fails. sefer
2001-03-07 c++/2205: g++ crashes when compiling qdatastream.cpp in qt-2.2.4 sb
2001-03-07 c++/2204: G++ don't check (member) function parameter for abstract-ness. gdr
2001-03-07 Re: c++/2199: misspelling in gcc/combine.c (compiling 2.95.2 with2.95.3) Bernd Schmidt
2001-03-07 target/2203: dlopen() crashes on AIX when compiling with g++ uddeborg
2001-03-07 c++/2202: g++ accept to throw object of class with pure virtual member bourguet
2001-03-07 c++/2201: Internal compiler error while compiling patr of lapack++ a.metselaar
2001-03-07 Re: c++/800 pbienst
2001-03-07 Re: c++/1657 pbienst
2001-03-07 Re: c++/1687 pbienst
2001-03-07 Re: c++/1688 pbienst
2001-03-07 Re: c++/1699 pbienst
2001-03-07 Re: c++/1757 pbienst
2001-03-07 Re: c++/1742 pbienst
2001-03-07 Re: c++/1769 pbienst
2001-03-07 Re: c++/1779 pbienst
2001-03-07 Re: c++/1916 pbienst
2001-03-07 c++/2200: -finstrument-functions doesn't work with exceptions? bjorn_hellander
2001-03-06 Re: c++/2138: trouble with STL's distance function Benjamin Kosnik
2001-03-06 Re: libstdc++/2181: Problems with istringstream Benjamin Kosnik
2001-03-06 Re: java/2194 bryce
2001-03-06 Re: libgcj/1736 Bryce McKinlay
2001-03-06 c++/2199: misspelling in gcc/combine.c (compiling 2.95.2 with 2.95.3) maxy
2001-03-06 c++/2198: nested templates trigger ICE in gcc version 2.95.3 20010219 (prerelease) schimmel
2001-03-06 c++/2197: "error before '$'", but no '$' in compilation unit schmid
2001-03-06 c++/2196: Template specialization and LONG_LONG_MAX -> sorry schmid
2001-03-06 c++/2195: Template specialization and LONG_LONG_MIN -> ice schmid
2001-03-06 Re: libgcj/1736 Robert Boehne
2001-03-06 java/2194: error: redefinition of symbol ".LLBB0" ask
2001-03-06 fortran/2193: g77 installation get me an error when use ld. e_schwob
2001-03-06 c/2192: compilation of GToolkit gtoolkit-0.9.4] under Red HAT 7.0 bmrevet
2001-03-05 Re: libgcj/1736 Bryce McKinlay
2001-03-05 Re: libgcj/1736 Alexandre Oliva
2001-03-05 Re: libstdc++/2181: Problems with istringstream Benjamin Kosnik
2001-03-05 Re: c/1994 Ben Caradoc-Davies
2001-03-05 Re: libstdc++/2079 L. David Baron
2001-03-05 Re: libstdc++/2190: abs(long), div(long,long) defined in <cmath> instead of <cstdlib> Benjamin Kosnik
2001-03-05 Re: c++/2189: g++ rejects legal code Benjamin Kosnik
2001-03-05 Re: c++/1874 neil
2001-03-05 Re: preprocessor/2188 neil
2001-03-05 c/2191: GCC 2.95.2 gives misleading "syntax error" with headerfile typedef, when error is elsewhere Mika.Reunanen
2001-03-05 libstdc++/2190: abs(long), div(long,long) defined in <cmath> instead of <cstdlib> snyder
2001-03-05 c++/2189: g++ rejects legal code mayer
2001-03-05 preprocessor/2188: (-ffast-math implies -D__FAST_MATH__) not documented lucier
2001-03-05 c/2187: /usr/include/_G_config.h:53: Internal error: Segmentation fault. klau
2001-03-05 c++/2185: (T()) not accepted as function argument rene
2001-03-05 c++/2184: using declarations for classes in function templates Sylvain.Pion
2001-03-05 c++/2183: gcc-3_0-branch compiles 2x slower than 2.95 gisli
2001-03-05 libstdc++/2181: Problems with istringstream schmid
2001-03-05 c++/2182: Internal compiler error in latest gcc (trunk & gcc 3) using -fpic fnf
2001-03-05 c++/2180: g++ crashes when compiling qgbkcodec.cpp in qt-2.2.4 sb
2001-03-05 c/2179: segv on declaration of large arrays when using -pthread option abaddon
2001-03-05 c++/2178: ignoring of an unitialized reference error mik
2001-03-05 c/2177: code generated segementation faults inappropriately dean
2001-03-04 Re: c/1739 neil
2001-03-04 other/2176: Printing unsigned long int with int format in dwarf2out.c lucier
2001-03-04 optimization/2175: fold in fold_const.c associates non-multiply expressions lucier
2001-03-04 other/2174: configure --enable-languages=c,c++,g77,objc does not fail lucier
2001-03-04 Re: libstdc++/1620 Nathan Neulinger
2001-03-04 c/2173: Wide char definitions in mips-sgi-irix (includes patch) David.Billinghurst
2001-03-04 c++/2172: g++ Internal error #19990916 Uwe F. Mayer
2001-03-04 c++/2171: g++ Internal error #19990916. mayer
2001-03-04 Re: preprocessor/2151 neil
2001-03-04 c/2170: gcc version 2.95.3 19991030 (prerelease) stops with Error 1 when trying to make postfix-release-20010228 on OpenBSD 2.8 (ports) w.zeikat
2001-03-04 Re: c/1536 Neil Booth
2001-03-04 Re: c/1536 Eyal Lebedinsky
2001-03-04 Re: c/1578 neil
2001-03-04 Re: c/1577 neil
2001-03-04 Re: c/1575 neil
2001-03-04 Re: c/1569 neil
2001-03-04 Re: c/1567 neil
2001-03-04 Re: c/1555 neil
2001-03-04 Re: c/1566 neil
2001-03-04 Re: c/1554 neil
2001-03-04 Re: c/1534 neil
2001-03-04 Re: c/1536 neil
2001-03-04 Re: c/1527 neil
2001-03-04 c/2168: genattr abort during cross compilation pit
2001-03-03 c++/2167: wrong constructor called theonetruekenny
2001-03-03 RE: fortran/2153: statement function arg namespace overlaps subr namespace Billinghurst, David \(CRTS\)
2001-03-03 c++/2166: More mangling bugs carlo
2001-03-03 Re: libgcj/1334 Bryce McKinlay
2001-03-03 RE: c/471 Billinghurst, David \(CRTS\)
2001-03-03 Re: c/1525 neil
2001-03-03 Re: c/1524 neil
2001-03-03 Re: optimization/1523 neil
2001-03-03 Re: c/471 neil
2001-03-03 Re: c/1673 neil
2001-03-03 Re: c/1814 neil
2001-03-03 Re: c/2165 neil
2001-03-03 Re: c++/2163: Code for constructors emitted twice. Carlo Wood
2001-03-03 Re: c/2165: Make on plotutils-2.4 causes gcc to gives segmentation fault Tim Prince
2001-03-03 c/2165: Make on plotutils-2.4 causes gcc to gives segmentation fault krishna.kant
2001-03-03 c/2164: ICE on NetBSD/i386, gcc 3.0 20010303 (prerelease) anonymous
2001-03-03 c++/2163: Code for constructors emitted twice. carlo
2001-03-03 optimization/2162: solaris2.7 extra -fPIC failures from execute/loop-8.c ghazi
2001-03-03 Re: preprocessor/2152 neil
2001-03-03 Re: c/2156: gcc.c-torture/execute/conversion.c fails with -O3 -fpic/-fPIC Kaveh R. Ghazi
2001-03-03 Re: fortran/1645 toon
2001-03-03 Re: fortran/1993 toon
2001-03-03 Re: c/2156: gcc.c-torture/execute/conversion.c fails with -O3 -fpic/-fPIC Neil Booth
2001-03-03 c/2161: long if-else cascade overflows parser stack anton
2001-03-03 c/2160: signal 11 when compiling large generated program anton
2001-03-03 Re: java/1266 bryce
2001-03-03 Re: java/1466 bryce
2001-03-03 Re: libgcj/1334 bryce
2001-03-03 Re: java/1382 Bryce McKinlay
2001-03-03 Re: libgcj/1196 bryce
2001-03-02 Re: java/1380 bryce
2001-03-02 Re: java/1210 bryce
2001-03-02 Re: java/1382 bryce
2001-03-02 Re: libgcj/1615 bryce
2001-03-02 Re: java/1401 Bryce McKinlay
2001-03-02 Re: java/1386 bryce
2001-03-02 Re: java/1682 bryce
2001-03-02 Re: java/1564 bryce
2001-03-02 Re: java/1828 bryce
2001-03-02 Re: java/1745 bryce
2001-03-02 Re: libgcj/1685 Bryce McKinlay
2001-03-02 c++/2159: g++ Internal error #122 mayer
2001-03-02 Re: java/2068 bryce
2001-03-02 Re: java/1922 bryce
2001-03-02 Re: java/1880 bryce
2001-03-02 Re: java/1904 bryce
2001-03-02 Re: java/1723 bryce
2001-03-02 Re: java/1393 bryce
2001-03-02 Re: libgcj/1718 bryce
2001-03-02 Re: java/1391 Bryce McKinlay
2001-03-02 Re: java/1360 bryce
2001-03-02 Re: java/1349 bryce
2001-03-02 Re: java/1346 bryce
2001-03-02 Re: java/1333 Bryce McKinlay
2001-03-02 Re: c/838 ghazi
2001-03-02 Re: java/1332 bryce
2001-03-02 Re: java/2026 bryce
2001-03-02 Re: java/1284 bryce
2001-03-02 Re: c/837 ghazi
2001-03-02 Re: java/1283 bryce
2001-03-02 Re: libgcj/1281 bryce
2001-03-02 Re: java/1454 bryce
2001-03-02 Re: libgcj/1440 bryce
2001-03-02 Re: java/1433 bryce
2001-03-02 c/2158: extra testsuite "execute" failures with -O -fomit-frame-pointer -p (profiling) ghazi
2001-03-02 Re: java/1414 bryce
2001-03-02 Re: java/1414 Bryce McKinlay
2001-03-02 Re: java/1414 Mo DeJong
2001-03-02 Re: middle-end/2133 Carlo Wood
2001-03-02 c/2157: gcc.c-torture/execute/990127-2.c fails with -O3 -fpic/-fPIC ghazi
2001-03-02 c/2156: gcc.c-torture/execute/conversion.c fails with -O3 -fpic/-fPIC ghazi
2001-03-02 java/2155: Overzealous detection of uninitialized final variables bryce
2001-03-02 Re: java/1212 bryce
2001-03-02 Re: java/1376 bryce
2001-03-02 Re: java/1261 bryce
2001-03-02 Re: java/1213 Bryce McKinlay
2001-03-02 Re: java/247 bryce
2001-03-02 Re: java/247 Bryce McKinlay
2001-03-02 Re: java/1157 bryce
2001-03-02 Re: java/1148 bryce
2001-03-02 Re: libgcj/1146 bryce
2001-03-02 Re: libgcj/1145 bryce
2001-03-02 Re: libgcj/1128 bryce
2001-03-02 Re: java/1121 bryce
2001-03-02 Re: libgcj/506 bryce
2001-03-02 Re: libgcj/506 Bryce McKinlay
2001-03-02 Re: libgcj/1300 bryce
2001-03-02 Re: java/1197 bryce
2001-03-02 Re: java/1387 bryce
2001-03-02 Re: java/1999 bryce
2001-03-02 Re: java/1414 bryce
2001-03-02 Re: libgcj/1303 bryce
2001-03-02 Re: libgcj/1363 bryce
2001-03-02 Re: java/1244 bryce
2001-03-02 Re: java/651 bryce
2001-03-02 Re: libgcj/1640 bryce
2001-03-02 Re: java/1392 bryce
2001-03-02 Re: java/1315 Bryce McKinlay
2001-03-02 Re: java/1320 bryce
2001-03-02 Re: java/1372 bryce
2001-03-02 Re: java/1409 bryce
2001-03-02 Re: java/1350 bryce
2001-03-02 Re: java/1299 bryce
2001-03-02 Re: java/1249 bryce
2001-03-02 Re: java/1342 bryce
2001-03-02 Re: java/910 bryce
2001-03-02 c++/2154: gcc compilation failure murat
2001-03-02 Re: preprocessor/2152: gcc -v emits CPP version number twice Neil Booth
2001-03-02 Re: java/2149: storage size of `_ZTVN4java4lang5ClassE' isn't known Bryce McKinlay
2001-03-02 fortran/2153: statement function arg namespace overlaps subr namespace crussell
2001-03-02 preprocessor/2152: gcc -v emits CPP version number twice Rainer Orth
2001-03-02 Re: preprocessor/2151: `gcc -E -' makes core dump Neil Booth
2001-03-02 Re: c++/1896 neil
2001-03-02 Re: preprocessor/2143 neil
2001-03-02 Re: c++/1821 aoliva
2001-03-02 preprocessor/2151: `gcc -E -' makes core dump ask
2001-03-02 Re: optimization/2146: Invalid optimization for the exponentialfunction Stephen L Moshier
2001-03-02 java/2149: storage size of `_ZTVN4java4lang5ClassE' isn't known ask
2001-03-02 c++/2150: Internal compiler error. treaves
2001-03-02 libstdc++/2148: Strange warning while bootstrapping the libstc++ library schmid
2001-03-02 Re: c++/338 nathan
2001-03-02 c++/2147: code cannot be debugged on IRIX Helmut Jarausch
2001-03-02 Re: c++/2065 nathan
2001-03-02 Re: c++/2065 nathan
2001-03-02 Re: c++/1833 aoliva
2001-03-02 Re: c++/1835 aoliva
2001-03-02 optimization/2146: Invalid optimization for the exponential function Frederic.Goualard
2001-03-02 Re: c++/1837 aoliva
2001-03-02 Re: c++/1842 aoliva
2001-03-02 Re: c++/1844 aoliva
2001-03-02 Re: c++/1869 aoliva
2001-03-02 Re: c++/1870 aoliva
2001-03-02 Re: c++/1874 aoliva
2001-03-02 Re: c++/1877 aoliva
2001-03-02 Re: c++/1883 aoliva
2001-03-02 Re: c++/1896 aoliva
2001-03-02 Re: c++/1914 aoliva
2001-03-02 objc/2145: objc testsuite fails since libgcc_so.0 is not found aj
2001-03-01 preprocessor/2143: Cygwin testsuite regressions: -dirafter and system files David.Billinghurst
2001-03-01 c++/2142: silly internal error for a well placed ";" mikea
2001-03-01 other/2141: set -C in gccbug not portable Rainer Orth
2001-03-01 Re: debug/2129: osf1-5.0 gcc 2.95.2 fails with -g flag Rainer Orth
2001-03-01 Re: c++/2139 Annoying C++ warning Phil Edwards
2001-03-01 c++/2140: Internet error: Segmentation fault / Tree check: expected class ... michael
2001-03-01 Re: c++/2125 nathan
2001-03-01 Re: c++/2125 nathan
2001-03-01 Re: c++/2139 nathan
2001-03-01 Re: c++/2139 nathan
2001-03-01 c++/2139: Annoying C++ warning Sylvain Pion
2001-03-01 Re: libstdc++/1717 Michael Ritzert
2001-03-01 Re: c++/1981 nathan
2001-03-01 Re: c++/2138: trouble with STL's distance function Wolfgang Bangerth
2001-03-01 Re: c++/75 nathan
2001-03-01 c++/2138: trouble with STL's distance function reichelt
2001-03-01 Re: c++/2137 nathan
2001-03-01 Re: c++/2137 nathan
2001-03-01 c++/2137: friend access and DR 209 nathan
2001-03-01 Re: c++/2127 Reichelt
2001-03-01 c++/2136: g++ seems to disregard '::' in '::delete' mps
2001-03-01 Re: other/2118 Vladimir A. Merzliakov
2001-03-01 c++/2135: Exceptions broken using -O2 and method-pointers together tgarnock-jones
2001-02-28 c++/2134: GCC build aborts with segmentation fault shridhar_daithankar
2001-02-28 middle-end/2133: Bug in the mangler of the new ABI (both 3.0 and 3.1) Carlo Wood
2001-02-28 Re: c++/2042: Traditional C++ syntax error on id "export" Benjamin Kosnik
2001-02-28 Re: libstdc++/2086: bootstrap error, libstdc++-v3/src/local.cc: op - Benjamin Kosnik
2001-02-28 optimization/2131: Wrong result upon returning long long value nenad
2001-02-28 c++/2130: problem at compilation when using friend with a template class francois.sugny
2001-02-28 Re: preprocessor/2074 neil
2001-02-28 debug/2129: osf1-5.0 gcc 2.95.2 fails with -g flag mikef
2001-02-28 c/2128: [Tru64 UNIX V5.1] gcc testsuite failures: long to long double conversion Rainer Orth
2001-02-28 c++/2127: namespace problems reichelt
2001-02-28 other/2126: configure script fails with --silent option pirie
2001-02-28 Re: c++/80 Karsten Muuss
2001-02-28 c++/2125: Namespaces are confused by forward-referencing typedefs stephen.webb
2001-02-28 Re: c++/338 nathan
2001-02-28 c++/2124: Misleading error message when name conflicts detected stephen.webb
2001-02-28 c++/2123: Array initializer schreib
2001-02-28 optimization/2122: Error in openssl ask
2001-02-28 Re: c++/1082 pbienst
2001-02-28 Re: c/1517 neil
2001-02-28 Re: c++/1007 nathan
2001-02-28 Re: c/1517 Andreas Jaeger
2001-02-28 c++/2121: Parse error bourguet
2001-02-28 Re: c++/2088 neil
2001-02-28 Re: c++/2087 neil
2001-02-27 Re: libstdc++/1886 benjamin kosnik
2001-02-27 Re: c/1510 Foom
2001-02-27 Re: c/2100: -fstrength-reduce (is active with -O2) produces wrong code Franz Sirl
2001-02-27 Re: c/1517 neil
2001-02-27 Re: target/1515 neil
2001-02-27 Re: c/1510 neil
2001-02-27 Re: c/1504 neil
2001-02-27 Re: c/1485 neil
2001-02-27 Re: c++/1784 Rosen, Hyman
2001-02-27 Re: c++/110 gdr
2001-02-27 Re: c++/81 gdr
2001-02-27 c++/2120: error 19990919 occurs in compilation Pat_n_Cats
2001-02-27 target/2119: Boostrap fails with i686-pc-solaris2.7 where i386-pc-solaris2.7 works. frohlich
2001-02-27 Re: c++/891 nathan
2001-02-27 Re: c++/2117 nathan
2001-02-27 other/2118: Error in Makefile (make -k check) wanderer
2001-02-27 Re: target/2032 Richard Earnshaw
2001-02-27 Re: target/2032 Richard Earnshaw
2001-02-27 Re: c++/2117 nathan
2001-02-27 c++/2117: gcc3.0 cannot return references from conversion operators Henry Weller
2001-02-27 middle-end/2116: ICE in reload Ian Dall
2001-02-27 Re: c++/1683 Michael Ritzert
2001-02-27 Re: c++/880 nathan
2001-02-27 Re: c++/878 nathan
2001-02-27 Re: c++/821 nathan
2001-02-27 Re: c++/643 nathan
2001-02-27 c++/2115: asm bug related to inline function Sylvain.Pion
2001-02-27 Re: c++/2110 nathan
2001-02-27 Re: c++/1981 nathan
2001-02-27 Re: c++/1981 nathan
2001-02-26 RE: libstdc++/1972 Benjamin Kosnik
2001-02-26 c++/2113: Internal compiler error in expand_inline_function, at integrate.c:676 chandler
2001-02-26 RE: libstdc++/1972 Greg Bumgardner
2001-02-26 c++/2112: Diagnostic message misleading for binding r-value to non-const reference richarda
2001-02-26 c++/2111: Class derivation over embedded templates arch
2001-02-26 Re: target/2032 =?big5?B?QnJhbmRvbiBZYW5nILeortG7yg==?=
2001-02-26 c++/2110: compile error in function pointer cast (regression from 2.95) dmuell
2001-02-26 optimization/2109: followup #2072 - -ffloat-store negates bug eljay
2001-02-26 Re: c++/1924 Joe Buck
2001-02-26 Re: c++/1921 jbuck
2001-02-26 Re: web/2106: Can't read CVS diffs from gcc-cvs.gnu.org archive Joseph S. Myers
2001-02-26 Re: c++/1920 jbuck
2001-02-26 c++/2108: parse error on legal code. jamie
2001-02-26 Re: c++/1920 Joe Buck
2001-02-26 optimization/2107: followup to 2072 -- bug details discovered (SPARC, PIC) eljay
2001-02-26 Re: web/2106: Can't read CVS diffs from gcc-cvs.gnu.org archive Brad Lucier
2001-02-26 Re: libstdc++/1972 benjamin kosnik
2001-02-26 Re: web/2106: Can't read CVS diffs from gcc-cvs.gnu.org archive Phil Edwards
2001-02-26 web/2106: Can't read CVS diffs from gcc-cvs.gnu.org archive lucier
2001-02-26 Re: libstdc++/2079 pme
2001-02-26 Re: c/1013 neil
2001-02-26 Re: c/1012 neil
2001-02-26 c++/2105: internal compiler error bischoff
2001-02-26 Re: c/991 neil
2001-02-26 Re: c/2102 neil
2001-02-26 Re: c++/2094 neil
2001-02-26 c++/2104: ice only if debuggging (-g) is enabled schmid
2001-02-26 libstdc++/2103: No support for wchar i/o Ralf.Bartzke
2001-02-26 c/2102: no warning when comparing (unsigned int) with (int) philippe.jouguet
2001-02-26 c++/2101: expression in structure initializer in template causes ICE niemayer
2001-02-26 c/2100: -fstrength-reduce (is active with -O2) produces wrong code dllorens
2001-02-26 Re: c++/1996 nathan
2001-02-26 Re: c++/2053 nathan
2001-02-26 Re: c++/2057 nathan
2001-02-26 Re: c++/2081 nathan
2001-02-26 Re: c++/75 nathan
2001-02-26 Re: c/1580 neil
2001-02-26 Re: c++/1765 nathan
2001-02-26 optimization/2099: ICE in gen_reg_rtx, at emit-rtl.c:541 ask
2001-02-26 c/2098: compare with unsigned variable - no error reporting jochen.pernsteiner
2001-02-26 Re: c/1580 Alexander Klimov
2001-02-26 debug/2097: The compiler gives a Segmentation Fault when debug option is passed (-g) rafa
2001-02-26 java/2095: redefinition of symbol ".LLBB0" in assembler output ask
2001-02-26 Re: c/1827 Etienne Lorrain
2001-02-26 Re: c++/2065: Annoying invalid message on compiler-generated copyconstructor -- regression vs. 2.95 Wolfgang Bangerth
2001-02-26 Re: libstdc++/1919 pme
2001-02-26 Re: c/696 neil
2001-02-26 Re: c++/690 neil
2001-02-26 Re: optimization/671 neil
2001-02-25 Re: c++/637 neil
2001-02-25 Re: c++/424 neil
2001-02-25 Re: c++/271 neil
2001-02-25 Re: c++/116 neil
2001-02-25 Re: c++/1871 neil
2001-02-25 Re: c++/1764 neil
2001-02-25 Re: c++/2094 neil
2001-02-25 c++/2094: gcc3.1 emits 'sorry, not implemented: use of `ptrmem_cst' in template type unification' togawa
2001-02-25 Re: c++/2065: Annoying invalid message on compiler-generated copy constructor -- regression vs. 2.95 Phil Edwards
2001-02-25 Re: c++/1871 Craig Rodrigues
2001-02-25 Re: c++/1764 Craig Rodrigues
2001-02-25 optimization/2093: Internal compiler error emitting DWARF2 for nested functions velco
2001-02-25 c++/2092: parse error in conjunction with templates post
2001-02-25 optimization/2091: SPARC follow-up to 2072 -- illustrative example eljay
2001-02-25 c/2090: Internal error: Segmentation fault when compiling wref.c with -Os gilles.rajaobelina
2001-02-25 libstdc++/2089: Problems with namespaces and exceptions (std::range_error) schmid
2001-02-25 c++/2088: Bootstrap 3.0 on i686-linux fails again. carlo
2001-02-25 Re: c++/2087: ICE during bootstrap of 3.0 Carlo Wood
2001-02-25 Re: c++/1604 neil
2001-02-25 Re: libstdc++/1627 neil
2001-02-25 Re: c++/1790 neil
2001-02-25 Re: c++/1690 neil
2001-02-25 Re: c++/1791 neil
2001-02-25 Re: c++/1983 neil
2001-02-25 Re: c++/1985 neil
2001-02-25 Re: preprocessor/2069 neil
2001-02-24 c++/2087: ICE during bootstrap of 3.0 carlo
2001-02-24 libstdc++/2086: bootstrap error, libstdc++-v3/src/local.cc: op - mschalit
2001-02-24 Re: c++/1709 neil
2001-02-24 Re: c++/1709 Craig Rodrigues
2001-02-24 Re: preprocessor/2069: Preprocessor defines machine-type=1 Neil Booth
2001-02-24 c/2085: sparc-sun-solaris2.7 RTL checking bootstrap failure on 3.1 CVS ghazi
2001-02-24 c++/2084: LONG_LONG_MAX causes ice in tree_low_cst (namespaces) schmid
2001-02-24 c++/2083: Internal compiler error in `gen_reload_inhi', at insn-emit.c:5550 misiek
2001-02-24 Re: target/2032 Richard Earnshaw
2001-02-24 Re: debug/1964 neil
2001-02-24 Re: debug/1964 neil
2001-02-24 Re: debug/1964 neil
2001-02-24 Re: c/1956 neil
2001-02-24 Re: c/1942 neil
2001-02-24 Re: c/1909 neil
2001-02-24 Re: c/1892 neil
2001-02-24 Re: c/1872 neil
2001-02-24 Re: c++/2082 neil
2001-02-24 Re: c/1827 neil
2001-02-24 Re: c++/2082 L. David Baron
2001-02-24 Re: c++/2082 Neil Booth
2001-02-24 Re: c++/2082 L. David Baron
2001-02-24 Re: c++/2082 neil
2001-02-24 Re: c/1814 neil
2001-02-24 Re: c/1793 neil
2001-02-24 Re: c/1786 neil
2001-02-24 c++/2082: g++ defines _GNU_SOURCE by default dbaron
2001-02-24 Re: c/1691 neil
2001-02-24 Re: c/976 pbienst
2001-02-24 Re: optimization/1775 neil
2001-02-24 Re: c/977 pbienst
2001-02-24 Re: c/987 pbienst
2001-02-24 Re: c/978 pbienst
2001-02-24 Re: c/989 pbienst
2001-02-24 Re: c/1750 neil
2001-02-24 Re: c/1601 neil
2001-02-24 Re: c/1749 neil
2001-02-24 Re: c/993 pbienst
2001-02-24 c++/2081: Zero cast to reference in constructor default parameter causes ICE gcc-bug
2001-02-24 Re: c/1001 pbienst
2001-02-24 c++/2080: g++ runs out of memory if reference parameter is initialized with 0 gcc-bug
2001-02-24 Re: c/1045 pbienst
2001-02-24 Re: c/1046 pbienst
2001-02-24 Re: preprocessor/2074 neil
2001-02-24 Re: c/1051 pbienst
2001-02-24 Re: c/1073 pbienst
2001-02-24 Re: c/1060 pbienst
2001-02-24 Re: c/1097 pbienst
2001-02-24 Re: c/1495 pbienst
2001-02-24 Re: c/1708 Andy Johnson
2001-02-24 Re: other/636 neil
2001-02-24 Re: c++/670 neil
2001-02-23 libstdc++/2079: iostream.h needs more using declarations dbaron
2001-02-23 optimization/2078: Internal compiler error in print_rtl_and_abort, at flow.c:6592 ericb
2001-02-23 RE: c/1739 Billinghurst, David \(CRTS\)
2001-02-23 Re: c/202 neil
2001-02-23 optimization/2077: __builtin_frame_address(2) emits wrong codes. nobu.nokada
2001-02-23 optimization/2076: scheduler ignores data dependency dje
2001-02-23 Re: c/1739 neil
2001-02-23 Re: c/1715 neil
2001-02-23 Re: c/1714 neil
2001-02-23 Re: c/1708 neil
2001-02-23 Re: target/1668 neil
2001-02-23 Re: c/1696 neil
2001-02-23 Re: c/1705 neil
2001-02-23 Re: c/1673 neil
2001-02-23 Re: preprocessor/2075 neil
2001-02-23 Re: c/1650 neil
2001-02-23 Re: c/1662 neil
2001-02-23 preprocessor/2075: cpp doesn't emit builtin macros with -E/-save-temps Rainer Orth
2001-02-23 preprocessor/2074: cpp doesn't emit builtin macros with -E/-save-temps Rainer Orth
2001-02-23 fortran/2073: cannot configure the fortran compiler on my platform tacondarcure
2001-02-23 Re: c++/1643 neil
2001-02-23 Re: c++/1648 neil
2001-02-23 Re: c/1609 neil
2001-02-23 optimization/2072: SPARC leaf function loses %l7 contents spuriously eljay
2001-02-23 Re: c++/2052 pme
2001-02-23 Re: libstdc++/2071: cin bug on solaris 2.6 Vladimir A. Merzliakov
2001-02-23 libstdc++/2071: cin bug on solaris 2.6 Theodore.Papadopoulo
2001-02-23 Re: java/2068: java --> c++ Tom Tromey
2001-02-23 c++/2070: syntax error in correct code igodard
2001-02-23 preprocessor/2069: Preprocessor defines machine-type=1 rbt
2001-02-23 Re: java/2068: java --> c++ Alexander Klimov
2001-02-23 Re: java/2068: java --> c++ Manfred Hollstein
2001-02-23 java/2068: java --> c++ ask
2001-02-23 Re: libstdc++/2067: bootstrap failed: `alloca' undeclared Gabriel Dos Reis
2001-02-23 libstdc++/2067: bootstrap failed: `alloca' undeclared ask
2001-02-23 java/2066: Source parser segfault in resolve_package bryce
2001-02-23 Re: target/2032 =?big5?B?QnJhbmRvbiBZYW5nILeortG7yg==?=
2001-02-23 Re: c/1580 neil
2001-02-22 c++/2065: Annoying invalid message on compiler-generated copy constructor -- regression vs. 2.95 wolfgang.bangerth
2001-02-22 libstdc++/2064: config/os/irix/bits/ctype_base.h incompatible with IRIX 5.3 fleming.151
2001-02-22 Re: c/303 neil
2001-02-22 c++/2063: Internal compiler error in `gen_reload_inhi', at ../cc_tools/insn-emit.c:5550 vahe
2001-02-22 Re: c++/974 mmitchel
2001-02-22 Re: c/303 Joseph S. Myers
2001-02-22 Re: c/169 neil
2001-02-22 target/2062: -mcpu=ultrasparc (or -mv9) -O1 with long argument lists and doubles can produce bad code llib
2001-02-22 Re: c/303 neil
2001-02-22 Re: c/423 neil
2001-02-22 Re: c/460 neil
2001-02-22 Re: c++/982 mmitchel
2001-02-22 Re: c++/994 mmitchel
2001-02-22 Re: c++/995 mmitchel
2001-02-22 Re: c++/996 mmitchel
2001-02-22 Re: c++/998 mmitchel
2001-02-22 Re: c++/1080 mmitchel
2001-02-22 Re: c++/1082 mmitchel
2001-02-22 Re: c++/2042: Traditional C++ syntax error on id "export" Phil Edwards
2001-02-22 Re: c++/1094 mmitchel
2001-02-22 Re: c++/1099 mmitchel
2001-02-22 Re: c++/1100 mmitchel
2001-02-22 Re: c++/1101 mmitchel
2001-02-22 Re: c++/1102 mmitchel
2001-02-22 c++/2061: g++-3 emits misleading warning schmid
2001-02-22 Re: c++/2050 pbienst
2001-02-22 java/2060: Bug accessing variable in superclass from inner class of subclass. (value is munged) mjr
2001-02-22 Re: c++/271 Mike R. Manzano
2001-02-22 Re: c++/271 Mike R. Manzano
2001-02-22 Re: c++/2043 Thomas Herter
2001-02-22 c++/2059: Internal compiler error. -- with template code with syntax errors. rhankins
2001-02-22 target/2058: gcc 3.1 20010221 will not bootstrap on m68k linux jason
2001-02-22 Re: c++/80 gdr
2001-02-22 Re: target/2032 =?big5?B?QnJhbmRvbiBZYW5nILeortG7yg==?=
2001-02-22 c++/2057: bug in global "const" array schreib
2001-02-22 Re: c++/2042 neil
2001-02-21 Re: c++/2043 neil
2001-02-21 Re: c++/116 Fabian Ritzmann
2001-02-21 Re: java/2040 bryce
2001-02-21 java/2040 bryce
2001-02-21 java/2040 bryce
2001-02-21 Re: c/2051 Jim Wilson
2001-02-21 c++/2055: Legal code rejected by gcc-3, accepted by gcc-2.95 (static array) schmid
2001-02-21 libstdc++/2054: g++-3 rejects legal code, accepted by g++-2.95.2 (functors) schmid
2001-02-21 c++/2053: Static cast from parent to children is working but shouldn't philippeb
2001-02-21 Re: preprocessor/2046 neil
2001-02-21 c++/2052: gcc 3.0 fails to recognize cout << flush; Robert Boehne
2001-02-21 Re: target/2032 rearnsha
2001-02-21 c/2051: dwarf2 bug on ia64 jes
2001-02-21 Re: c++/99 gdr
2001-02-21 Re: c++/102 gdr
2001-02-21 Re: c++/104 gdr
2001-02-21 Re: c++/1030 pbienst
2001-02-21 Re: c++/112 gdr
2001-02-21 Re: c++/116 gdr
2001-02-21 Re: c++/119 gdr
2001-02-21 Re: c++/140 gdr
2001-02-21 Re: c++/2048 lerdsuwa
2001-02-21 c++/2050: Compiler incorrectly complains about instantiation of template declaration with operator mathijs
2001-02-20 c++/2049: gcc 2.95/3.0 gives syntax error igodard
2001-02-20 c++/2048: 2.97 20010205 parsing error braz
2001-02-20 c/2047: Internal compiler error in `require_complete_type', at c-typeck.c:96 jreiser
2001-02-20 Re: c++/1054 jdennett
2001-02-20 c/2046: gcc does not allow '-' (stdin) as input tranle
2001-02-20 Re: c++/1047 jdennett
2001-02-20 Re: c++/1050 jdennett
2001-02-20 Re: c++/1039 jdennett
2001-02-20 c++/2045: no warning when a non void function falls through without a return value; bad code generated. jamie
2001-02-20 Re: c++/1034 jdennett
2001-02-20 Re: c++/1015 jdennett
2001-02-20 c++/2044: errant template compilation errors igodard
2001-02-20 c++/2043: C++ traditional-cpp refuses to pass a specific pointer to function with void* argument herter
2001-02-20 c++/2042: Traditional C++ syntax error on id "export" herter
2001-02-20 Re: c/471 neil
2001-02-20 Re: c/474 neil
2001-02-20 Re: c++/720 mmitchel
2001-02-20 Re: c++/1899 neil
2001-02-20 Re: c++/1843 neil
2001-02-20 Re: c++/2013 neil
2001-02-20 Re: c/2029 neil
2001-02-20 Re: c++/715 mmitchel
2001-02-20 c/2041: incorrect warning message for -m486 option cljanss
2001-02-20 java/2040: java.util.Hashtable(int,float) is stricter than sun's version pedro
2001-02-20 c++/2039: bad code generated for access to unnamed union in base class jlemke
2001-02-20 Re: c++/1014 jdennett
2001-02-20 Re: c++/1003 jdennett
2001-02-20 c++/2038: struct used, int expected jorgen
2001-02-20 RE: c++/1003 Meyer, Jeffrey S
2001-02-20 libstdc++/2037: ostrstream, string & vector delivers 'garbage' output with cout georg.ritter
2001-02-20 Re: c++/1671 neil
2001-02-20 Re: c/2029: problem with build for Cygwin Ashutosh Sharma
2001-02-20 Re: c++/809 lerdsuwa
2001-02-20 Re: c++/750 lerdsuwa
2001-02-20 Re: c++/1550 lerdsuwa
2001-02-20 Re: c/1591 lerdsuwa
2001-02-20 Re: other/1747 lerdsuwa
2001-02-20 Re: java/1641 lerdsuwa
2001-02-20 Re: libstdc++/1678 lerdsuwa
2001-02-20 Re: c++/1761 lerdsuwa
2001-02-20 Re: c++/1889 lerdsuwa
2001-02-20 Re: c++/1863 lerdsuwa
2001-02-20 Re: c++/1789 lerdsuwa
2001-02-20 Re: web/2036 gerald
2001-02-20 Re: c++/1725 lerdsuwa
2001-02-20 Re: c++/1733 lerdsuwa
2001-02-20 web/2036: More broken gcc-cvs links Joseph Myers
2001-02-19 c/2035: Internal compiler error on complex casts. Only with optimisation. emmerik
2001-02-19 c/2034: boostrap error, CVS gcc, as: unrecognized option `-Qy' mschalit
2001-02-19 fortran/2033: -ffixed-line-length-none gives bogus warning asnd
2001-02-19 Re: fortran/1993 Stephen J. Gowdy
2001-02-19 debug/2032: The bugs in libgcc2.c when building x86 to ARM cross compiler ericy
2001-02-19 fortran/2031: ICE in g77.f-torture/compile/20000511-2.f David.Billinghurst
2001-02-19 Re: c++/1843 Craig Rodrigues
2001-02-19 Re: web/1024 pme
2001-02-19 Re: libstdc++/1986 Matt Schalit
2001-02-19 Re: c++/708 mmitchel
2001-02-19 Re: c++/692 mmitchel
2001-02-19 Re: c++/691 mmitchel
2001-02-19 c/2030: misleading warning for -m486 snyder
2001-02-19 Re: c++/1899 David LaRose
2001-02-19 Re: c++/1789 Craig Rodrigues
2001-02-19 c/2029: problem with build for Cygwin ashutosh.sharma
2001-02-19 c++/2028: option -finstrument-functions breaks valid code schmitt
2001-02-19 c/2027: gcc crash when compiling at -O1 or higher jes
2001-02-19 java/2026: libjava/gnu/gcj/xlib/natClip.cc:15:18: vector: No such file or directory ask
2001-02-19 optimization/2025: ICE in extract_insn, at recog.c:2227 ask
2001-02-18 Re: c++/1592 lerdsuwa
2001-02-18 Re: c++/1602 lerdsuwa
2001-02-18 Re: c++/1619 lerdsuwa
2001-02-18 Re: c++/1622 lerdsuwa
2001-02-18 Re: c++/1674 lerdsuwa
2001-02-18 Re: c++/1659 lerdsuwa
2001-02-18 Re: c++/1764 lerdsuwa
2001-02-18 Re: c++/1789 lerdsuwa
2001-02-18 Re: c++/1806 lerdsuwa
2001-02-18 Re: c++/1879 lerdsuwa
2001-02-18 libgcj/2024: libgcj can abort on bogus arguments to Class.forName() bryce
2001-02-18 c++/2023: ICE in lookup_template_class theonetruekenny
2001-02-18 RE: c++/1843 Steven Belbin
2001-02-18 Re: c++/1843 Craig Rodrigues
2001-02-18 Re: c++/2022: Internal compiler error when c function has same name as mangled C++ name Carlo Wood
2001-02-18 c++/2022: Internal compiler error when c function has same name as mangled C++ name adam
2001-02-18 c++/2021: Internal error #378. carlo
2001-02-18 libstdc++/2020: fstream initialization seg-faults if global locale is missing required facets bumgard
2001-02-18 c++/2019: Wrong line number in warning carlo
2001-02-18 fortran/2018: Sqrt causes ice in emit_move_insn, at expr.c:2718 schmid
2001-02-18 libstdc++/2017: Member function seekg is wrong rafa
2001-02-18 optimization/2016: -O _AND_ -funroll_all_loops causes segfaults on PPC ewindisc
2001-02-18 Re: c++/159 Martin v. Loewis
2001-02-18 Re: c++/188 jdennett
2001-02-18 Re: c++/181 jdennett
2001-02-18 Re: c++/176 jdennett
2001-02-18 Re: c++/172 jdennett
2001-02-18 Re: c++/171 jdennett
2001-02-18 Re: c++/1874 Tony Skjellum
2001-02-18 Re: c++/165 jdennett
2001-02-18 Re: c/529 neil
2001-02-18 Re: c++/1908 cjoy
2001-02-18 Re: c++/162 jdennett
2001-02-18 Re: c++/1505 neil
2001-02-18 Re: c++/1506 neil
2001-02-18 Re: c++/1876 neil
2001-02-18 Re: c++/1506 Vladimir A. Merzliakov
2001-02-18 Re: c++/1505 Vladimir A. Merzliakov
2001-02-18 Re: c++/1876 Kristopher R. Buschelman
2001-02-18 Re: c++/1901 lerdsuwa
2001-02-18 Re: c++/1951 lerdsuwa
2001-02-18 Re: c++/2010 lerdsuwa
2001-02-18 Re: c++/1988 lerdsuwa
2001-02-18 Re: c++/1725 lerdsuwa
2001-02-18 Re: c++/1863 lerdsuwa
2001-02-18 Re: c++/158 jdennett
2001-02-18 Re: c++/152 jdennett
2001-02-18 Re: c++/1871 Bram
2001-02-18 c++/2015: New ICE in snapshot of February 17 bagnara
2001-02-18 Re: c++/2013 Jukka Honkela
2001-02-18 Re: c++/1579 neil
2001-02-18 Re: c++/1562 neil
2001-02-18 Re: c++/1838 neil
2001-02-18 Re: c++/1862 neil
2001-02-18 Re: c++/1908 neil
2001-02-18 Re: c++/1952 neil
2001-02-17 Re: c++/1497 mmitchel
2001-02-17 Re: c++/288 mmitchel
2001-02-17 Re: c++/266 mmitchel
2001-02-17 Re: c++/1562 Chris Colohan
2001-02-17 Re: c++/1908 Craig Rodrigues
2001-02-17 Re: c++/1908 cjoy
2001-02-17 Re: c++/1842 Zbynek Vyskovsky
2001-02-17 Re: c++/1842 Craig Rodrigues
2001-02-17 Re: c++/1483 Craig Rodrigues
2001-02-17 Re: c++/1484 Craig Rodrigues
2001-02-17 Re: c++/1503 Craig Rodrigues
2001-02-17 Re: c++/1508 Craig Rodrigues
2001-02-17 Re: c++/1511 Craig Rodrigues
2001-02-17 Re: c++/298 mmitchel
2001-02-17 Re: c++/1519 Craig Rodrigues
2001-02-17 Re: c++/290 mmitchel
2001-02-17 RE: c++/1579 Mike Doughney
2001-02-17 Re: c++/1559 Craig Rodrigues
2001-02-17 Re: c++/264 mmitchel
2001-02-17 Re: c++/1562 Craig Rodrigues
2001-02-17 Re: c++/1602 Oleg Trott
2001-02-17 Re: c++/1602 Craig Rodrigues
2001-02-17 Re: c++/1573 Craig Rodrigues
2001-02-17 Re: c++/200 mmitchel
2001-02-17 Re: c++/1583 Craig Rodrigues
2001-02-17 Re: c++/1579 Craig Rodrigues
2001-02-17 Re: c++/1602 Oleg Trott
2001-02-17 Re: c++/1592 Craig Rodrigues
2001-02-17 Re: c++/1593 Craig Rodrigues
2001-02-17 Re: c++/213 mmitchel
2001-02-17 Re: c++/1602 Craig Rodrigues
2001-02-17 Re: c++/1602 Craig Rodrigues
2001-02-17 Re: c++/1604 Craig Rodrigues
2001-02-17 Re: c++/1619 Craig Rodrigues
2001-02-17 Re: c++/259 mmitchel
2001-02-17 Re: c++/2013 Craig Rodrigues
2001-02-17 Re: c++/1622 Craig Rodrigues
2001-02-17 Re: c++/1627 Craig Rodrigues
2001-02-17 Re: c++/254 mmitchel
2001-02-17 Re: c++/1659 Craig Rodrigues
2001-02-17 Re: c++/1674 Craig Rodrigues
2001-02-17 Re: c++/1690 Craig Rodrigues
2001-02-17 Re: c++/1757 Craig Rodrigues
2001-02-17 Re: c++/1764 Craig Rodrigues
2001-02-17 Re: c++/1838 Phil Brabbin
2001-02-17 Re: c++/1862 Kaiyuan Huang
2001-02-17 Re: c++/1813 Shawn Starr
2001-02-17 Re: c++/1789 Craig Rodrigues
2001-02-17 Re: c++/1790 Craig Rodrigues
2001-02-17 Re: c++/1791 Craig Rodrigues
2001-02-17 Re: c++/1952 Pete W.
2001-02-17 Re: c++/1838 Craig Rodrigues
2001-02-17 Re: c++/1838 Phil Brabbin
2001-02-17 Re: c++/1798 Craig Rodrigues
2001-02-17 Re: c++/1806 Craig Rodrigues
2001-02-17 Re: c++/1808 Craig Rodrigues
2001-02-17 Re: c++/1813 Craig Rodrigues
2001-02-17 Re: c++/1838 Craig Rodrigues
2001-02-17 Re: c++/1843 Craig Rodrigues
2001-02-17 Re: c++/1862 Craig Rodrigues
2001-02-17 Re: c++/1871 Craig Rodrigues
2001-02-17 Re: c++/1914 Richard B. Kreckel
2001-02-17 Re: c++/1876 Craig Rodrigues
2001-02-17 Re: c++/1874 Craig Rodrigues
2001-02-17 Re: c++/1879 Craig Rodrigues
2001-02-17 c++/2014: error in print_rtl_and_abort, at flow.c:6592 george.goffe
2001-02-17 Re: c++/1887 Craig Rodrigues
2001-02-17 Re: optimization/1931 rth
2001-02-17 Re: java/1382 green
2001-02-17 Re: java/1380 green
2001-02-17 c++/2013: g++ 2.96: typedefs + namespaces + inheritance == problem fatal
2001-02-17 Re: c++/1899 Craig Rodrigues
2001-02-17 Re: optimization/1931: Alpha->68K cross produces duff floating pointinstruction Dave Gilbert
2001-02-17 Re: c++/1900 Craig Rodrigues
2001-02-17 Re: c++/1901 Craig Rodrigues
2001-02-17 Re: c++/1908 Craig Rodrigues
2001-02-17 Re: c++/1914 Craig Rodrigues
2001-02-17 c/2012: ICE when compiling current cvs gcc David Welch
2001-02-17 Re: c++/1951 Craig Rodrigues
2001-02-17 Re: c++/1952 Craig Rodrigues
2001-02-17 c/2011: ICE when compiling current cvs gcc David Welch
2001-02-17 Re: c++/1983 Craig Rodrigues
2001-02-17 Re: c++/1988 Craig Rodrigues
2001-02-17 Re: c++/1985 Craig Rodrigues
2001-02-17 Re: c++/2010 Craig Rodrigues
2001-02-17 Re: c++/1889 lerdsuwa
2001-02-17 Re: c++/1733 lerdsuwa
2001-02-17 Re: web/2000 gerald
2001-02-17 Re: middle-end/1800 rth
2001-02-16 c++/2010: Internal error: Segmentation fault (version 2.97 20010207) carlo
2001-02-16 Re: c++/96 ao
2001-02-16 Re: java/1999 Bryce McKinlay
2001-02-16 Re: java/1999 Bryce McKinlay
2001-02-16 Re: c++/1959 Richard Andrews
2001-02-16 Re: c++/1924 Simpson, Kenny
2001-02-16 Re: c++/97 gdr
2001-02-16 Re: c++/1990 pme
2001-02-16 Re: libstdc++/1986 pme
2001-02-16 Re: c/2007 neil
2001-02-16 Re: c++/2009: g++ (-lGLU) Randall Hopper
2001-02-16 c++/2009: g++ (-lGLU) aa8vb
2001-02-16 java/2008: ICE in gcj (no optimization) Martin Kahlert
2001-02-16 Re: preprocessor/2007: gcc has a segmentation fault with defines Carlo Wood
2001-02-16 preprocessor/2007: gcc has a segmentation fault with defines siva
2001-02-16 c++/2005: loop in gcc when function has const additional waratah
2001-02-16 target/2004: Internal error on correct code while compiling for ARM emarty
2001-02-16 Re: c++/197 mmitchel
2001-02-15 Re: c++/199 mmitchel
2001-02-15 Re: c++/82 gdr
2001-02-15 Re: optimization/763 rth
2001-02-15 Re: c++/195 mmitchel
2001-02-15 other/2003: libgcc ABI Joseph Myers
2001-02-15 Re: c/598 neil
2001-02-15 Re: c/625 neil
2001-02-15 c/2002: problem (?) with variable length arrays extension itlee
2001-02-15 Re: web/2000: "Cookies not enabled" warning gone from GNATS Gerald Pfeifer
2001-02-15 Re: optimization/2001: Inordinately long compile times in reload CSE regs Brad Lucier
2001-02-15 optimization/2001: Inordinately long compile times in reload CSE regs lucier
2001-02-15 web/2000: "Cookies not enabled" warning gone from GNATS lucier
2001-02-15 other/1999: java_cup VS gcj anast
2001-02-15 c/1998: compiler chokes on - as filename Andreas Schwab
2001-02-15 Re: c/696 Jim Main
2001-02-15 re: fortran/1993 Billinghurst, David \(CRTS\)
2001-02-15 Re: c++/96 gdr
2001-02-15 Re: c++/118 gdr
2001-02-15 c++/1997: gcc-20010122 ice on Blitz++ testuite; compiles .ii files! derrick
2001-02-15 Re: c++/120 gdr
2001-02-15 c++/1996: Undefined reference to non-virtual thunk when virtual functions from one class are split over two source files jo
2001-02-15 Re: c++/129 gdr
2001-02-15 Re: c++/130 gdr
2001-02-15 c/1995: position dependency in asm("" : ... : : ) etienne.lorrain
2001-02-14 Re: c++/1989 neil
2001-02-14 c/1994: gcc 2.96 optimisation bug Ben Caradoc-Davies
2001-02-14 fortran/1993: Internal error in gcc 2.95.2 SGowdy
2001-02-14 Re: java/1991: Tree check: expected class 'e', have 'x' (identifier_node) when compiling Tomcat Alexandre Petit-Bianco
2001-02-14 Re: c++/64 gdr
2001-02-14 Re: c++/62 gdr
2001-02-14 java/1992: ICE compiling Tomcat dyp
2001-02-14 java/1991: Tree check: expected class 'e', have 'x' (identifier_node) when compiling Tomcat dyp
2001-02-14 c++/1990: #include <ext/slist> does not work kevina
2001-02-14 c++/1989: #include <ext/slist> does not work kevina
2001-02-14 c++/1988: Compiler produces seg fault message when including checktty.c into a c++ app. cbearden
2001-02-14 Re: java/1261 apbianco
2001-02-14 java/1261 apbianco
2001-02-14 java/1261 apbianco
2001-02-14 c/1987: GCC 2.95.2 fails to build under Interix 2.2 bo
2001-02-14 libstdc++/1986: bootstrap error in CVS gcc libstdc++/libmath/mathconf.h mschalit
2001-02-14 Re: optimization/193 rth
2001-02-14 Re: optimization/408 rth
2001-02-14 Re: optimization/409 rth
2001-02-14 Re: optimization/463 rth
2001-02-14 Re: optimization/473 rth
2001-02-14 Re: optimization/574 rth
2001-02-14 Re: optimization/763 rth
2001-02-14 Re: optimization/769 rth
2001-02-14 Re: optimization/834 rth
2001-02-14 Re: optimization/1096 rth
2001-02-14 Re: optimization/1535 rth
2001-02-14 Re: c/653 neil
2001-02-14 Re: c/663 neil
2001-02-14 Re: c/683 neil
2001-02-14 c++/1985: bare typename inside of template function fails hudson
2001-02-14 Re: c/696 neil
2001-02-14 Re: optimization/1521 rth
2001-02-14 Re: optimization/1762 rth
2001-02-14 Re: optimization/1867 rth
2001-02-14 Re: optimization/997 rth
2001-02-14 Re: c/699 neil
2001-02-14 Re: c/1982: gcc treating "extern __inline__ asmfn (...) {...}" in <asm/bitops.h> as undefined Richard Henderson
2001-02-14 Re: c++/1687: Extreme compile time regression from 2.95.2 Zack Weinberg
2001-02-14 c/1984: mis-ordering of op codes causes kernel panic alan.jones
2001-02-14 c++/1983: compiler tells me to submit a bug report for static const declaration. coleenp
2001-02-14 c/1982: gcc treating "extern __inline__ asmfn (...) {...}" in <asm/bitops.h> as undefined prasad
2001-02-14 c++/1981: using declarations in function templates Sylvain Pion
2001-02-14 c++/1980: Error assigning const array 520065607613-0001
2001-02-14 c/1979: GCC-20010122 not compiled on alpha osf5.1 webmaster
2001-02-14 Re: c++/1779 Reichelt
2001-02-14 Re: optimization/1762 Reichelt
2001-02-14 c/1978: gcc 2.95.2 in HP-UX 10.20 with -O2 generates wrong code Sami.J.Salonen
2001-02-14 Re: other/1973: config.guess failed to determine the host type Carlo Wood
2001-02-14 Re: preprocessor/1976 neil
2001-02-14 Re: optimization/1945 Shane Nay
2001-02-14 Re: c++/1687: Extreme compile time regression from 2.95.2 Scott A Crosby
2001-02-14 c/1977: gcse.o differs ask
2001-02-14 Re: c++/1877 Mo DeJong
2001-02-14 preprocessor/1976: different treatment of shift in preprocessor and compiler fl
2001-02-14 Re: c++/1962 nathan
2001-02-14 Re: c++/1960 nathan
2001-02-13 c++/1975: ICE for -O2 compile of nested throw in nested default/switch/conditional/destructor. bumgard
2001-02-13 Re: c++/33 mmitchel
2001-02-13 Re: c++/757 lerdsuwa
2001-02-13 other/1974: config.guess failed to determine the host type Pierre
2001-02-13 other/1973: config.guess failed to determine the host type Pierre
2001-02-13 Re: java/1684 bryce
2001-02-13 Re: libgcj/1758 bryce
2001-02-13 libgcj/1758 bryce
2001-02-13 libstdc++/1972: Exceptions classes need to copy string argument. bumgard
2001-02-13 libgcj/1971: ObjectOutputStream generates incorrect serialVersionUID's for array classes bryce
2001-02-13 java/1970: Can't instantiate local class in static method bryce
2001-02-13 Re: optimization/1868 rth
2001-02-13 c++/1969: private delete fails mysteriously bh
2001-02-13 Re: libstdc++/330 pme
2001-02-13 Re: libstdc++/1847 pme
2001-02-13 Re: c++/714 gerald
2001-02-13 Re: libstdc++/1797 pme
2001-02-13 Re: libstdc++/844 pme
2001-02-13 Re: libstdc++/1919 pme
2001-02-13 libstdc++/1968: bits/std_fstream.h fails to define typedef for _ctype_type. bumgard
2001-02-13 libstdc++/1967: bits/localefwd.h incorrectly uses int instead of size_t in for loop. bumgard
2001-02-13 c++/1966: FOO will not construct with temporary BAR ipelet
2001-02-13 c/1965: bootstrap falure with make -j 4 on solaris2.8 lucier
2001-02-13 Re: libgcj/1351 tromey
2001-02-13 libgcj/1351 tromey
2001-02-13 c/1964: code generation bug with -gdwarf-2 and -fPIC on x86 crigler
2001-02-13 Re: libstdc++/1531 pme
2001-02-13 Re: c++/1962 nathan
2001-02-13 Re: libstdc++/1953 pme
2001-02-13 Re: c++/1962 nathan
2001-02-13 Re: libstdc++/1953: C++: ambigous overload compile failure Phil Edwards
2001-02-13 other/1963: collect2 interprets "-oldstyle_liblookup" as "-o ldstyle_liblookup" anonymous
2001-02-13 Re: libstdc++/1675 pme
2001-02-13 c++/1962: deducing array types nathan
2001-02-13 Re: c++/1960 nathan
2001-02-13 Re: c++/1960 nathan
2001-02-13 Re: other/741 lerdsuwa
2001-02-13 Re: c++/219 lerdsuwa
2001-02-13 Re: target/153 lerdsuwa
2001-02-13 Re: target/124 lerdsuwa
2001-02-13 Re: optimization/1945 Shane Nay
2001-02-13 c++/1960: const qualified arrays and templates nathan
2001-02-13 Re: optimization/1945 Richard Henderson
2001-02-13 Re: optimization/1931 rth
2001-02-13 Re: optimization/1945 Shane Nay
2001-02-13 Re: optimization/873 rth
2001-02-13 Re: optimization/1762 rth
2001-02-13 Re: optimization/1868 rth
2001-02-13 Re: optimization/1945 rth
2001-02-12 Re: c/1881 neil
2001-02-12 c++/1959: template copy constructor requires const richarda
2001-02-12 java/1958: Incorrect error message attempting to access non-final local from local class bryce
2001-02-12 Re: optimization/402 rth
2001-02-12 RE: c/1946: Coinfiguration script ignores --program-suffix parameter RUCINSKI, SUAVEK \[AG/2165\]
2001-02-12 Re: optimization/269 rth
2001-02-12 Re: optimization/190 rth
2001-02-12 c/1956: Internal compiler error related to nested function/optimisation a.p.selby
2001-02-12 c/1955: Linking wrong shared libgcc with mabi=64 on irix6.5 David.Billinghurst
2001-02-12 other/1954: problem with gcj joel
2001-02-12 Re: c++/1925 Benoit Hudson
2001-02-12 libstdc++/1953: C++: ambigous overload compile failure carlo
2001-02-12 c++/1952: Compiling a reasonably simple sort routine causes the bug witkop
2001-02-12 Re: c++/714 Peter Schmid
2001-02-12 Re: spam/1949 gerald
2001-02-12 c++/1951: fatal when declaring initialized automatic struct containing pointers to method rpm
2001-02-12 Re: libstdc++/1675 Carlo Wood
2001-02-12 c/1950: GCC cross build fails malcolm.herring
2001-02-12 Re: target/1947 rearnsha
2001-02-12 web/1949: can't log to misrnet web site ysedky
2001-02-12 Re: target/1947: gcc for target xscale generates incorrect code when optimization is turned on Richard Earnshaw
2001-02-12 target/1947: gcc for target xscale generates incorrect code when optimization is turned on vmoorthy
2001-02-12 c/1946: Coinfiguration script ignores --program-suffix parameter james.mcininch
2001-02-12 optimization/1945: flow.c:3790 ICE Patch Prologue contains dead register sets shane
2001-02-12 c++/1944: Internal error #20010127 - reproducable ritzert
2001-02-12 Re: c/1941 neil
2001-02-12 other/1943: Build failure x86 - CVS as of 12/2/2001 dg
2001-02-12 Re: c++/714 gerald
2001-02-12 Re: c++/975 gerald
2001-02-12 Re: libstdc++/1938 gerald
2001-02-12 Re: c/1941: unknow Zack Weinberg
2001-02-12 c/1942: error in do_jump wilhelm.nuesser
2001-02-12 c/1941: unknow szallar
2001-02-11 Re: c++/725 lerdsuwa
2001-02-11 Re: c++/1637 lerdsuwa
2001-02-11 Re: c++/1661 lerdsuwa
2001-02-11 Re: c++/1751 lerdsuwa
2001-02-11 Re: c++/1781 lerdsuwa
2001-02-11 Re: c++/1935 lerdsuwa
2001-02-11 Re: c++/1924 lerdsuwa
2001-02-11 Re: c++/1766 lerdsuwa
2001-02-11 Re: c++/1486 lerdsuwa
2001-02-11 Re: c++/1498 lerdsuwa
2001-02-11 Re: c++/1491 lerdsuwa
2001-02-11 Re: libstdc++/1937 gerald
2001-02-11 c++/1940: No option for turning off reporting of mismatched "{" "}" craigs
2001-02-11 Re: libgcj/1615 Per Bothner
2001-02-11 c++/1936: pseudo-construction and >> operator Jens.Maurer
2001-02-11 Re: libstdc++/1755 gdr
2001-02-11 Re: libstdc++/1720 gdr
2001-02-11 c++/1935: g++ gives internal compiler error on struct in member template in template class robert
2001-02-11 c++/1934: Crash on bad member name sean.middleditch
2001-02-11 Re: c/364 rth
2001-02-11 c++/1933: configure;make Dragan.Krnic
2001-02-11 Re: c++/1071 lerdsuwa
2001-02-11 Re: c++/1067 lerdsuwa
2001-02-11 Re: c++/1008 lerdsuwa
2001-02-11 Re: c++/913 lerdsuwa
2001-02-11 Re: c++/908 lerdsuwa
2001-02-11 Re: c++/888 lerdsuwa
2001-02-11 Re: c++/883 lerdsuwa
2001-02-11 Re: c++/855 lerdsuwa
2001-02-11 Re: c++/774 lerdsuwa
2001-02-11 Re: c++/745 lerdsuwa
2001-02-11 Re: c++/658 lerdsuwa
2001-02-11 Re: c++/731 lerdsuwa
2001-02-11 Re: c++/686 lerdsuwa
2001-02-11 Re: c++/676 lerdsuwa
2001-02-11 Re: c++/657 lerdsuwa
2001-02-11 Re: c++/591 lerdsuwa
2001-02-11 Re: c++/619 lerdsuwa
2001-02-11 java/1932: Yet another problem resolving qualified method call with inner classes bryce
2001-02-10 optimization/1931: Alpha->68K cross produces dough floating point instruction gcc
2001-02-10 libstdc++/1930: helper function-macro undefined incorrectly peters
2001-02-10 Re: libstdc++/1797 Matt Schalit
2001-02-10 Re: libstdc++/1928: "long long" not handled by "cout" llewelly_nospam_
2001-02-10 c++/1929: template "nested" class problem x.lsi.maillard
2001-02-10 libstdc++/1928: "long long" not handled by "cout" geoffj
2001-02-10 Re: c++/1830 Craig Rodrigues
2001-02-10 Re: c++/1925 Craig Rodrigues
2001-02-10 Re: c++/1709 Craig Rodrigues
2001-02-10 c++/1927: internal compiler error 980711 gilles56
2001-02-10 Re: libstdc++/1818 Peter Schmid
2001-02-10 libstdc++/1926: valarray_meta.h: typo line 300 mjbedy
2001-02-09 c++/1925: should issue diagnostic for pure virtual called in dtor bh
2001-02-09 c++/1924: compiler fails to parse valid (I think) construct lakshman
2001-02-09 Re: libstdc++/1826 pme
2001-02-09 Re: c++/1920 Eric Blake
2001-02-09 Re: java/1922 apbianco
2001-02-09 c++/1923: Internal compiler error in extract_insn markd
2001-02-09 java/1922: error in java/mangle_name.o undefined ask
2001-02-09 Re: c++/1765 nathan
2001-02-09 Re: c/1910: incorrect long long return value with -O2 optimization dan kopetzky
2001-02-09 c++/1921: code segment and stack segment are same for executable. jasvant.singh
2001-02-09 Re: c/1881 neil
2001-02-09 Re: c/1910 neil
2001-02-09 c++/1920: g++ -O1 optimization bug in casting a reference argument mdejong
2001-02-09 Re: c++/575 lerdsuwa
2001-02-09 Re: c++/1087 lerdsuwa
2001-02-09 Re: c++/1088 lerdsuwa
2001-02-09 Re: preprocessor/1091 lerdsuwa
2001-02-09 Re: c/1910: incorrect long long return value with -O2 optimization Richard Henderson
2001-02-08 Re: c++/1919 David Baron
2001-02-08 c++/1919: localefwd.h won't compile with -fno-exceptions dbaron
2001-02-08 Re: libgcj/1913 tromey
2001-02-08 libgcj/1913 tromey
2001-02-08 Re: libgcj/1913: reading closed streams throws NullPointerException, not IOException Tom Tromey
2001-02-08 Re: java/1204 apbianco
2001-02-08 Re: libgcj/1906 tromey
2001-02-08 c/1918: A called function incorrectly accesses args in a list of 16 arguments modur
2001-02-08 c++/1917: ICE on legal code #283 Theodore.Papadopoulo
2001-02-08 Re: java/1905 apbianco
2001-02-08 Re: java/1912: Segfault when handling segfault = infinite recursion Paul Flinders
2001-02-08 Re: libgcj/1906 Paul Flinders
2001-02-08 Re: libgcj/1906 Paul Flinders
2001-02-08 Re: java/1905 Paul Flinders
2001-02-08 c++/1916: internal compile error 980711 gilles56
2001-02-08 Re: libstdc++/646 pme
2001-02-08 Re: libstdc++/1826 pme
2001-02-08 other/1915: building libgcj/gcj anast
2001-02-08 Re: libstdc++/1818 pme
2001-02-08 Re: libstdc++/1797 pme
2001-02-08 Re: libstdc++/1574 pme
2001-02-08 Re: libstdc++/1545 pme
2001-02-08 Re: libstdc++/660 pme
2001-02-08 c++/1914: parse error at template default arg in ctor Richard.Kreckel
2001-02-08 libgcj/1913: reading closed streams throws NullPointerException, not IOException paul
2001-02-08 Re: java/1912: Segfault when handling segfault = infinite recursion Andrew Haley
2001-02-08 Re: c++/1054 Reichelt
2001-02-08 Re: java/1912: Segfault when handling segfault = infinite recursion Tom Tromey
2001-02-08 Re: java/1912 Jeff Sturm
2001-02-08 java/1912: Segfault when handling segfault = infinite recursion paul
2001-02-08 Re: c/1909: gcc version 2.97 20010205 (experimental) cannot compile http://www.fftw.org/fftw-2.1.3.tar.gz Carlo Wood
2001-02-08 c/1910: incorrect long long return value with -O2 optimization djk
2001-02-08 Re: preprocessor/1903 neil
2001-02-08 Re: preprocessor/1903: cpp (2.95.3) does not create proper dependencies for .c++ source file extensions Zack Weinberg
2001-02-08 c/1909: gcc version 2.97 20010205 (experimental) cannot compile http://www.fftw.org/fftw-2.1.3.tar.gz wengler
2001-02-08 Re: c++/1058 lerdsuwa
2001-02-08 Re: c++/995 lerdsuwa
2001-02-08 Re: c++/990 lerdsuwa
2001-02-08 Re: c++/1000 lerdsuwa
2001-02-08 Re: c++/983 lerdsuwa
2001-02-08 Re: c++/981 lerdsuwa
2001-02-08 Re: c++/954 lerdsuwa
2001-02-08 Re: c++/952 lerdsuwa
2001-02-08 Re: c++/926 lerdsuwa
2001-02-08 Re: c++/913 lerdsuwa
2001-02-08 Re: c++/896 lerdsuwa
2001-02-08 Re: c++/888 lerdsuwa
2001-02-08 Re: c++/885 lerdsuwa
2001-02-08 Re: c++/881 lerdsuwa
2001-02-08 Re: c++/883 lerdsuwa
2001-02-08 Re: c++/882 lerdsuwa
2001-02-08 Re: c++/855 lerdsuwa
2001-02-07 Re: c++/822 lerdsuwa
2001-02-07 Re: c++/757 lerdsuwa
2001-02-07 Re: c++/745 lerdsuwa
2001-02-07 Re: c++/692 lerdsuwa
2001-02-07 Re: c++/686 lerdsuwa
2001-02-07 c++/1908: Member Template Specialization Bug cjoy
2001-02-07 libgcj/1907: symbol demangling by Throwable.printStackTrace Per Bothner
2001-02-07 Re: java/1392 apbianco
2001-02-07 Re: libgcj/1906 tromey
2001-02-07 libgcj/1906 tromey
2001-02-07 Re: libgcj/1906 tromey
2001-02-07 Re: java/1880 apbianco
2001-02-07 Re: libgcj/1906: difference between gcj and jdk for MessageFormat Tom Tromey
2001-02-07 Re: java/1905 apbianco
2001-02-07 libgcj/1906: difference between gcj and jdk for MessageFormat paul
2001-02-07 java/1905: segfault when compiling class file paul
2001-02-07 java/1904: attempt to access fields in java.lang.Object segfault the compiler paul
2001-02-07 preprocessor/1903: cpp (2.95.3) does not create proper dependencies for .c++ source file extensions tkunze
2001-02-07 Re: java/1895: Libjava: Arrays.sort doesn't work Tom Tromey
2001-02-07 Re: c++/1687: Extreme compile time regression from 2.95.2 Zack Weinberg
2001-02-07 c/1902: sparc-rtems(elf) fails to compile newlib joel
2001-02-07 c++/1901: class method, when overloaded, hides methods with the same name vladimir.kondratiev
2001-02-07 c++/1900: exception classes, multiple inheritence dhoover
2001-02-07 Re: c++/1830 Rainer Knueppel
2001-02-07 Re: java/1895 bryce
2001-02-07 java/1895 bryce
2001-02-06 c++/1899: Omitting template arg gives "Internal compiler error" dlr
2001-02-06 c++/1898: problems compiling with varargs fleming.151
2001-02-06 libstdc++/1897: basic_ostream operators contain non-ISO-standard variable length arrays. bumgard
2001-02-06 c++/1896: Seg Fault in qt-2.2.4 lukeskyfly
2001-02-06 java/1895: Libjava: Arrays.sort doesn't work harinath
2001-02-06 libstdc++/1894: typename keyword missing on sentry decls in istream.tcc and ostream.tcc bumgard
2001-02-06 libstdc++/1893: References to ios_base::iostate not qualified in istream.tcc bumgard
2001-02-06 c/1892: Internal segmentation fault joe
2001-02-06 Re: java/1840 Tom Tromey
2001-02-06 Re: java/1840 tromey
2001-02-06 c++/1891: Internal compiler error in find_free_reg, at Immanuel, Gidado-Yisa
2001-02-06 Re: preprocessor/1890: macro evaluation order prevents termination Zack Weinberg
2001-02-06 Re: c++/1687: Extreme compile time regression from 2.95.2 Zack Weinberg
2001-02-06 Re: preprocessor/1890 neil
2001-02-06 Re: c++/1888 neil
2001-02-06 preprocessor/1890: macro evaluation order prevents termination b.i.mills
2001-02-06 Re: c++/1687: Extreme compile time regression from 2.95.2 Zack Weinberg
2001-02-06 c++/1889: error in copy_body_r, at cp/optimize.c:317 cljanss
2001-02-06 Re: c/1881 Curtis L. Janssen
2001-02-06 Re: c++/1888 Carlo Wood
2001-02-06 c++/1888: #if defined(xor) won't work moz
2001-02-06 c++/1887: internal compilor error ??? allali
2001-02-06 Re: c++/1656 nathan
2001-02-06 Re: c/1881 nathan
2001-02-06 libstdc++/1886: Some .tcc files not includedImplementation missing for __basic_file<> template class. bumgard
2001-02-05 libstdc++/1885: bits/basic_ios.h does not include bits/basic_ios.tcc bumgard
2001-02-05 RE: libstdc++/1884: Some .tcc files not included because _GLIBCPP_NO_TEMPLATE_EXPORT macro is not defined Greg Bumgardner
2001-02-05 RE: libstdc++/1884: Some .tcc files not included because _GLIBCPP_NO_TEMPLATE_EXPORT macro is not defined Greg Bumgardner
2001-02-05 libstdc++/1884: Some .tcc files not included because _GLIBCPP_NO_TEMPLATE_EXPORT macro is not defined bumgard
2001-02-05 c++/1883: Function lookup in template constructors fails when using namespace. Carlo.Wood
2001-02-05 c++/1882: Compilation fails when a default constructor appears as the first argument in constructor template. bumgard
2001-02-05 c/1881: gcc -M output has changed--breaks make's automatic prereqs cljanss
2001-02-05 re: c/1872 Billinghurst, David \(CRTS\)
2001-02-05 Re: java/1866 tromey
2001-02-05 java/1866 tromey
2001-02-05 Re: java/1866: Array initializer: undefined reference to `LJv0.0' Tom Tromey
2001-02-05 java/1880: Link failure compiling bytecode from javac jeff.sturm
2001-02-05 Re: debug/1794 Rafael Jesus Alcantara Perez
2001-02-05 Re: java/1866: Array initializer: undefined reference to `LJv0.0' Alexandre Petit-Bianco
2001-02-05 Re: java/1866: Array initializer: undefined reference to `LJv0.0' Tom Tromey
2001-02-05 Re: java/1866: Array initializer: undefined reference to `LJv0.0' Alexandre Petit-Bianco
2001-02-05 c++/1879: Internal compiler error in fix_lexical_addr, at function.c:5320 w_brian_blevins
2001-02-05 c++/1878: C++ 2.95.[23] gets an internal compiler error on IRIX 6.5.x ats
2001-02-05 c++/1877: gcc-20010122 and gcc-20010205 cause linker errors with static const int spencer
2001-02-05 c++/1876: class template within a namespace buschelm
2001-02-05 Re: java/1763 apbianco
2001-02-05 Re: c++/1869: All C++ program segfault Phil Edwards
2001-02-05 Re: c++/1875 pme
2001-02-05 c++/1875: G++ fails compiling simple STL code fpillet
2001-02-05 Re: c++/1864 nathan
2001-02-05 Re: c++/1672 nathan
2001-02-05 Re: c++/1864 nathan
2001-02-05 Re: c++/1864 nathan
2001-02-04 Re: java/1866: Array initializer: undefined reference to `LJv0.0' Tom Tromey
2001-02-04 Re: java/1866: Array initializer: undefined reference to `LJv0.0' Bryce McKinlay
2001-02-04 c++/1874: Internal error created trying to cast - possibly incrorrectly - using trait-type classes and explicit 'class' keyword tony
2001-02-04 Re: java/1866: Array initializer: undefined reference to `LJv0.0' Tom Tromey
2001-02-04 java/1873: Can't see nested type declared in superclass of enclosing context bryce
2001-02-04 c/1872: bootstrap failure on irix6.5 - identifier "MASK_FLAG64" is undefined David.Billinghurst
2001-02-04 Re: java/1866: Array initializer: undefined reference to `LJv0.0' Tom Tromey
2001-02-04 Re: c++/1870 pme
2001-02-04 Re: java/1866: Array initializer: undefined reference to `LJv0.0' Bryce McKinlay
2001-02-04 c++/1871: internal compiler error in reg_save bram
2001-02-04 c++/1870: Legal code does not compile (iterator) schmid
2001-02-04 c++/1869: All C++ program segfault lukeskyfly
2001-02-04 Re: debug/1819: severe problems debugging c++-code (libstdc++) Phil Edwards
2001-02-04 Re: java/1866: Array initializer: undefined reference to `LJv0.0' Tom Tromey
2001-02-04 Re: c++/1020 lerdsuwa
2001-02-04 Re: c++/648 neil
2001-02-04 Re: c++/632 neil
2001-02-04 Re: c++/630 neil
2001-02-04 Re: c++/733 lerdsuwa
2001-02-04 Re: c++/629 neil
2001-02-04 Re: c++/628 neil
2001-02-04 Re: c++/627 neil
2001-02-04 Re: c++/626 neil
2001-02-04 optimization/1868: ICE in print_rtl_and_abort, at flow.c:6592 ask
2001-02-04 Re: c++/662 lerdsuwa
2001-02-04 Re: c++/726 lerdsuwa
2001-02-04 Re: c++/725 lerdsuwa
2001-02-04 Re: c++/703 lerdsuwa
2001-02-04 Re: c++/717 lerdsuwa
2001-02-04 Re: c++/687 lerdsuwa
2001-02-04 Re: c++/682 lerdsuwa
2001-02-04 Re: c++/676 lerdsuwa
2001-02-04 Re: c++/658 lerdsuwa
2001-02-04 Re: c++/659 lerdsuwa
2001-02-04 Re: c++/624 neil
2001-02-04 Re: c++/657 lerdsuwa
2001-02-04 Re: c++/617 neil
2001-02-04 Re: c++/334 lerdsuwa
2001-02-04 Re: c++/621 neil
2001-02-04 Re: c++/332 lerdsuwa
2001-02-04 Re: c++/623 neil
2001-02-04 Re: c++/615 neil
2001-02-04 Re: c++/208 lerdsuwa
2001-02-04 Re: c++/155 lerdsuwa
2001-02-04 Re: c++/135 lerdsuwa
2001-02-04 Re: c++/151 lerdsuwa
2001-02-04 Re: c++/134 lerdsuwa
2001-02-04 Re: c++/131 lerdsuwa
2001-02-04 Re: c++/117 lerdsuwa
2001-02-04 Re: c++/958 lerdsuwa
2001-02-04 Re: c++/126 lerdsuwa
2001-02-04 optimization/1867: ICE in compilation of java/lang/k_tan.c ask
2001-02-03 java/1866: Array initializer: undefined reference to `LJv0.0' bryce
2001-02-03 other/1865: struct utsname members are different for g++ and gcc jnance
2001-02-03 Re: java/1763: bad error report for failed `import' Tom Tromey
2001-02-03 Re: libgcj/1640 tromey
2001-02-03 Re: java/1840 tromey
2001-02-03 Re: java/1839 tromey
2001-02-03 c++/1864: another problem with virtual derivation snyder
2001-02-03 Re: java/1839: Assembler errors with -fjni Tom Tromey
2001-02-03 c++/1863: g++ optimizer crash on inline method tranle
2001-02-03 Re: c++/1841: Incorrect error: invalid use of member '' in staticmember function Martin Sebor
2001-02-03 c++/1862: Segmentation fault caused by compiler generated exit code khuang
2001-02-03 Re: c++/1841: Incorrect error: invalid use of member '' in staticmember function 'Neil Booth'
2001-02-03 Re: c++/1841: Incorrect error: invalid use of member '' in staticmember function Jean-Bernard Delva
2001-02-03 Re: c++/1841 neil
2001-02-03 Re: c++/1841: Incorrect error: invalid use of member '' in staticmember function Alexandre Oliva
2001-02-03 libstdc++/1861: Uninitialized Memory Errors (UMR) with Purify [Short example] benoit.sibaud
2001-02-03 libstdc++/1860: Uninitialized Memory Errors (UMR) with Purify [Ascii log] benoit.sibaud
2001-02-03 libstdc++/1859: Uninitialized Memory Errors (UMR) with Purify benoit.sibaud
2001-02-03 libstdc++/1857: bitset::operator<<= and >>= incorrect for multiples of 32 anders
2001-02-03 libstdc++/1858: -fcheck-memory-usage cannot be used with basic_string<> george
2001-02-03 libstdc++/1855: Bug in global map variables badger
2001-02-03 libstdc++/1854: make error for Digital Unix 4.0D amc
2001-02-03 libstdc++/1856: allocator::address declared twice jbednar
2001-02-03 libstdc++/1853: <deque> deallocates unowned memory within .pop_back() stevemw
2001-02-03 libstdc++/1852: SUN 32bit apps using 64bit file offsets michael.reed
2001-02-03 libstdc++/1851: seg fault in global basic_string construction rbsmithz
2001-02-03 libstdc++/1850: solaris/bits/ctype_base.h incompatible with /usr/include/ctype.h, Solaris 7, SC5.0 whall
2001-02-03 libstdc++/1847: <vector> and std::rel_ops broken. mark
2001-02-03 libstdc++/1846: bitset inline lfarkas
2001-02-03 libstdc++/1849: alpha-dec-osf4.0f: math/mycabsf.c "hard register" compile failure mooney
2001-02-03 libstdc++/1848: g++ cannot compile std::ostream_iterator<std::pair<int, int> > cshihpin
2001-02-03 libstdc++/1845: _Expr<>.sum() in bits/valarray_meta.h doesn't compile Roman.Kagan
2001-02-03 Re: web/1024 pme
2001-02-03 Re: c/727 neil
2001-02-03 Re: c/718 neil
2001-02-03 Re: preprocessor/1810 neil
2001-02-03 Re: c++/1841: Incorrect error: invalid use of member '' in staticmember function 'Neil Booth'
2001-02-02 Re: c++/1841: Incorrect error: invalid use of member '' in staticmember function Martin Sebor
2001-02-02 RE: c++/1841: Incorrect error: invalid use of member '' in static member function Jean-Bernard Delva
2001-02-02 c++/1844: failure to match identical declarations Jens.Maurer
2001-02-02 c++/1843: Segmentation fault during try/catch exceptions. steven.belbin
2001-02-02 Re: c++/1841: Incorrect error: invalid use of member '' in static member function Neil Booth
2001-02-02 c++/1842: when using regparm-attribute on function pointer, it affects previous function pointer too rat
2001-02-02 c++/1841: Incorrect error: invalid use of member '' in static member function jb
2001-02-02 java/1840: unknown encoding: `ISO8859-1' schmitt
2001-02-02 java/1839: Assembler errors with -fjni jeff.sturm
2001-02-02 c++/1838: g++ gives an internal compiler error in grokdeclarator pabrabbin
2001-02-02 c++/1837: Internal compiler error found tojuro
2001-02-02 optimization/1836: ICE with long double && -O2 && -funroll-all-loops wolfgang.bangerth
2001-02-01 c++/1835: toplevel cv-qualifiers considered in finding best viable function dbaron
2001-02-01 libstdc++/1834: istream manipulators and sentry snyder
2001-02-01 Re: java/1828 apbianco
2001-02-01 c++/1833: inlining sometimes causes incorrect behavior peteb
2001-02-01 fortran/1832: -list directed i/o overflow hangs, -fbounds-check doesn't detect Robert.C.Haskell
2001-02-01 optimization/1831: -fprofile-arcs and -fbranch-probabilities don't get along lucier
2001-02-01 c++/1830: Singletons are buggy pb
2001-02-01 java/1828: error if function arg list erronously followed by a semi-colon paul
2001-02-01 c/1827: ICE in `reverse_condition' or segfault depending on version etienne_lorrain
2001-02-01 libstdc++/1826: unexpected program crash (only 37 lines of souce code) ge
2001-01-31 c++/1825: parse error results in Tree check: expected class 't', have 'x' (error_mark) schmid
2001-01-31 Re: c/1824: gcc accepts computed goto's + -fprofile-arcs, gcov barfs Richard Henderson
2001-01-31 c/1824: gcc accepts computed goto's + -fprofile-arcs, gcov barfs lucier
2001-01-31 c++/1823: program compiled with -ftrapv aborts in std::queue<>.size() meeberdt
2001-01-31 libstdc++/1822: math function conflicts snyder
2001-01-31 Re: libstdc++/325 Phil Edwards
2001-01-31 c++/1821: friend decl. shadows forward decl. harri
2001-01-31 c/1820: GToolKit.m:2213: Internal error: Segmentation faul bmrevet
2001-01-31 debug/1819: severe problems debugging c++-code (libstdc++) schmid
2001-01-31 libstdc++/1818: problems with cout.width, segmentation fault schmid
2001-01-31 c++/1817: gnatsweb.pl has fault -after not accepting empty submitter-id slager
2001-01-31 c/1816: Internal compiler error triggered in function.c:2630 jkelly
2001-01-31 libstdc++/1815: basic_stringbuf<..>:seekpos has wrong signature in libstdc++ jarausch
2001-01-30 c/1814: fr30-elf 2.97 cross-compiler segmentation faults on FreeBSD 4.2-stable building libgcc dakott
2001-01-30 Re: libstdc++/325 Neil Booth
2001-01-30 Re: libstdc++/325 Heiko.Scheit
2001-01-30 Re: libstdc++/553 pme
2001-01-30 Re: libstdc++/555 pme
2001-01-30 Re: libstdc++/1732 pme
2001-01-30 Re: libstdc++/1743 pme
2001-01-30 Re: libstdc++/1576 pme
2001-01-30 c++/1813: _G_config.h conflicting with glibc (or vice versa?) Shawn.Starr
2001-01-30 Re: c++/582 neil
2001-01-30 Re: java/1812 Alexandre Petit-Bianco
2001-01-30 Re: java/1812 tromey
2001-01-30 Re: java/1812 apbianco
2001-01-30 java/1812: zextract.c cleanup tromey
2001-01-30 Re: c/602 neil
2001-01-30 Re: preprocessor/1810: /usr/local/include not searched Neil Booth
2001-01-30 Re: preprocessor/1811 neil
2001-01-30 Re: libstdc++/1576 Florian Kainz
2001-01-30 Re: c/1811 David Osborne
2001-01-30 Re: c/1811 neil
2001-01-30 c/1811: gcc (cpp0) fails when compiling BIND 8.2.3 david.osborne
2001-01-30 preprocessor/1810: /usr/local/include not searched neil
2001-01-29 fortran/1809: Optimiser error with LAPACK routine slaed6.f David.Billinghurst
2001-01-29 c++/1808: Internal compiler error 390. kanitkar
2001-01-29 Re: other/1741 gerald
2001-01-29 other/1807: make bookstrap fails on HP-UX 10.20 lakata
2001-01-29 c++/1806: Internal compiler error for template friend in namespace jody
2001-01-29 Re: c++/1804: c++ -c -I. -I.. -I../liboctave -I../src -I../libcruft/misc -I../glob -I../glob -DHAVE_CONFIG_H -fno-rtti -fno-exceptions -fno-implicit-templates -g -O2 -Wall sighandlers.cc Neil Booth
2001-01-29 RE: c++/1748 Vlad Socaciu
2001-01-29 Re: c++/568 neil
2001-01-29 Re: libstdc++/554 neil
2001-01-29 Re: libstdc++/325 Neil Booth
2001-01-29 Re: c++/1799 nathan
2001-01-29 Re: c++/1804 nathan
2001-01-29 Re: c++/1803 nathan
2001-01-29 Re: c++/1770 nathan
2001-01-29 Re: c++/1765 nathan
2001-01-29 Re: c++/1748 nathan
2001-01-29 c++/1805: formated 'cout'-output is wrong alexander.kuchler
2001-01-29 c++/1804: c++ -c -I. -I.. -I../liboctave -I../src -I../libcruft/misc -I../glob -I../glob -DHAVE_CONFIG_H -fno-rtti -fno-exceptions -fno-implicit-templates -g -O2 -Wall sighandlers.cc A.Abbing
2001-01-29 Re: libstdc++/325 pme
2001-01-29 Re: libstdc++/325 Phil Edwards
2001-01-29 Re: other/1802 gerald
2001-01-29 c++/1803: usage of variable declaration inside "for" loop corrupts other variable on stack joseph.barreca
2001-01-29 c/1801: gcc on AIX 4.3.3 doesn`t support "long double" type levo
2001-01-28 Re: middle-end/1800: GCC reported an Internal Compiler Error on possibly legal code Edwin G. Castro
2001-01-28 Re: middle-end/1800: GCC reported an Internal Compiler Error on possibly legal code Alexandre Oliva
2001-01-28 middle-end/1800: GCC reported an Internal Compiler Error on possibly legal code castro
2001-01-28 Re: c++/1036 gerald
2001-01-28 c++/1799: PalmOS Emulator Build Failure; Internal compiler error clamb
2001-01-28 c++/1798: undefined reference to `std::istream::seekg(std::fpos<__mbstate_t>)' rafa
2001-01-28 Re: libstdc++/325 Neil Booth
2001-01-28 libstdc++/1797: 1/27 CVS won't make bootstrap. wchar_t not defined mschalit
2001-01-27 Re: libstdc++/1620 Vladimir A. Merzliakov
2001-01-27 Re: libstdc++/1620 Vladimir A. Merzliakov
2001-01-27 Re: libstdc++/325 Phil Edwards
2001-01-27 Re: libstdc++/1732 Phil Edwards
2001-01-27 Re: libstdc++/360 pme
2001-01-27 c++/1796: gcc crash while compiling MICO (legal c++ code) Karel Gardas
2001-01-27 Re: libstdc++/1743 pme
2001-01-27 Re: libstdc++/1724 pme
2001-01-27 Re: libstdc++/1660 pme
2001-01-27 Re: libstdc++/1057 pme
2001-01-27 Re: libstdc++/737 pme
2001-01-27 Re: libstdc++/1707 pme
2001-01-27 Re: libstdc++/1576 pme
2001-01-27 Re: libstdc++/1710 pme
2001-01-27 Re: libstdc++/1710 James Dennett
2001-01-27 c/1795: bootstrap fails for linux-m68k zippel
2001-01-27 debug/1794: The compiler gives a Segmentation Fault when debug option is passed (-g) rafa
2001-01-27 Re: libstdc++/569 neil
2001-01-27 Re: c++/568 neil
2001-01-27 c/1793: gcc/gcc/cp/decl.c won't make - lvalue not modifiable mschalit
2001-01-27 Re: c++/558 neil
2001-01-26 Re: libstdc++/1019 pme
2001-01-26 Re: libstdc++/1005 pme
2001-01-26 Re: libstdc++/944 pme
2001-01-26 Re: libstdc++/759 pme
2001-01-26 Re: libstdc++/555 pme
2001-01-26 Re: libstdc++/439 pme
2001-01-26 Re: libstdc++/1066 pme
2001-01-26 Re: libstdc++/347 pme
2001-01-26 Re: libstdc++/1620 pme
2001-01-26 Re: libstdc++/844 pme
2001-01-26 Re: libstdc++/695 pme
2001-01-26 Re: libstdc++/887 pme
2001-01-26 Re: libstdc++/887 Peter Schmid
2001-01-26 c++/1791: wtf is synopsis? batelcruiser
2001-01-26 Re: libstdc++/553 pme
2001-01-26 Re: libstdc++/887 pme
2001-01-26 Re: libstdc++/1598 pme
2001-01-26 c++/1790: g++ does not compile 64Bit integer features davidf
2001-01-26 c++/1789: ICE in switch statement case erik.horsley
2001-01-26 Re: libstdc++/554 neil
2001-01-26 Re: c++/1529 Reichelt
2001-01-26 c++/1788: gcc 2.95.2 gives ICE when declaring variables as static in classes mail
2001-01-26 c++/1787: ICE on using ::std; cesarb
2001-01-26 c/1786: make problems on AIX 4.3.3 using C for AIX V5 ong
2001-01-26 Re: debug/543 neil
2001-01-26 c++/1784: Internal error: Segmentation Fault when optimizing hyrosen
2001-01-26 Re: c++/1519 Reichelt
2001-01-26 c++/1783: Many test failures on alphaev6-unknown-linux-gnu lucier
2001-01-26 Re: libstdc++/1780 gdr
2001-01-26 c++/1782: C++ erroneous requirement for final overrider 520065607613-0001
2001-01-26 c++/1781: Internal error: Segmentation Fault on illegal code hyrosen
2001-01-26 Re: debug/543 Robert Lipe
2001-01-26 libstdc++/1780: max function does not compile if <iostream> is included schmid
2001-01-26 c++/1779: operator new with wrong argument type crashes compiler reichelt
2001-01-26 c/1778: IRIX 20010126 c_expand_expr compiler error jarausch
2001-01-26 c/1777: -mmx and -msse are broken aj
2001-01-26 Re: c++/1774 Jens Maurer
2001-01-25 Re: java/1409 apbianco
2001-01-25 libstdc++/1776: misc-inst.cc causes ICE on mips-sgi-irix5.3 fleming.151
2001-01-25 c/1775: "fixed or forbidden register 0 (ax) was spilled for class AREG" when compiling Apache kevin
2001-01-25 Re: libstdc++/1755: libstdc++-v3 gen-num-limits fails on mips-sgi-irix5.3 George Fleming
2001-01-25 Re: java/1763: bad error report for failed `import' Alexandre Petit-Bianco
2001-01-25 c++/1774: parse error with method template of class template bgreen
2001-01-25 Re: libstdc++/660 pme
2001-01-25 Re: c++/1773 gdr
2001-01-25 Re: c++/1633 Reichelt
2001-01-25 Re: c++/1773: Changed information pme
2001-01-25 c++/1773: __cplusplus defined to 1, should be 199711L Jens.Maurer
2001-01-25 Re: c++/1772 gdr
2001-01-25 c++/1772: ICE when instantiating templates with "long long" values Jens.Maurer
2001-01-25 c++/1771: Very strange using/const bug hyrosen
2001-01-25 c++/1770: G++ incorrectly allows access to private member dje
2001-01-25 c++/1769: Internal error: Segmentation Fault on simple program hyrosen
2001-01-25 Re: c++/906 Reichelt
2001-01-25 Re: libstdc++/1767 gdr
2001-01-25 other/1768: CVS bootstrap fails sefer
2001-01-25 libstdc++/1767: bug with std::deque<T>::const_iterator::operator->() m.duflot
2001-01-25 c++/1766: g++ gives ICE on parse error jfb37
2001-01-25 c++/1765: bogus warning with new pod struct () nathan
2001-01-24 Re: c++/1754 neil
2001-01-24 Re: c/476 neil
2001-01-24 Re: c++/1103 lerdsuwa
2001-01-24 Re: libstdc++/1608: Problem with TREE_PARMLIST Rod Stewart
2001-01-24 Re: c++/1754: Resolved -- Coding error Sourav Laskar
2001-01-24 Re: c++/68 lerdsuwa
2001-01-24 c/476 looks like it should be closed Craig Rodrigues
2001-01-24 Re: libstdc++/796 rearnsha
2001-01-24 Re: libgcj/1758: java.util package lacks TreeMap Alexandre Petit-Bianco
2001-01-24 Re: libstdc++/799 rearnsha
2001-01-24 Re: libgcj/1758: java.util package lacks TreeMap Bryce McKinlay
2001-01-24 Re: libgcj/1758: java.util package lacks TreeMap Alexandre Petit-Bianco
2001-01-24 Re: libgcj/1759: java.io.File lacks several jdk 1.2 methods Bryce McKinlay
2001-01-24 Re: libgcj/1758: java.util package lacks TreeMap Bryce McKinlay
2001-01-24 Re: c++/549 neil
2001-01-24 Re: c++/552 neil
2001-01-24 Re: c++/551 neil
2001-01-24 Re: debug/543 neil
2001-01-24 Re: c++/541 neil
2001-01-24 Re: c++/534 neil
2001-01-24 Re: c/530 neil
2001-01-24 c++/1764: g++ reports false warnings then crashes : segmentation fault Sylvain.Lathuy
2001-01-24 java/1763: bad error report for failed `import' tromey
2001-01-24 Re: c/519 neil
2001-01-24 Re: libstdc++/501 neil
2001-01-24 Re: optimization/487 neil
2001-01-24 Re: c/483 neil
2001-01-24 Re: c++/481 neil
2001-01-24 Re: libstdc++/1608 neil
2001-01-24 Re: libgcj/1758: java.util package lacks TreeMap Tom Tromey
2001-01-24 Re: libstdc++/1608: Problem with TREE_PARMLIST Rod Stewart
2001-01-24 optimization/1762: treatment of NaNs violates IEEE 754 reichelt
2001-01-24 Re: fortran/275 neil
2001-01-24 Re: libstdc++/1676 Benjamin Kosnik
2001-01-24 c++/1760: inline asm: "=m" output doesn't force operand in memory mattias
2001-01-24 libgcj/1759: java.io.File lacks several jdk 1.2 methods ptf
2001-01-24 libgcj/1758: java.util package lacks TreeMap ptf
2001-01-24 c++/1757: ice: new-abi function-inlining friends schmid
2001-01-24 Re: other/1741 gerald
2001-01-24 Re: libstdc++/1618 gerald
2001-01-24 Re: c/1575 gerald
2001-01-24 Re: c++/1614 gerald
2001-01-24 Re: c++/908 gerald
2001-01-24 Re: c++/899 gerald
2001-01-24 Re: c++/906 gerald
2001-01-24 Re: c++/1661 gerald
2001-01-24 Re: libstdc++/1676 gerald
2001-01-24 Re: c++/1683 gerald
2001-01-24 Re: c++/1744 gerald
2001-01-24 Re: c++/1746 gerald
2001-01-24 Re: c++/1751 gerald
2001-01-24 Re: c++/1753 gerald
2001-01-24 Re: c++/1754 gerald
2001-01-24 Re: libstdc++/1755 gerald
2001-01-24 Re: c++/1756 gerald
2001-01-24 Re: c++/1638 nathan
2001-01-24 Re: libstdc++/1755: libstdc++-v3 gen-num-limits fails on mips-sgi-irix5.3 Gabriel Dos Reis
2001-01-24 c++/1756: template in private causes confusion hamid.kharraziha
2001-01-23 libstdc++/1755: libstdc++-v3 gen-num-limits fails on mips-sgi-irix5.3 fleming.151
2001-01-23 c++/1754: Problem with inner class implementation jeebu19
2001-01-23 c++/1753: g++ 2.95.2 generates incorrect code when __attribute__((packed)) is combined with bitfields cruden
2001-01-23 c++/1752: libiberty/demangle testsuite failures on i686-pc-cygwin David.Billinghurst
2001-01-23 c++/1751: parse error results in Internal error #19990916. schmid
2001-01-23 c/1750: suprrious warning when using memset jdeifik
2001-01-23 c/1749: suprrious warning when including string.h jdeifik
2001-01-23 Re: c++/1742 neil
2001-01-23 c++/1748: perhaps incorrect type_info class data vsocaciu
2001-01-23 Re: libstdc++/1734 Greg Bumgardner
2001-01-23 Re: libstdc++/1732 Peter Schmid
2001-01-23 c++/1746: trapped exceptions causing crash jgibart
2001-01-23 Re: c++/1053 gerald
2001-01-23 Re: c++/1065 gerald
2001-01-23 Re: c++/1731 gerald
2001-01-23 java/1745: compiler segfault on bogus code. ptf
2001-01-23 c++/1744: Internal compiler error in `make_decl_rtl', at varasm.c:738 cate
2001-01-23 c++/1743: iostream::seekg does not reset fail and eof bits tarot
2001-01-23 Re: c++/1742 neil
2001-01-23 c++/1742: bug in gcc 2.95.2 on SunOS 5.6 due to too big function name dants
2001-01-23 Re: c++/1740 gerald
2001-01-23 Re: c++/1728 nathan
2001-01-23 Re: c++/1639 nathan
2001-01-23 Re: c++/1738 nathan
2001-01-23 Re: c++/1733 nathan
2001-01-23 Re: c++/767 nathan
2001-01-23 Re: c++/612 nathan
2001-01-23 other/1741: GCC make failing with Internal compiler error in 'dump_and_abort' edA-qa
2001-01-23 Re: c++/68 lerdsuwa
2001-01-23 c++/1740: g++ 2.96 generates illegal operands in assembly file haenni
2001-01-22 Re: libstdc++/1732 gdr
2001-01-22 Re: libstdc++/1720 gdr
2001-01-22 Re: c++/1738: template function with volatile formal parameter confuses compiler llewelly_nospam_
2001-01-22 c/1739: "Character constant too long" on irix6.5 with -mabi=64 David.Billinghurst
2001-01-22 c++/1738: template function with volatile formal parameter confuses compiler mps
2001-01-22 c/1737: Parallel make error with cygwin David.Billinghurst
2001-01-22 libgcj/1736: [irix 6.5] Cannot create libgcj - Arg list too long David.Billinghurst
2001-01-22 optimization/1735: g++ crash in expand_inline_function with optimization snyder
2001-01-22 Re: c++/1036 Antonis C Koutalos
2001-01-22 libstdc++/1734: Use of char_traits::_S_eos() in ostream manipulators will break with user-defined traits. bumgard
2001-01-22 c++/1733: C++ ICE in copy_body_r with optimization on snyder
2001-01-22 libstdc++/1732: g++ does not compile vector<type>(iterator, iterator) schmid
2001-01-22 c++/1731: Internal compiler error 191 for inherited overloaded operator[] on NULL C.vanReeuwijk
2001-01-22 Re: c++/1725 nathan
2001-01-22 Re: web/1730 gerald
2001-01-22 Re: c++/1728 nathan
2001-01-22 Re: c++/1702 Eddy De Greef
2001-01-22 web/1730: Can I have a copy of your gnatsweb.pl file enzo.balbo
2001-01-22 Re: c++/1702 nathan
2001-01-22 c++/1729: Internal compiler error jlperez
2001-01-22 Re: c++/1728 nathan
2001-01-22 Re: c++/1617 nathan
2001-01-22 c++/1728: Weird behaviour with specialization of inner class constructor of template class wolfgang.bangerth
2001-01-22 Re: c++/680 gerald
2001-01-22 Re: c++/967 gerald
2001-01-22 Re: other/786 gerald
2001-01-22 Re: c++/998 gerald
2001-01-22 Re: c++/1036 gerald
2001-01-22 libobjc/1727: Invoking methods of instances created with @protocol michael.scheibler
2001-01-22 Re: c/1083 gerald
2001-01-22 Re: c++/1553 gerald
2001-01-22 c++/1726: ?!? johanc
2001-01-22 Re: c++/1716 gerald
2001-01-22 Re: c++/1703 nathan
2001-01-22 Re: c++/1722 nathan
2001-01-22 Re: c++/742 gerald
2001-01-22 Re: web/973 Joseph S. Myers
2001-01-22 c++/1725: Internal compiler error in copy_body_r, at cp/optimize.c:317 pfeifer
2001-01-22 Re: web/973 gerald
2001-01-22 Re: web/1646: The GNATS query filters do not work correctly Gerald Pfeifer
2001-01-22 Re: web/375 gerald
2001-01-22 libstdc++/1724: Backward compatibility <vector.h> not compilable wolfgang.bangerth
2001-01-21 c++/1722: unsigned int confused with pointer richarda
2001-01-21 c++/1721: typedef fails for template classes in CVS 2001-01-15 richarda
2001-01-21 Re: debug/1706 toon
2001-01-21 Re: libf2c/1644 toon
2001-01-21 libstdc++/1720: Gslices do not work as expected for valarray<double> schmid
2001-01-21 Re: c/650 neil
2001-01-21 Re: c/640 neil
2001-01-21 Re: c/602 neil
2001-01-21 Re: c/557 neil
2001-01-21 Re: c/544 neil
2001-01-21 Re: c/533 neil
2001-01-21 Re: c/504 Vince Duperron
2001-01-21 Re: c/527 neil
2001-01-21 Re: c/527 neil
2001-01-21 Re: c++/522 neil
2001-01-21 Re: c++/521 neil
2001-01-21 Re: c++/513 neil
2001-01-21 Re: c++/1639 nathan
2001-01-21 Re: c/504 neil
2001-01-21 Re: c/503 neil
2001-01-21 Re: preprocessor/500 neil
2001-01-21 Re: target/494 neil
2001-01-21 middle-end/1719: Abort in local-alloc.c Ian Dall
2001-01-21 libgcj/1718: ArithmeticException regressions bryce
2001-01-21 libstdc++/1717: some include trouble + wrong output via wcout michael
2001-01-20 c++/1716: egcs internal compiler error 40 nenad
2001-01-20 Re: c++/1711: `make -j3 install' fails when $(prefix) directory doesn't exist Jim Meyering
2001-01-20 c/1715: Tree check: expected class 't', have 'x' (error_mark) schmid
2001-01-20 Re: c/1713 jsm28
2001-01-20 Re: c/1625 jsm28
2001-01-20 c/1714: ice in process_init_element __attribute__(__aligned__) schmid
2001-01-20 Re: c/468 neil
2001-01-20 Re: c++/464 neil
2001-01-20 Re: c++/436 neil
2001-01-20 Re: c++/462 neil
2001-01-20 Re: c++/432 neil
2001-01-20 Re: c/430 neil
2001-01-20 Re: objc/429 neil
2001-01-20 Re: c++/426 neil
2001-01-20 Re: c++/419 neil
2001-01-20 Re: c++/418 neil
2001-01-20 Re: c++/417 neil
2001-01-20 Re: c++/413 neil
2001-01-20 Re: c++/407 neil
2001-01-20 Re: c++/401 neil
2001-01-20 Re: c++/394 neil
2001-01-20 Re: c++/388 neil
2001-01-20 Re: c++/389 neil
2001-01-20 Re: c++/1639 nathan
2001-01-20 Re: c++/385 neil
2001-01-20 Re: c++/384 neil
2001-01-20 Re: c++/383 neil
2001-01-20 Re: c/374 neil
2001-01-20 Re: c++/370 neil
2001-01-20 Re: c++/369 neil
2001-01-20 Re: c++/368 neil
2001-01-20 Re: c/366 neil
2001-01-20 Re: c++/361 neil
2001-01-20 Re: c++/362 neil
2001-01-20 Re: c++/358 neil
2001-01-20 Re: c/357 neil
2001-01-20 Re: preprocessor/1565 neil
2001-01-20 c/1713: some programs using `bool' from stdbool.h no longer compile jim
2001-01-20 c++/1712: seg fault skinner
2001-01-20 c++/1711: `make -j3 install' fails when $(prefix) directory doesn't exist jim
2001-01-19 libstdc++/1710: strings.find_last_of() function works only if I explicitly reference the strings.c_str() function after calling it mdh_gcc
2001-01-19 c++/1709: ICE on C++ template code rodrigc
2001-01-19 Re: c++/394 Craig Rodrigues
2001-01-19 Re: libgcj/1572 bryce
2001-01-19 c/1708: bitfield initializations not skipping anonymous fields andyj
2001-01-19 Re: c++/1639 Artem Khodush
2001-01-19 libstdc++/1707: libstdc++ v3 gets confused by private assignment operators meeberdt
2001-01-19 debug/1706: Stabs definition for "complex" and "double complex" incorrect sdchen007
2001-01-19 Re: preprocessor/1565 (fwd) Neil Booth
2001-01-19 Re: preprocessor/1565 neil
2001-01-19 c/1705: ice in process_init_element while compiling linux-2.4.0 schmid
2001-01-19 libstdc++/1704: Null output from Josuttis example pcarlini
2001-01-19 Re: preprocessor/1565 (fwd) Richard B. Kreckel
2001-01-19 Re: c++/1656 nathan
2001-01-19 Re: c++/1654 nathan
2001-01-19 Re: preprocessor/1565 (fwd) Richard B. Kreckel
2001-01-19 Re: c++/1638 nathan
2001-01-19 c++/1703: g++ creates default destructor with wrong `throw' signature wolfgang.bangerth
2001-01-19 Re: libgcj/1572 Per Bothner
2001-01-19 c++/1702: virtual inheritance initialization bug degreef
2001-01-19 Re: c++/1635 nathan
2001-01-19 Re: c++/1655 nathan
2001-01-19 Re: c++/1656 nathan
2001-01-19 Re: c++/1639 nathan
2001-01-19 Re: c++/1638 nathan
2001-01-19 Re: c++/1652 nathan
2001-01-19 Re: c++/1654 nathan
2001-01-19 Re: c++/1666 nathan
2001-01-19 Re: c++/1665 nathan
2001-01-19 Re: c++/1695 nathan
2001-01-19 Re: c++/1664 nathan
2001-01-19 Re: c++/1695 nathan
2001-01-19 Re: c++/1701 nathan
2001-01-19 Re: c++/1699: can't compile Linux kernels Bernd Schmidt
2001-01-19 Re: c++/1701 nathan
2001-01-19 Re: c++/1694 nathan
2001-01-19 Re: c++/1632 nathan
2001-01-19 Re: c++/1506 nathan
2001-01-19 Re: c++/1701 nathan
2001-01-19 Re: libgcj/1572 bryce
2001-01-19 Re: fortran/275 Neil Booth
2001-01-18 Re: c++/70 Vladimir A. Merzliakov
2001-01-18 c++/1701: new-abi bug: bad code generated with complex virtual derivation snyder
2001-01-18 Re: c++/68 Vladimir A. Merzliakov
2001-01-18 Re: c++/65 Vladimir A. Merzliakov
2001-01-18 c++/1700: g++ 2.97 20010110 does not compile correct code. vakopian
2001-01-18 Re: c++/1506 Vladimir A. Merzliakov
2001-01-18 re: fortran/275 Billinghurst, David \(CRTS\)
2001-01-18 c++/1699: can't compile Linux kernels jhurt
2001-01-18 target/1698: compiling optimized code using mips4 on R12000 MIPS mburnham
2001-01-18 Re: c++/1688: Includes causing extern "C" not to behave correctly (?) Neil Booth
2001-01-18 Re: c++/1688: Includes causing extern "C" not to behave correctly (?) Neil Booth
2001-01-18 Re: c++/1688: Includes causing extern "C" not to behave correctly (?) Neil Booth
2001-01-18 Re: c++/1688: Includes causing extern "C" not to behave correctly (?) Zack Weinberg
2001-01-18 Re: c++/1688: Includes causing extern "C" not to behave correctly(?) Daniel Henninger
2001-01-18 Re: c++/1688: Includes causing extern "C" not to behave correctly(?) Daniel Henninger
2001-01-18 Re: c++/1688: Includes causing extern "C" not to behave correctly(?) Daniel Henninger
2001-01-18 Re: c++/1688: Includes causing extern "C" not to behave correctly (?) Zack Weinberg
2001-01-18 Re: c++/1688: Includes causing extern "C" not to behave correctly(?) Daniel Henninger
2001-01-18 other/1697: bootstrapping fails: malformed option `-A system=posix' harri
2001-01-18 c/1696: -fstack-check doesn't seem to be working on intel systems (sigsegv in initialisation phase of function) ungod
2001-01-18 Re: c++/1631 nathan
2001-01-18 Re: c++/1694 nathan
2001-01-18 Re: c++/1694 nathan
2001-01-18 c++/1695: Template non-type arg ICE nathan
2001-01-18 c++/1694: bogus errors during type deduction nathan
2001-01-18 libstdc++/1693: sstream causes linkage error jarausch
2001-01-18 c++/1692: -fvtable-gc flag is only meaningful on ELF targets Richard Earnshaw
2001-01-18 c/1691: Internal compiler error in c_expand_expr, at c-common.c:4072 jarausch
2001-01-18 Re: c++/1689 nathan
2001-01-18 c++/1690: GCC 2.96 gives internal error when compiling filename.cc Lute.Kamstra
2001-01-18 Re: c++/1630 nathan
2001-01-18 Re: c++/1611 nathan
2001-01-18 Re: c++/1505 nathan
2001-01-18 Re: c++/1505 nathan
2001-01-18 Re: c++/1506 nathan
2001-01-18 Re: c++/1672 nathan
2001-01-18 c++/1689: dynamic_cast operator is wrong Jorgen.Sigvardsson
2001-01-17 Re: java/1682 apbianco
2001-01-17 Re: libgcj/1685 Mark Wielaard
2001-01-17 Re: java/1684: java.util.treeset and java.util.treemap are missing Bryce McKinlay
2001-01-17 Re: java/1677 bryce
2001-01-17 Re: c++/1688: Includes causing extern "C" not to behave correctly (?) Neil Booth
2001-01-17 Re: c++/1688: Includes causing extern "C" not to behave correctly(?) Daniel Henninger
2001-01-17 Re: c++/1688: Includes causing extern "C" not to behave correctly (?) Phil Edwards
2001-01-17 c++/1688: Includes causing extern "C" not to behave correctly (?) daniel
2001-01-17 Re: c++/1683: failure during bootstrap (current CVS) Michael Ritzert
2001-01-17 c++/1687: Extreme compile time regression from 2.95.2 kelley.cook
2001-01-17 Re: java/1677 Paul Thio
2001-01-17 c++/1686: internal compiler error on systemC program lhenrygr
2001-01-17 Re: java/1677 Jeff Sturm
2001-01-17 Re: c++/1672 nathan
2001-01-17 Re: c++/1685 Mark Wielaard
2001-01-17 Re: c++/1631 nathan
2001-01-17 Re: java/1684: java.util.treeset and java.util.treemap are missing Mark Wielaard
2001-01-17 c++/1685: class java.lang.ThreadLocal is missing p.thio
2001-01-17 java/1684: java.util.treeset and java.util.treemap are missing p.thio
2001-01-17 c++/1683: failure during bootstrap (current CVS) ritzert
2001-01-17 java/1682: internal error during compilation of public final static String members p.thio
2001-01-17 java/1681: Internal error during compilation of assigment expression p.thio
2001-01-17 c++/1680: Internal compiler error. a.sanders
2001-01-17 c++/1679: c++ -v -save-temps -DHAVE_CONFIG_H -I. -I. -I. -I./.. -isystem /usr/local/X11/include -DNDEBUG -O2 -g -W -Wall -trigraphs -c HelpCB.C zac
2001-01-17 Re: c++/1632 nathan
2001-01-17 java/1677: Method.invoke() fails for arguments of type boolean p.thio
2001-01-16 Re: c++/1664: minimum value for signed long integers Alexandre Oliva
2001-01-16 Re: optimization/1624 rth
2001-01-16 Re: optimization/964 Richard Henderson
2001-01-16 c++/1675: C++: ambigous overload compile failure Dirk Mueller
2001-01-16 c++/1674: Internal compiler error: fix_lexical_addr dkerns
2001-01-16 c/1673: ICE in rtx_equal_for_memref_p Michael
2001-01-16 Re: fortran/1636 toon
2001-01-16 Re: c/1624: incorrect stack adjustment with -fomit-frame-pointer on x86 Ulrich Drepper
2001-01-16 Re: c++/11 mmitchel
2001-01-16 Re: c/1670: HPUX: call through pointer to static function mangles argument values Jeffrey A Law
2001-01-16 Re: libstdc++/325 neil
2001-01-16 Re: optimization/964 Benoit Hudson
2001-01-16 Re: libstdc++/325 neil
2001-01-16 Re: c++/322 neil
2001-01-16 c++/1672: dynamic_cast<> gives wrong value under certain circumstances mac
2001-01-16 Re: c++/312 neil
2001-01-16 Re: c++/311 neil
2001-01-16 Re: middle-end/309 neil
2001-01-16 Re: c++/308 neil
2001-01-16 Re: c++/306 neil
2001-01-16 Re: c++/301 neil
2001-01-16 Re: c++/305 neil
2001-01-16 Re: c++/299 neil
2001-01-16 Re: c++/297 neil
2001-01-16 Re: c++/293 neil
2001-01-16 Re: c++/289 neil
2001-01-16 Re: c++/287 neil
2001-01-16 Re: c++/280 neil
2001-01-16 Re: c/277 neil
2001-01-16 Re: fortran/275 neil
2001-01-16 Re: c++/274 neil
2001-01-16 c++/1671: i960gcc crashes when run with Cygnus 1.0 (ok with B20) dstevens
2001-01-16 c/1670: HPUX: call through pointer to static function mangles argument values broeker
2001-01-16 Re: optimization/863 rth
2001-01-16 Re: optimization/743 Richard Henderson
2001-01-16 Re: c++/1612 nathan
2001-01-16 Re: c++/1631 nathan
2001-01-16 Re: c++/1616 nathan
2001-01-16 Re: c++/1632 nathan
2001-01-16 Re: optimization/743 David Ronis
2001-01-16 Re: optimization/755 rth
2001-01-16 Re: optimization/31 rth
2001-01-16 Re: optimization/652 rth
2001-01-16 Re: optimization/732 rth
2001-01-16 Re: optimization/743 rth
2001-01-16 Re: other/1669 neil
2001-01-16 Re: optimization/697 rth
2001-01-16 other/1669: chill compilation failed on solaris ask
2001-01-16 Re: optimization/652 rth
2001-01-16 Re: optimization/620 rth
2001-01-16 Re: optimization/576 rth
2001-01-16 c/1668: Internal compiler error on GNU/Linux alpha Christian Iseli
2001-01-16 Re: optimization/496 rth
2001-01-16 Re: optimization/473 rth
2001-01-16 c/1667: Internal compiler error in reload on GNU/Linux alpha Christian Iseli
2001-01-16 Re: optimization/463 rth
2001-01-16 Re: optimization/337 rth
2001-01-16 Re: c++/333 rth
2001-01-16 Re: optimization/323 rth
2001-01-16 Re: optimization/373 rth
2001-01-16 c++/1666: Internal compiler error on legal code Zsolt.Molnar
2001-01-16 Re: optimization/286 rth
2001-01-16 Re: optimization/205 rth
2001-01-16 c++/1665: derived inner class template sylvain.gommier
2001-01-16 c++/1664: minimum value for signed long integers sylvain.gommier
2001-01-16 Re: optimization/204 rth
2001-01-16 Re: optimization/192 rth
2001-01-16 Re: optimization/149 rth
2001-01-16 Re: optimization/107 rth
2001-01-16 Re: optimization/803 rth
2001-01-16 Re: optimization/870 rth
2001-01-16 Re: optimization/870: Internal error: Segmentation fault. Richard Henderson
2001-01-16 middle-end/1663: bug in loop.c hpenner
2001-01-16 Re: optimization/935 rth
2001-01-16 Re: optimization/964 rth
2001-01-16 Re: optimization/966 rth
2001-01-16 Re: optimization/997 rth
2001-01-16 Re: c++/1530 rth
2001-01-16 Re: optimization/1544 rth
2001-01-16 Re: c++/1653 rth
2001-01-16 Re: c++/1611 nathan
2001-01-16 Re: optimization/1603 rth
2001-01-16 c/1662: C compiler fails when -O option is used. michael.dillard
2001-01-16 Re: optimization/1624 rth
2001-01-16 Re: optimization/1624 rth
2001-01-16 c++/1661: internal error meixner
2001-01-16 Re: c/1624: incorrect stack adjustment with -fomit-frame-pointer on x86 Richard Henderson
2001-01-15 libstdc++/1660: memory leak in ostrstream r.standish
2001-01-15 Re: libstdc++/887: libstdc++-v3 modulator setw does not work writing to a file Benjamin Kosnik
2001-01-15 fortran/1636 toon
2001-01-15 c++/1659: Internal compiler error in `dwarfout_finish', at dwarfout.c:6102 jsears
2001-01-15 libstdc++/1658: -O0 -g -fcheck-memory-usage cheusov
2001-01-15 Re: c/166 jsm28
2001-01-15 c++/1657: types weirdness (looks like memory corruption with -ggdb) wolfgang.bangerth
2001-01-15 c++/1656: gcc incorrectly accepts template syntax on non-template class wolfgang.bangerth
2001-01-15 Re: c/593 Mattias Engdegård
2001-01-15 Re: c/593 Joseph S. Myers
2001-01-15 Re: c/593 Mattias Engdegård
2001-01-15 Re: optimization/31 Vladimir A. Merzliakov
2001-01-15 c++/1655: Internal compiler error in print_operand_address. A.Bowyer
2001-01-15 c++/1654: This (incorrect) code generates an internal compiler error. johan
2001-01-15 Re: c++/1509 nathan
2001-01-15 optimization/1653: ICE in expand_inline_function martin
2001-01-15 Re: c++/1520 nathan
2001-01-15 c++/1652: CVS20010114 tries to instantiate wrong template wolfgang.bangerth
2001-01-14 c++/1651: Large number of irix6.5/-mabi=64 testsuite failures coincident with V3 abi changes David.Billinghurst
2001-01-14 c/1650: Lack of ansi-C (pedantic) warning in -ansi -pedantic compilation mode s3173243
2001-01-14 Re: c++/273 neil
2001-01-14 Re: c++/267 neil
2001-01-14 Re: c++/268 neil
2001-01-14 Re: c++/265 neil
2001-01-14 Re: c++/260 neil
2001-01-14 Re: c++/257 neil
2001-01-14 Re: c++/258 neil
2001-01-14 Re: c++/256 neil
2001-01-14 Re: c++/255 neil
2001-01-14 Re: c++/1505 nathan
2001-01-14 Re: c++/1506 nathan
2001-01-14 Re: c/1648: ice: i686-pc-linux-gnu with -march=i686 but not with -march=i586 Andreas Jaeger
2001-01-14 Re: libf2c/1644: lapack routine segfaults on i686, but not on sparc Toon Moene
2001-01-14 c/1648: ice: i686-pc-linux-gnu with -march=i686 but not with -march=i586 schmid
2001-01-14 target/1647: patch for gcc-2.95.3 on NetBSD/sparc-1.5 bunk
2001-01-14 Re: c/321 neil
2001-01-14 Re: web/1646: The GNATS query filters do not work correctly Joseph S. Myers
2001-01-14 web/1646: The GNATS query filters do not work correctly neil
2001-01-14 Re: c/1570 jsm28
2001-01-14 c/179 Joseph S. Myers
2001-01-14 fortran/1645: cygwin optimization problem David.Billinghurst
2001-01-14 Re: c/1625 jsm28
2001-01-14 c/166 Joseph S. Myers
2001-01-14 Re: c/1540 jsm28
2001-01-14 Re: c/675 jsm28
2001-01-14 Re: c++/48 neil
2001-01-13 libf2c/1644: lapack routine segfaults on i686, but not on sparc wilkenin
2001-01-13 Re: c++/48 Vladimir A. Merzliakov
2001-01-13 Re: c++/242 neil
2001-01-13 Re: c++/228 neil
2001-01-13 Re: c++/207 neil
2001-01-13 Re: c/364 jsm28
2001-01-13 Re: c++/203 neil
2001-01-13 Re: c++/252 neil
2001-01-13 Re: c++/251 neil
2001-01-13 Re: c/233 neil
2001-01-13 Re: c++/249 neil
2001-01-13 Re: c/236 neil
2001-01-13 Re: c/229 neil
2001-01-13 c/1643: Snapshot GCC-20010108 Internal compiler error trond.bo
2001-01-13 Re: c++/18 neil
2001-01-13 Re: c/1623 jsm28
2001-01-13 Re: c/1490 jsm28
2001-01-13 Re: c/593 jsm28
2001-01-13 Re: other/928 neil
2001-01-13 Re: fortran/1636: Format strings with identical numbers cause assembler error Toon Moene
2001-01-13 Re: c/92 jsm28
2001-01-13 c/1642: problem with inline assembler: result variable not finished (?) when used mirar
2001-01-12 libgcj/1640: gcj runtime problem: undefined symbol __dso_handle (PR 1178 again, with most recent gcc) wagman
2001-01-12 Re: libstdc++/1576: crash before entering main Florian Kainz
2001-01-12 Re: c++/1617: partial ordering of function templates Martin Sebor
2001-01-12 Re: java/1564: build problems Bryce McKinlay
2001-01-12 Re: java/1629 bryce
2001-01-12 Re: java/1629: gcj link problem with a simple program Bryce McKinlay
2001-01-12 c++/1638: ICE: two void_type nodes in arg_types list kaa
2001-01-12 c++/1639: template operator != interferes with const expressions kaa
2001-01-12 c++/1637: compiler internal error on unknown exception name in catch() clause wanderer
2001-01-12 fortran/1636: Format strings with identical numbers cause assembler error peter
2001-01-12 c++/1635: 2 constructors and 3 destructors called for thrown object ouej
2001-01-12 other/1634: Request for gcc-cvs-patches list Joseph Myers
2001-01-12 c++/1633: Internal compiler error sven.vollbehr
2001-01-12 c++/1632: Invalid and incomprehensible error message wolfgang.bangerth
2001-01-12 c++/1631: placement new broken for enumeration types fsm
2001-01-12 Re: c++/1630 nathan
2001-01-12 c++/1630: [temp.deduct.call] allows more lenient qualifcation convs nathan
2001-01-12 Re: c++/1617: partial ordering of function templates Nathan Sidwell
2001-01-12 java/1629: gcj link problem with a simple program Patrik Hagglund
2001-01-12 Re: c++/1588 nathan
2001-01-12 Re: c++/1033 nathan
2001-01-12 c++/1628: Bogus (but annoying) warning about unused parameter wolfgang.bangerth
2001-01-11 c++/1627: overloading new[] and delete[] and what happens with fstream gccbug
2001-01-11 c/1626: Failure during 'make install' Mike
2001-01-11 Re: c/1623: GCC allows void function to return value Ben Collins
2001-01-11 c/1625: _Bool initializers bug Joseph Myers
2001-01-11 c/1624: incorrect stack adjustment with -fomit-frame-pointer on x86 drepper
2001-01-11 Re: libstdc++/1618: lrand48() undefined Benjamin Kosnik
2001-01-11 c/1623: GCC allows void function to return value neel
2001-01-11 c++/1622: -fvtable-gc flag optimizes away virtual functions even if function is used alex
2001-01-11 Re: c++/1617: partial ordering of function templates Gabriel Dos Reis
2001-01-11 Re: c++/29 neil
2001-01-11 Re: c++/15 neil
2001-01-11 debug/1621: Debugging with complex numbers Joseph Myers
2001-01-11 libstdc++/1620: excessive striking <Enter> for cin and incorrect string input wanderer
2001-01-11 Re: java/1586 tromey
2001-01-11 Re: java/1586 Tom Tromey
2001-01-11 c++/1619: c++ 2.95.2: Problem with `c++ -O' on template-based code Eric Eide
2001-01-11 libstdc++/1618: lrand48() undefined david.eller
2001-01-11 Re: c++/1617 nathan
2001-01-11 Re: c++/1617 nathan
2001-01-11 Re: c++/934 nathan
2001-01-11 Re: c/545 jsm28
2001-01-11 c++/1617: partial ordering of function templates nathan
2001-01-11 Re: c++/1551 nathan
2001-01-11 Re: c++/29 Vladimir A. Merzliakov
2001-01-11 Re: c++/1038 nathan
2001-01-11 Re: c++/15 Vladimir A. Merzliakov
2001-01-11 Re: c++/273 neil
2001-01-11 Re: c/237 neil
2001-01-11 Re: c/223 neil
2001-01-11 Re: c++/692 Wolfgang Bangerth
2001-01-11 c++/1616: gcc allows access to private variable in enclosing scope wolfgang.bangerth
2001-01-11 Re: c/206 neil
2001-01-11 Re: c++/1546 nathan
2001-01-11 Re: c++/1585 nathan
2001-01-11 Re: c++/1588 nathan
2001-01-11 Re: c++/1546 nathan
2001-01-11 Re: c++/1509 nathan
2001-01-11 Re: c++/1585 nathan
2001-01-11 Re: libgcj/1615 warrenl
2001-01-11 libgcj/1615: java.math.BigInteger.modPow produces bogus results w/ certain input data mjr
2001-01-11 Re: c++/1522 nathan
2001-01-11 Re: c++/1587 nathan
2001-01-11 Re: c++/1506 nathan
2001-01-11 Re: c++/1505 nathan
2001-01-11 Re: c++/1611 nathan
2001-01-11 c++/1614: Internal compiler error in `output_die', at dwarf2out.c:5426 alexb
2001-01-11 c/1613: gcc version 2.97 20010110 (experimental) does not build sh-linux-gnu-gcc soka
2001-01-11 c++/1612: incorrect ambiguous overload message (template related) jeremy.barnes
2001-01-10 Re: libstdc++/1605: exception::what() declares no exception list Benjamin Kosnik
2001-01-10 c++/1611: c++ new-abi generates bad code with virtual derivation snyder
2001-01-10 Re: c++/264 Kenny Simpson
2001-01-10 Re: c++/692 Kenny Simpson
2001-01-10 c/1610: multiplication bug in Intel PII + linux + gcc soren
2001-01-10 Re: libgcj/1596 warrenl
2001-01-10 c/1609: -funsigned-char -fsigned-char defines __CHAR_UNSIGNED__ Joseph Myers
2001-01-10 Re: libgcj/1596 Warren Levy
2001-01-10 libstdc++/1608: Problem with TREE_PARMLIST stewart
2001-01-10 c++/1607: Format attributes on methods undocumented Joseph Myers
2001-01-10 Re: libgcj/1596 Jeff Sturm
2001-01-10 Re: c++/1548 nathan
2001-01-10 Re: c++/1505 nathan
2001-01-10 Re: c++/1509 nathan
2001-01-10 Re: c++/1514 nathan
2001-01-10 Re: c++/1506 nathan
2001-01-10 Re: c++/1520 nathan
2001-01-10 Re: c++/1522 nathan
2001-01-10 Re: c++/1546 nathan
2001-01-10 Re: c++/1547 nathan
2001-01-10 Re: c++/1548 nathan
2001-01-10 Re: c++/1551 nathan
2001-01-10 Re: c++/1585 nathan
2001-01-10 Re: c++/1556 nathan
2001-01-10 Re: c++/1587 nathan
2001-01-10 Re: c++/1588 nathan
2001-01-10 Re: c++/1595 nathan
2001-01-10 Re: c++/1589 nathan
2001-01-10 Re: c++/1606 nathan
2001-01-10 Re: c++/595 nathan
2001-01-10 Re: c++/1606 nathan
2001-01-10 Re: c++/601 nathan
2001-01-10 Re: c++/934 nathan
2001-01-10 Re: c++/933 nathan
2001-01-10 c++/1606: Internal compiler error when accessing a stl-map through a pointe to a class containing it linkclau
2001-01-10 libstdc++/1605: exception::what() declares no exception list wolfgang.bangerth
2001-01-10 Re: c++/933 nathan
2001-01-10 c++/1604: error returning classes by value from an expression block richard
2001-01-10 Re: c++/1546 Reichelt
2001-01-10 Re: c++/1592 Reichelt
2001-01-10 Re: libgcj/1596 warrenl
2001-01-10 libgcj/1596 warrenl
2001-01-10 optimization/1603: Optimization of any kind produces bad code. jcmcknny
2001-01-10 Re: libstdc++/1576: crash before entering main Benjamin Kosnik
2001-01-09 c++/1602: include/g++-3/std/complext.h:314 ot14
2001-01-09 c/1601: A static inline function as a parameter of another static inline function is not inlined. jodaman
2001-01-09 Re: libstdc++/1599: valarry<T>(size_t n) constructor does not conform to standard Gabriel Dos Reis
2001-01-09 c++/1600: The placement of __attribute__ confuses g++ fgouget
2001-01-09 Re: libgcj/1596 warrenl
2001-01-09 libstdc++/1599: valarry<T>(size_t n) constructor does not conform to standard charlton
2001-01-09 Re: libstdc++/1598: istream::ignore() fails to discard a character Benjamin Kosnik
2001-01-09 libstdc++/1598: istream::ignore() fails to discard a character m
2001-01-09 Re: java/247 Jeff Sturm
2001-01-09 c/1597: gcc-2.95.2 fails on Sparc/Solaris 7, using sunfreeware package leam
2001-01-09 libgcj/1596: setScale() missing from java.math.BigDecimal jeff.sturm
2001-01-09 Re: java/1586 Patrik Hagglund
2001-01-09 Re: java/1564: build problems Patrik Hagglund
2001-01-09 c++/1595: g++ reports internal error instead of code error danbr
2001-01-09 c++/1594: Invalid .stabs/.stabn directive manz
2001-01-09 Re: preprocessor/215 neil
2001-01-09 Re: c/1590 neil
2001-01-09 c++/1593: Internal compiler error using -gdwarf or -gdwarf-2 option Bruno.Zoppis
2001-01-09 Re: libgcj/1338 warrenl
2001-01-09 libgcj/1338 warrenl
2001-01-09 c++/1592: unable to complie code which used simple virtual functions. syam
2001-01-09 Re: libgcj/1411 warrenl
2001-01-09 c/1590: -Wp,-MDfoo.o no longer works -- as of 2001-01-07 change jim
2001-01-09 c++/1589: Internal compiler error when doing explicit template instantiation w.f.j.mueller
2001-01-08 c++/1588: 2.95.2 (and later) Internal compiler error on template instantiation Hugues.Talbot
2001-01-08 libgcj/1411 warrenl
2001-01-08 Re: libstdc++/844 dan
2001-01-08 Re: c/1569: Internal compiler error in print_rtl_and_abort, at flow.c:6502 Igor Schein
2001-01-08 c++/1587: gcc segfaulting on undeclared member functions of a class syam
2001-01-08 Re: preprocessor/1565 (fwd) Neil Booth
2001-01-08 Re: java/1586: linux build problem for libjava - cpplib (?) Bryce McKinlay
2001-01-08 Re: preprocessor/1565 (fwd) Bruno Haible
2001-01-08 Re: preprocessor/1565 (fwd) Bruno Haible
2001-01-08 Re: java/1586 tromey
2001-01-08 java/1586 tromey
2001-01-08 Re: java/1586 tromey
2001-01-08 Re: java/651 tromey
2001-01-08 Re: c++/1582: Internal error #122 Alexandre Oliva
2001-01-08 Re: preprocessor/1565 (fwd) Neil Booth
2001-01-08 java/1586: linux build problem for libjava - cpplib (?) Patrik Hagglund
2001-01-08 c++/1585: An ICE caused by an illegal template definition warp
2001-01-08 Re: c++/635 nathan
2001-01-08 Re: preprocessor/1565 (fwd) Bruno Haible
2001-01-08 Re: other/1563 neil
2001-01-08 Re: c/1487 neil
2001-01-08 Re: c++/960 neil
2001-01-08 Re: c++/820 neil
2001-01-08 Re: other/836 neil
2001-01-08 Re: web/1581 neil
2001-01-08 c++/1584: Qt library crashes on sgi IRIX siggelkow
2001-01-08 Re: c++/3 nathan
2001-01-08 Re: c++/1038 nathan
2001-01-08 Re: c++/1033 nathan
2001-01-07 c++/1583: with -ggdb breaks with static & template code ymedini
2001-01-07 c++/1582: Internal error #122 forsythe
2001-01-07 Re: web/1581: configure web page out of date Gerald Pfeifer
2001-01-07 Re: web/1581: configure web page out of date Neil Booth
2001-01-07 Re: web/1581: configure web page out of date Gerald Pfeifer
2001-01-07 Re: web/1581: configure web page out of date Neil Booth
2001-01-07 web/1581: configure web page out of date Brian R. Gaeke
2001-01-07 RE: c++/1571 Don Bowman
2001-01-07 c/1580: ICE with -O3 ask
2001-01-07 c++/1579: 2.95.2 fails when compiling mySQL package with 'internal compiler error' mike
2001-01-07 Re: c++/1571 neil
2001-01-07 c/1578: mipsel-linux bootstrap fails in libgcc w/ current cvs Brian R. Gaeke
2001-01-06 c/1577: Bootstrap fails in libgcc2 on Solaris lucier
2001-01-06 Re: c++/1571: g++ is confused with by code that typedef's wchar_t. Chris G. Demetriou
2001-01-06 Re: c++/1571: g++ is confused with by code that typedef's wchar_t. Phil Edwards
2001-01-06 libstdc++/1576: crash before entering main kainz
2001-01-06 c/1575: 12-line C program coredumps gcc version 2.96 esr
2001-01-06 libstdc++/1574: cin.imbue() generates a segmentation fault (named locales) schmid
2001-01-06 Re: c/1570: gcc 2.8.1 has autoincrement bug Alexandre Oliva
2001-01-06 Re: middle-end/1557: Regrename macro not documented Richard Henderson
2001-01-06 c++/1573: g++ internal compiler error with large data structures berdahl
2001-01-06 Re: c/1569: Internal compiler error in print_rtl_and_abort, at flow.c:6502 Andreas Jaeger
2001-01-05 Re: java/1564: build problems Bryce McKinlay
2001-01-05 libgcj/1572: make boot fails building libgcj due to missing include dir Per Bothner
2001-01-05 c++/1571: g++ is confused with by code that typedef's wchar_t. cgd
2001-01-05 c/1570: gcc 2.8.1 has autoincrement bug rglan
2001-01-05 c/1569: Internal compiler error in print_rtl_and_abort, at flow.c:6502 igor
2001-01-05 Re: java/1564: build problems Bryce McKinlay
2001-01-05 Re: preprocessor/1565 neil
2001-01-05 c/1567: gcc crashes when compiling a simple file that generates many errors. dave
2001-01-05 Re: c/1501 jsm28
2001-01-05 Re: other/1492 jsm28
2001-01-05 c/1566: bootstrap - fails libgcc.a on hpux-10.20 nneul
2001-01-05 preprocessor/1565: nested expansion of macros broken in current cvs kreckel
2001-01-05 java/1564: build problems patha
2001-01-05 Re: preprocessor/1542 neil
2001-01-05 other/1563: --help broken Joseph Myers
2001-01-05 Re: c++/1561: pointer not initialised to 0 Phil Edwards
2001-01-05 c++/1562: g++ 2.96 x86 Code Generation bug for 64-bit integers colohan+gcc
2001-01-05 Re: c++/1561 nathan
2001-01-05 Re: c++/1040 nathan
2001-01-05 Re: c++/1038 nathan
2001-01-05 Re: c++/911 nathan
2001-01-05 Re: c++/1033 nathan
2001-01-05 Re: c++/937 nathan
2001-01-05 Re: c++/921 nathan
2001-01-05 Re: c++/911 nathan
2001-01-05 Re: c++/911 nathan
2001-01-05 c++/1561: pointer not initialised to 0 david
2001-01-05 c++/1560: segmentation fault of a program throwing an exception when compiled with option -fomit-frame-pointer gilles.chanteperdrix
2001-01-05 c++/1559: gcc 2.95.2: Internal compiler error in `gen_lowpart', at emit-rtl.c:1064 paul
2001-01-05 Re: other/1558: Different definitions for REGISTER_MOVE_COST in headers and sources Alexandre Oliva
2001-01-05 Re: other/1558: Different definitions for REGISTER_MOVE_COST in headers and sources Richard Earnshaw
2001-01-05 other/1558: Different definitions for REGISTER_MOVE_COST in headers and sources patrick.hildenbrand
2001-01-05 middle-end/1557: Regrename macro not documented Richard Earnshaw
2001-01-05 c++/1556: parse error when accessing global typenames in template argument robt
2001-01-05 c/1555: Virtual memory Overflow shivsundar.nadar
2001-01-04 c/1554: seg fault while in stage1/xgcc ... c-decl.c pete
2001-01-04 Re: c/1552 neil
2001-01-04 c++/1553: Internal Compiler Error #373 mark_jordan
2001-01-04 c/1552: CR-LF not handled correctly when using #pragma pack bruce
2001-01-04 c++/1551: explicit specialization of constructor causes dementia fsm
2001-01-04 Re: libgcj/1303: libgcj compilation error on boehm-gc/dyn_load.c fawcett
2001-01-04 c++/1548: Internal error caused by vitual inheritance and templates s000401
2001-01-04 c++/1547: problems with templates and inheritance from virtual class dm
2001-01-03 c++/1546: 2.95 compiler barf using vector class jrgraham
2001-01-03 libstdc++/1545: Out of a complex number generates a segmentation fault schmid
2001-01-03 optimization/1544: Optimzation -O3 breaks exception handling schmid
2001-01-03 Re: preprocessor/1542 neil
2001-01-03 Re: c++/579 jsm28
2001-01-03 preprocessor/1542: g++ -I../myfltkx -E filtx.cpp >z.cpp yohng
2001-01-03 c/1541: ICE on legal code: "insn does not satisfy its constraints" rohloff
2001-01-03 c/1540: Strange effects whe defining 2-dimensional arrays lampe
2001-01-03 Re: optimization/1535: Function parameter becomes NULL during throw (optimized code only) Eytan Segal
2001-01-02 c/1538: cannot compile with #include <sys/varargs.h> garrett
2001-01-02 other/1537: Obvious typo in 2.95.3-test1 for mips-wrs-vxworks cmetz
2001-01-02 c/1536: -L and -I with bad paths do not raise a warning eyal
2001-01-02 Re: c/1534: ICE probably due to uninitialized memory Bernd Schmidt
2001-01-02 optimization/1535: Function parameter becomes NULL during throw (optimized code only) eytan.segal
2001-01-02 c/1534: ICE probably due to uninitialized memory drepper
2001-01-01 libstdc++/1533: iostream long long operators not defined cljanss
2001-01-01 Re: c/526 bje
2001-01-01 c++/1532: -O3 generates (obviously) redundant tests and jumps duchier
2001-01-01 libstdc++/1531: libstdc++ is broken for -fno-exceptions James Lewis Nance
2001-01-01 optimization/1530: Segmentation fault in g++ compiler James Lewis Nance
Indexes: [Date Index] [Subject Index] [Author Index] [Thread Index]
Site Nav: [Browse other archives for this mailing list]
[Browse other mailing lists at this site]
Search: Limit to:

Mail converted by MHonArc 2.4.7