This is the mail archive of the gcc-patches@gcc.gnu.org mailing list for the GCC project.


Index Nav: [Date Index] [Subject Index] [Author Index] [Thread Index]
Message Nav: [Date Prev] [Date Next] [Thread Prev] [Thread Next]
Other format: [Raw text]

Re: Build failure on powerpc-apple-darwin



On Oct 14, 2004, at 8:04 PM, Matt Austern wrote:


Known problem?

../../fsf/gcc/tree-vectorizer.c: In function `vect_transform_loop':
../../fsf/gcc/tree-vectorizer.c:3244: error: `vectorization_factor' undeclared (first use in this function)
../../fsf/gcc/tree-vectorizer.c:3244: error: (Each undeclared identifier is reported only once
../../fsf/gcc/tree-vectorizer.c:3244: error: for each function it appears in.)
make[1]: *** [tree-vectorizer.o] Error 1


Yes this is with --disable-checking, this is next on my list to fix.

Thanks,
Andrew Pinski


Index Nav: [Date Index] [Subject Index] [Author Index] [Thread Index]
Message Nav: [Date Prev] [Date Next] [Thread Prev] [Thread Next]