gcc-help archive
date index for December, 2012

This is the mail archive of the gcc-help@gcc.gnu.org mailing list for the GCC project.

Indexes: [Date Index] [Subject Index] [Author Index] [Thread Index]
Site Nav: [Browse other archives for this mailing list]
[Browse other mailing lists at this site]
Search: Limit to:

December 31, 2012
17:20 problem compiling gcc 4.7.2 under OpenSolaris asyropoulos
13:12 R_ARM_TLS_DTPMOD32 Relocation naveen yadav

December 30, 2012
11:25 Re: problems with optimisation David Brown
09:51 Re: problems with optimisation Kicer
09:47 Re: problems with optimisation Kicer

December 29, 2012
22:28 Re: problems with optimisation Ãngel GonzÃlez
16:26 Re: problems with optimisation David Brown

December 28, 2012
23:46 Re: GCC vs MSVC compiler issues in a port Oleg Endo
17:14 Re: problems with optimisation Kicer
16:34 Re: problems with optimisation David Brown
15:19 Re: problems with optimisation Andrew Haley
14:12 Re: Some questions about adding mingw support for std::random_device Jonathan Wakely
10:25 problems with optimisation Kicer
08:05 Some questions about adding mingw support for std::random_device niXman

December 27, 2012
17:27 RE: Internal Compiler Error Iyer, Balaji V
13:10 Re: GCC vs MSVC compiler issues in a port David Brown
11:37 Re: Watch gcc dumps in vcg Georg-Johann Lay

December 26, 2012
14:11 Re: Mingw builds Jonathan Wakely
09:35 Mingw builds Алексей Павлов

December 25, 2012
06:01 Watch gcc dumps in vcg Alex Markin

December 24, 2012
18:19 Re: Internal Compiler Error Andrew Haley
16:44 Internal Compiler Error tanle

December 23, 2012
05:39 Re: GCC vs MSVC compiler issues in a port John Cotton Ericson

December 22, 2012
16:31 Re: GCC vs MSVC compiler issues in a port Andrew Haley
14:43 Re: linking qsort with gfortran Ángel González
12:15 Re: linking qsort with gfortran Tim Prince
12:11 Re: GCC vs MSVC compiler issues in a port Oleg Endo
09:07 GCC vs MSVC compiler issues in a port John Cotton Ericson
00:58 linking qsort with gfortran dlr13

December 21, 2012
15:17 Re: why is g++ relocation error linking only showing when listing objects explicitly? Andrew Haley
15:10 RE: why is g++ relocation error linking only showing when listing objects explicitly? Mark Galeck (CW)
15:07 Re: why is g++ relocation error linking only showing when listing objects explicitly? Andrew Haley
14:57 RE: why is g++ relocation error linking only showing when listing objects explicitly? Mark Galeck (CW)
14:56 Re: parallel testsuite results differ from a single task approach Dennis Clarke
14:47 Re: why is g++ relocation error linking only showing when listing objects explicitly? Andrew Haley
14:36 RE: why is g++ relocation error linking only showing when listing objects explicitly? Mark Galeck (CW)
14:29 RE: why is g++ relocation error linking only showing when listing objects explicitly? Mark Galeck (CW)
14:04 RE: why is g++ relocation error linking only showing when listing objects explicitly? Mark Galeck (CW)
13:01 Re: parallel testsuite results differ from a single task approach Tim Prince
10:40 Re: why is g++ relocation error linking only showing when listing objects explicitly? Jonathan Wakely
09:38 RE: why is g++ relocation error linking only showing when listing objects explicitly? Mark Galeck (CW)
04:06 parallel testsuite results differ from a single task approach Dennis Clarke

December 20, 2012
14:54 Re: A question about RPATH Andrew Haley
14:51 Re: A question about RPATH Andrew Haley
11:40 Re: A question about RPATH Jonathan Wakely
11:01 Re: A question about RPATH Dennis Clarke
09:42 Re: A question about RPATH Andrew Haley
08:14 Re: Racing Condition Ángel González
07:42 Re: Racing Condition Ian Lance Taylor
07:16 Racing Condition Hei Chan
02:26 Re: A question about RPATH Dennis Clarke
00:31 Re: A question about RPATH Dennis Clarke
00:19 Re: A question about RPATH Jonathan Wakely
00:15 Re: A question about RPATH Dennis Clarke

December 19, 2012
23:57 Re: A question about RPATH Dennis Clarke
23:21 Re: A question about RPATH Jim Rice
23:08 A question about RPATH Dennis Clarke
19:21 Re: GCC 4.7.2 stage3 bootstrap error on RHEL6 : collect2: error: ld returned 1 exit status Dennis Clarke
17:28 Re: GCC 4.7.2 stage3 bootstrap error on RHEL6 : collect2: error: ld returned 1 exit status Jonathan Wakely
17:19 Re: GCC 4.7.2 stage3 bootstrap error on RHEL6 : collect2: error: ld returned 1 exit status Jonathan Wakely
16:58 Re: GCC 4.7.2 stage3 bootstrap error on RHEL6 : collect2: error: ld returned 1 exit status Dennis Clarke
15:22 Re: How to extend gcc compiler by adding pragmas Ian Lance Taylor
15:09 Re: How to extend gcc compiler by adding pragmas Hayder
14:42 Re: How to extend gcc compiler by adding pragmas Ian Lance Taylor
13:52 Re: trouble with libgomp/.deps directory building gcc 4.7.2 Jonathan Wakely
13:47 Re: GCC 2.7.2 stage3 bootstrap error on RHEL6 : collect2: error: ld returned 1 exit status Jonathan Wakely
13:44 Re: libgcc build fails with "cannot compute suffix of object files: cannot compile" Jonathan Wakely
10:35 How to extend gcc compiler by adding pragmas Hayder
09:55 libgcc build fails with "cannot compute suffix of object files: cannot compile" Devin
05:49 Re: Possible issue with integer promotion for << and >> in gcc.4.5.3 Ian Lance Taylor
04:32 Re: GCC 2.7.2 stage3 bootstrap error on RHEL6 : collect2: error: ld returned 1 exit status Dennis Clarke
01:44 Re: Possible issue with integer promotion for << and >> in gcc.4.5.3 Arthur Schwarz
00:33 Re: trouble with libgomp/.deps directory building gcc 4.7.2 Tim Bird

December 18, 2012
22:34 Re: trouble with libgomp/.deps directory building gcc 4.7.2 Tim Bird
22:28 Re: trouble with libgomp/.deps directory building gcc 4.7.2 Ian Lance Taylor
20:10 trouble with libgomp/.deps directory building gcc 4.7.2 Tim Bird
17:39 Re: GCC 2.7.2 stage3 bootstrap error on RHEL6 : collect2: error: ld returned 1 exit status Dennis Clarke
15:44 Re: GNAT problem - ld @/tmp/cc2IfUhy: No such file: No such file or directory Patrick Herbst
15:33 Re: GNAT problem - ld @/tmp/cc2IfUhy: No such file: No such file or directory Florian Weimer
15:10 GNAT problem - ld @/tmp/cc2IfUhy: No such file: No such file or directory Patrick Herbst
07:10 Re: GCC 2.7.2 stage3 bootstrap error on RHEL6 : collect2: error: ld returned 1 exit status Ian Lance Taylor
06:45 Re: Default value for -march option Anthony S

December 17, 2012
23:25 Why do asan tests fail on gcc20? Jonathan Wakely
17:49 Re: Installing gcc 4.7.2 on Solaris 10 - SPARC platform Dennis Clarke
17:40 Re: Installing gcc 4.7.2 on Solaris 10 - SPARC platform Tom Christensen
15:17 Re: Strange warnings from GCC++ 4.6.2 in Atmel Studio 6 Jonathan Wakely
15:06 Re: Default value for -march option Jonathan Wakely
14:51 Re: Is possible get label address? Jonathan Wakely
14:38 Re: Strange warnings from GCC++ 4.6.2 in Atmel Studio 6 Florian Weimer
14:25 Strange warnings from GCC++ 4.6.2 in Atmel Studio 6 George H. Barbehenn
12:12 Default value for -march option Anthony S
12:00 Re: Is possible get label address? Borneq
04:59 why is g++ relocation error linking only showing when listing objects explicitly? Mark Galeck (CW)
00:59 Re: Installing gcc 4.7.2 on Solaris 10 - SPARC platform Holmes.Sherlock
00:43 Re: Installing gcc 4.7.2 on Solaris 10 - SPARC platform Dennis Clarke
00:09 Re: Installing gcc 4.7.2 on Solaris 10 - SPARC platform Holmes.Sherlock
00:04 Re: Installing gcc 4.7.2 on Solaris 10 - SPARC platform Holmes.Sherlock

December 16, 2012
22:17 GCC 2.7.2 stage3 bootstrap error on RHEL6 : collect2: error: ld returned 1 exit status Dennis Clarke
21:51 Re: Installing gcc 4.7.2 on Solaris 10 - SPARC platform Dennis Clarke
21:45 Re: Installing gcc 4.7.2 on Solaris 10 - SPARC platform Dennis Clarke
09:39 Re: Installing gcc 4.7.2 on Solaris 10 - SPARC platform Holmes.Sherlock
09:07 Re: Installing gcc 4.7.2 on Solaris 10 - SPARC platform Kai Ruottu
00:35 Re: Building GCC 4.7.2 on Solaris 10 x86 AMD64 - Getting linker error involving eh_frame Holmes.Sherlock
00:31 Re: Installing gcc 4.7.2 on Solaris 10 - SPARC platform Holmes.Sherlock

December 14, 2012
23:14 GCov showing closing braces as not executed between gcc 4.4.4 and 4.6.3 Graeme Bunyan
11:18 Re: Problem with linking with --whole-program Florian Weimer
11:14 Re: Problem with linking with --whole-program Henrik Mannerström
10:41 Re: std::erf not in cmath? Jonathan Wakely
10:30 Re: Problem with linking with --whole-program Florian Weimer
10:11 Problem with linking with --whole-program Henrik Mannerström
07:56 Re: std::erf not in cmath? Nico Schlömer
05:13 Re: Building GNAT: Error: undefined reference to `__gnat_rcheck_CE_Explicit_Raise' -- SOLVED Patrick Herbst
01:02 Re: std::erf not in cmath? Jonathan Wakely

December 13, 2012
17:05 std::erf not in cmath? Nico Schlömer

December 12, 2012
16:33 Building GNAT: Error: undefined reference to `__gnat_rcheck_CE_Explicit_Raise' Patrick Herbst

December 11, 2012
23:25 Re: Bit field ordering on Big-Endian (SPARC) processor Holmes.Sherlock
18:12 Re: Bit field ordering on Big-Endian (SPARC) processor PaweÅ Sikora
17:12 Re: Bit field ordering on Big-Endian (SPARC) processor Holmes.Sherlock
17:04 Re: Bit field ordering on Big-Endian (SPARC) processor PaweÅ Sikora
13:01 Bit field ordering on Big-Endian (SPARC) processor Dipanjan Das
09:09 Buffet Hái Sán Tái 199.000Ä | 10 Cha i sáa báp 65.000Ä | DÃy nát vái bá 125.000Ä Mua Sám 247

December 05, 2012
20:58 -fprofile-generate and -pthread possible race condition with indirect calls Joao Rafael
20:22 Re: optimizer gives up for large functions Vladimir Makarov
20:03 Re: Building GCC 4.7.2 on Solaris 10 x86 AMD64 - Getting linker error involving eh_frame Jim Rice
19:53 optimizer gives up for large functions Peter Foelsche
18:30 Re: Building GCC 4.7.2 on Solaris 10 x86 AMD64 - Getting linker error involving eh_frame Holmes.Sherlock
18:28 Re: Installing gcc 4.7.2 on Solaris 10 - SPARC platform Holmes.Sherlock
17:36 Re: Building GCC 4.7.2 on Solaris 10 x86 AMD64 - Getting linker error involving eh_frame Jim Rice
17:04 Re: Installing gcc 4.7.2 on Solaris 10 - SPARC platform Dennis Clarke
17:00 Re: Building GCC 4.7.2 on Solaris 10 x86 AMD64 - Getting linker error involving eh_frame Dennis Clarke
16:14 Installing gcc 4.7.2 on Solaris 10 - SPARC platform Dipanjan Das
01:08 Re: Building GCC 4.7.2 on Solaris 10 x86 AMD64 - Getting linker error involving eh_frame Jim Rice

December 04, 2012
20:40 Re: gcc 4.8 search path usr/... instead of /usr/... Christer Solskogen
17:52 Re: Building GCC 4.7.2 on Solaris 10 x86 AMD64 - Getting linker error involving eh_frame Jim Rice
15:26 Re: Bare metal ARM Cross compiler - aeabi auto-generated functions for cortex-m0 use wrong instruction set jprofesorek
10:47 Re: Build ELF Binary File Ian Lance Taylor
09:46 Build ELF Binary File ugiwgh
07:40 Re: Ian Lance Taylor
07:14 Fwd: dhinesh someone
02:54 Re: Bare metal ARM Cross compiler - aeabi auto-generated functions for cortex-m0 use wrong instruction set Maxim Kuvyrkov

December 03, 2012
17:17 Re: Building GCC 4.7.2 on Solaris 10 x86 AMD64 - Getting linker error involving eh_frame Dennis Clarke
16:35 Re: Building GCC 4.7.2 on Solaris 10 x86 AMD64 - Getting linker error involving eh_frame Jim Rice
03:41 Re: gcc 4.8 search path usr/... instead of /usr/... tmp15711
02:08 Re: Building GCC 4.7.2 on Solaris 10 x86 AMD64 - Getting linker error involving eh_frame Ian Lance Taylor
00:00 Re: Bare metal ARM Cross compiler - aeabi auto-generated functions for cortex-m0 use wrong instruction set Chris Johns

December 02, 2012
20:30 Urgent Supplies Parkagesalegroup
15:22 Bare metal ARM Cross compiler - aeabi auto-generated functions for cortex-m0 use wrong instruction set Jan K
11:08 Re: gcc 4.8 search path usr/... instead of /usr/... Jonathan Wakely
02:04 gcc 4.8 search path usr/... instead of /usr/... y y
01:24 Re: Building GCC 4.7.2 on Solaris 10 x86 AMD64 - Getting linker error involving eh_frame Dennis Clarke

December 01, 2012
12:22 Re: Problem updating gcc 4.6.2 under Fedora16 Jonathan Wakely
10:32 Problem updating gcc 4.6.2 under Fedora16 Daniel Tsen
08:16 Re: Building GCC 4.7.2 on Solaris 10 x86 AMD64 - Getting linker error involving eh_frame Marc Glisse
07:50 Re: using -fsplit-stack mathieu lacage
01:13 Re: Building GCC 4.7.2 on Solaris 10 x86 AMD64 - Getting linker error involving eh_frame Ian Lance Taylor
00:13 Re: Question about gimple frontend Ian Lance Taylor


Indexes: [Date Index] [Subject Index] [Author Index] [Thread Index]
Site Nav: [Browse other archives for this mailing list]
[Browse other mailing lists at this site]
Search: Limit to:

Mail converted by MHonArc 2.6.3