gcc-bugs archive
subject index for July, 2011

This is the mail archive of the gcc-bugs@gcc.gnu.org mailing list for the GCC project.

Indexes: [Date Index] [Subject Index] [Author Index] [Thread Index]
Site Nav: [Browse other archives for this mailing list]
[Browse other mailing lists at this site]
Search: Limit to:

[Bug ada/38400] Acats faillures due to undefined pthread_setrunon_np

[Bug ada/46350] s-taprop.adb:891:40: warning: redundant conversion, expression is of type "Interrupt_ID"

[Bug ada/48151] Bootstrap failure in stage3 comparison

[Bug ada/48711] [4.6/4.7 regression] failure to bootstrap or build ada for mingw (value not in range of type "Interfaces.C.unsigned" in g-socthi.adb)

[Bug ada/48835] Porting GNAT to GNU/Linux/m68k

[Bug ada/49608] New: Ada option handling kludges

[Bug ada/49724] [4.6/4.7 Regression] FAIL: gnat.dg/socket1.adb execution test

[Bug ada/49724] New: [4.6/4.7 Regression] FAIL: gnat.dg/socket1.adb execution test

[Bug ada/49725] [4.6 Regression] FAIL: c34005a

[Bug ada/49725] New: [4.6 Regression] FAIL: c34005a

[Bug ada/49732] [4.6/4.7 regression] crash on terminal_interface-curses-menus.adb from ncurses with -gnato

[Bug ada/49732] GNAT 4.6.[01] crashes on terminal_interface-curses-menus.adb from ncruses 5.9

[Bug ada/49732] New: GNAT 4.6.[01] crashes on terminal_interface-curses-menus.adb from ncruses 5.9

[Bug ada/49783] GCC must bring ads and adb files after installation

[Bug ada/49783] New: GCC must bring ads and adb files after installation

[Bug ada/49785] New: [C++0x] ICE in coerce_template_parms

[Bug ada/49819] [4.6 regression] bogus reference to g-trasym-dwarf.adb in Makefile

[Bug ada/49819] [4.6/4.7 regression] bogus reference to g-trasym-dwarf.adb in Makefile

[Bug ada/49819] New: gcc/ada/gcc-interface/Makefile.in refers to g-trasym-dwarf.adb which does not exist

[Bug boehm-gc/48494] FAIL: boehm-gc.c/gctest.c -O2 (test for excess errors)

[Bug boehm-gc/49381] Unresolved symbols in libgcjgc.a when linking gctest

[Bug bootstrap/20072] make install doesn't create /usr/local/info/dir if .../dir not already present.

[Bug bootstrap/2670] Passing -fpic to cc gives warning

[Bug bootstrap/33100] [4.3/4.4 regression] on bootstrap getting section .eh_frame: bad cie version 0: offset 0x0

[Bug bootstrap/36330] i386-pc-solaris2.10 configure: error: C compiler cannot create executables

[Bug bootstrap/39024] static libelf needs to be built PIC

[Bug bootstrap/39111] gcc 4.4.0 20090204 - Configury from GNU linker to Operating System's Linker broke (reverse works OK)

[Bug bootstrap/39150] Configure scripts have no 64-Bit Solaris defined (only i386-solaris*).

[Bug bootstrap/39810] [melt] - revision 146327 - compiler-probe.c:106: undefined reference to `unlikely'

[Bug bootstrap/40250] make bootstrap fails on IRIX64: ar: libbackend.a: Error reading tree-phinodes.o

[Bug bootstrap/44424] problem related to awk on alpha-dec-osf5.1

[Bug bootstrap/44642] bootstrap fails to build libgcc when gold is built (at least on Solaris_x86)

[Bug bootstrap/44959] [4.5 Regression] bootstrap failed at Comparing stages 2 and 3

[Bug bootstrap/49469] GCC fails to bootstrap when building with embedded zlib on Mac OS X 10.6.7

[Bug bootstrap/49555] libjava fails to configure if --enable-symvers=gnu or --enable-symvers=sun

[Bug bootstrap/49557] make chokes on various Makefile constructs

[Bug bootstrap/49625] GCC 4.6.* with Ada can't bootstrapped on MINGW

[Bug bootstrap/49625] New: GCC 4.6.* with Ada can't bootstrapped on MINGW

[Bug bootstrap/49667] Duplicate -L's with configure --with-gmp-lib on Solaris 10

[Bug bootstrap/49667] New: Duplicate -L's with configure --with-gmp-lib on Solaris 10

[Bug bootstrap/49680] [4.7 regression] IRIX 6.5 bootstrap broken: SEGV in __register_frame_info_bases

[Bug bootstrap/49680] New: [4.7 regression] IRIX 6.5 bootstrap broken: SEGV in __register_frame_info_bases

[Bug bootstrap/49681] 4.6.1 cross-build fails in libquadmath/libiberty

[Bug bootstrap/49681] New: 4.6.1 cross-build fails in libquadmath/libiberty

[Bug bootstrap/49707] New: GCC sends incorrect flags to native IRIX ld

[Bug bootstrap/49737] [4.7 Regression] Bootstrap failure at revision 176240 on x86_64-apple-darwin10

[Bug bootstrap/49737] New: [4.7 Regression] Bootstrap failure at revision 176240 on x86_64-apple-darwin10

[Bug bootstrap/49739] [4.7 Regression] bootstrap failure

[Bug bootstrap/49739] New: [4.7 Regression] bootstrap failure

[Bug bootstrap/49740] [4.7 Regression] powerpc native bootstrap with -O3 produces "Bootstrap comparison failure!"

[Bug bootstrap/49740] New: [4.7 Regression] powerpc native bootstrap with -O3 produces "Bootstrap comparison failure!"

[Bug bootstrap/49769] [4.7 regression] configuration mismatch -- extra parts

[Bug bootstrap/49786] [4.7 Regression] bootstrap failed with bootstrap-profiled

[Bug bootstrap/49786] New: [4.7 Regression] bootstrap failed with bootstrap-profiled

[Bug bootstrap/49787] [4.7 Regression] --enable-languages=c doesn't work

[Bug bootstrap/49787] New: [4.7 Regression] --enable-languages=c doesn't work

[Bug bootstrap/49789] New: Bootstrap failure with SMS flags on ARM

[Bug bootstrap/49794] [4.7 regression] Solaris 10/x86 bootstrap broken by C++ build

[Bug bootstrap/49794] New: [4.7 regression] Solaris 10/x86 bootstrap broken by C++ build

[Bug bootstrap/49797] CLooG use of LANGUAGE_C conflicts with MIPS compilers

[Bug bootstrap/49797] New: CLooG use of LANGUAGE_C conflicts with MIPS compilers

[Bug bootstrap/49810] [4.7 Regression] ld: Unsatisfied symbol "strsignal(int)" in file collect2.o

[Bug bootstrap/49810] New: [4.7 Regression] ld: Unsatisfied symbol "strsignal(int)" in file collect2.o

[Bug bootstrap/49815] [4.7 regression] ICE in cselib_record_set, at cselib.c:2241 compiling 64-bit libjava on SPARC

[Bug bootstrap/49815] New: [4.7 regression] ICE in cselib_record_set, at cselib.c:2241 compiling 64-bit libjava on SPARC

[Bug bootstrap/49827] [4.7 regression] sparc64-linux and arm-linux-gnueabi bootstrap failures due to ICE in dwarf2cfi.c connect_traces

[Bug bootstrap/49827] New: [4.7 regression] sparc64-linux bootstrap failure due to ICE in dwarf2cfi.c connect_traces

[Bug bootstrap/49829] [4.7 Regression] --disable-static --enable-shared regression: cannot find -lstdc++

[Bug bootstrap/49830] New: [4.7 regression] m68k-linux bootstrap failure due to ICE in dwarf2out_notice_stack_adjust

[Bug bootstrap/49835] [4.7 Regression] Revision 176720 caused bootstrap failure

[Bug bootstrap/49835] New: [4.7 Regression] Revision 176720 caused bootstrap failure

[Bug bootstrap/49845] [4.7 Regression] bootstrap failure

[Bug bootstrap/49845] New: [4.7 Regression] bootstrap failure

[Bug bootstrap/49907] [4.5/4.6/4.7 Regression] lto-plugin -Wall in stage1

[Bug bootstrap/49907] New: lto-plugin -Wall in stage1

[Bug bootstrap/49908] -lm missing after -lmpc

[Bug bootstrap/49908] New: -lm missing after -lmpc

[Bug bootstrap/49914] call to abs(long long) in gcc/fold-const.c

[Bug bootstrap/49919] problem with building gcc 4.6.1 on Mac OS X Lion

[Bug c++/24163] dependent Base class scope examined during unqualified name lookup in template

[Bug c++/30112] pragma redefine_extname fails when namespaces are involved

[Bug c++/31397] Useful compiler warning missing (virtual functions in derived classes used without 'virtual')

[Bug c++/33255] A warning for "unused" typedefs?

[Bug c++/33475] New warning suggestion: virtual functions called from constructors/destructors

[Bug c++/35383] Lookup of template dependent function with overloads fails for namespace-qualified parameter

[Bug c++/4131] The C++ compiler don't place a const class object to ".rodata" section with non trivial constructor

[Bug c++/41426] User defined conversion on return ignores array types

[Bug c++/42603] [C++0x] decltype not supported for parent class specifier

[Bug c++/44609] Invalid template code causes infinite loop of error messages

[Bug c++/45329] When printing a list of candidate functions, explain why each function failed to match.

[Bug c++/45437] Loses reference during update

[Bug c++/45603] crash in "build_addr_func"

[Bug c++/45697] __restrict__ inconsistent in presence of typedefs

[Bug c++/45923] constexpr diagnostics, more more

[Bug c++/45930] AIX: c++ -static-libgcc cores on throw/catch

[Bug c++/46043] attribute to mark virtual methods that can't be further overriden so they can be devirtualized

[Bug c++/46727] [4.4 Regression] ICE with -O3 and -ffast-math (in get_callee_fndecl, at tree.c:6857)

[Bug c++/47346] access control for nested type is ignored in class template

[Bug c++/47356] Internal error when assigning with incomplete uniform initializer list

[Bug c++/47453] Various non-conforming behaviors with braced-init-list initialization

[Bug c++/47606] [trans-mem] internal compiler error in expand_block_tm with O2

[Bug c++/47752] Non-dependent name is found in dependent base class although it should be rejected

[Bug c++/48157] Unable to match function call to member function template

[Bug c++/48261] internal compiler error: in lookup_template_function, at cp/pt.c:6227

[Bug c++/48296] [C++0x] constexpr member function cannot use the class type it belongs as parameter type or return type

[Bug c++/48593] Wrong return type when applying address operator to inherited, template dependend member, using a typedef

[Bug c++/48660] ARM ICE in expand_expr_real_1

[Bug c++/48802] ICE with inheritance and nothrow virtual destructors

[Bug c++/48867] Using the compilation flag -mfpmath=sse breaks Snes9x build.

[Bug c++/48883] ?: ternary operator fails in certain contexts - link error

[Bug c++/48914] #pragma GCC diagnostic ignored "-Wc++0x-compat" doesn't work

[Bug c++/48934] no rejection reason given for SFINAE

[Bug c++/48962] I am getting an error new.h: No such file or directory on Fedora 13

[Bug c++/48980] Misleading error message when a conversion is invalid while calling a protected base constructor

[Bug c++/48992] inline assembly "i" constraint does not accept constexpr function return value

[Bug c++/48993] [C++0x\ segmentation fault when compiling this program with constexpr

[Bug c++/49039] [4.4/4.5 Regression] LLVM StringRef miscompilation with -O2

[Bug c++/49043] [OpenMP & C++0x]: Compiler error when lambda-function within OpenMP loop

[Bug c++/49085] Crash with SIGSEGV during compilation.

[Bug c++/49100] [OpenMP]: Compiler error when inline method defined within OpenMP loop

[Bug c++/49118] Endless operator-> chain causes infinite loop

[Bug c++/49126] timevar_stack faild because define_label

[Bug c++/49129] confusing diagnostic for missing semi-colon after member template

[Bug c++/49165] [4.4/4.5 Regression] ICE on for-loop/throw combination

[Bug c++/49317] g++.dg/abi/local1.C FAILs on Tru64 UNIX

[Bug c++/49347] G++ rejects Solaris spawn.h use of __restrict

[Bug c++/49353] C++ frontend should not declare function EXTERN when it forces them to stay

[Bug c++/49355] new T({""}) crashes G++ when struct T { std::string foobar };

[Bug c++/49387] t.cxx:140: error: too many initializers for âconst __class_type_info_pseudoâ

[Bug c++/49488] [C++0x] Use 'final' for devirtualization purposes

[Bug c++/49495] -O3 causes error message "edge points to wrong declaration:"

[Bug c++/49519] [4.7 Regression] Revision 175272 miscompiled 447.dealII in SPEC CPU 2006

[Bug c++/49538] [4.7 regression] Revision 175341 causes segfaults

[Bug c++/49568] [4.7 regression] g++.dg/torture/pr41257-2.C FAILs to link on Tru64 UNIX

[Bug c++/49569] [4.7 regression] -std=gnu++0x causes segmentation fault

[Bug c++/49587] Code generation error with dynamic libraries.

[Bug c++/49589] [C++0x] Internal compile error at decltype

[Bug c++/49598] [C++0x] Ice on lambda with implicit capture by value.

[Bug c++/49604] forward-declared enum's elements in class scope gets default access (class vs struct)

[Bug c++/49604] New: forward-declared enum in class scope is private in context of constexpr

[Bug c++/49605] -Wdelete-non-virtual-dtor is not picky enough

[Bug c++/49605] New: -Wdelete-non-virtual-dtor is not picky enough

[Bug c++/49609] New: No code emitted for address-taken instances of function templates

[Bug c++/49609] No code emitted for address-taken instances of function templates

[Bug c++/49615] internal compiler error: verify_stmts failed / LHS in noreturn call with pointer-to-never-returning-member

[Bug c++/49615] New: internal compiler error: verify_stmts failed / LHS in noreturn call with pointer-to-never-returning-member

[Bug c++/49626] Explicit conversion skipped when followed by conversion to a wider type

[Bug c++/49626] New: Explicit conversion skipped when followed by conversion to a wider type

[Bug c++/49637] New: template function overload incorrectly ambiguous

[Bug c++/49637] template function overload incorrectly ambiguous

[Bug c++/49639] [4.7 Regression] 447.dealII in SPEC CPU 2006 runtime fail

[Bug c++/49639] New: [4.7 Regression] 447.dealII in SPEC CPU 2006 runtime fail

[Bug c++/49651] [C++0x] nested lambdas and -O3 produced incorrect integer variable increments

[Bug c++/49651] New: [C++0x] nested lambdas and -O3 produced incorrect integer variable increments

[Bug c++/49663] [4.7 Regression] [C++0x] ICE in lookup_base

[Bug c++/49663] New: [4.7 Regression] [C++0x] ICE in lookup_base

[Bug c++/49665] 'defined in discarded section' link failures on cpu2006 benchmarks

[Bug c++/49669] [4.6/4.7 Regression] [C++0x] Compiler crashes with "internal compiler error: in perform_member_init, at cp/init.c:530"

[Bug c++/49669] New: Compiler crashes with "internal compiler error: in perform_member_init, at cp/init.c:530"

[Bug c++/49670] New: internal compiler error: in extract_insn, at recog.c:2104

[Bug c++/49672] [C++0x] Internal error when passing variadic template args to a lambda function

[Bug c++/49672] Internal error when passing variadic template args to a lambda function

[Bug c++/49672] New: Internal error when passing variadic template args to a lambda function

[Bug c++/49673] [C++0x] const variables initialised with constexpr constructor placed in .data not .rodata

[Bug c++/49673] New: [C++0x] const variables initialised with constexpr constructor placed in .data not .rodata

[Bug c++/49679] Increment/decrement operator (++/--) not working as expected

[Bug c++/49679] New: Increment/decrement operator (++/--) not working as expected

[Bug c++/49689] New: Using offsetof of an incomplete class template in static_assert causes gcc to crash

[Bug c++/49689] Using offsetof of an incomplete class template in static_assert causes gcc to crash

[Bug c++/49691] ICE in cp_parser_late_return_type_opt, at cp/parser.c:15562

[Bug c++/49691] New: ICE in cp_parser_late_return_type_opt, at cp/parser.c:15562

[Bug c++/49692] Constructor call mistaken for declaration

[Bug c++/49692] New: Constructor call mistaken for declaration

[Bug c++/49701] New: Parser confusion between operator< and template specialization

[Bug c++/49701] Parser confusion between operator< and template specialization

[Bug c++/49718] New: please allow no_instrument_function attribute in class member definition/declaration

[Bug c++/49720] New: Infinite recursion compiling gold binary_test.cc testcase

[Bug c++/49722] G++ doens't allow compilation with extern "C" and C99 inside

[Bug c++/49722] New: G++ doens't allow compilation with extern "C" and C99 inside

[Bug c++/49727] New: Same classes in different files issue.

[Bug c++/49727] Same classes in different files issue.

[Bug c++/49728] g++ -> double free -> int object in memory deleted multiple times: no runtime error

[Bug c++/49728] g++ -> int object in memory deleted multiple times: no runtime error

[Bug c++/49728] New: g++ -> int object in memory deleted multiple times: no runtime error

[Bug c++/49729] diagnostic cascade

[Bug c++/49729] New: diagnostic cascade

[Bug c++/49734] Adding using std::for_each inconsistent with return value

[Bug c++/49734] New: Adding using std::for_each inconsistent with return value

[Bug c++/49745] New: error: âint truncateâ redeclared as different kind of symbol

[Bug c++/49751] Incorrect optimization related to smallest int64_t value.

[Bug c++/49751] New: Incorrect optimization related to smallest int64_t value.

[Bug c++/49756] g++ ICE

[Bug c++/49759] New: std::streampos == int should be ambiguous

[Bug c++/49759] std::streampos == int should be ambiguous

[Bug c++/49763] [C++0x] A reference is not correctly captured by [=]

[Bug c++/49763] New: [C++0x] A reference is not correctly captured by [=]

[Bug c++/49776] [C++0x]ICE in build_data_member_initialization, at cp/semantics.c:5499

[Bug c++/49776] New: [C++0x]ICE in build_data_member_initialization, at cp/semantics.c:5499

[Bug c++/49777] New: for c++ code, without -g option, cannot generate PIC *.so library.

[Bug c++/49784] GCC can't resolve a call which formed with using of typedef and typename operators

[Bug c++/49784] New: GCC can't resolve a call which formed with using of typedef and typename operators

[Bug c++/49785] [C++0x] ICE in coerce_template_parms

[Bug c++/49793] [C++0x] Narrowing conversion from int/short/char to double

[Bug c++/49793] Narrowing conversion from int/short/char to double with -std=c++0x

[Bug c++/49793] New: Narrowing conversion from int to double with -std=c++0x

[Bug c++/49803] New: [C++0x] erroneous variant-member initialization in a union containing an anonymous struct

[Bug c++/49808] GCC adds an address-of somewhere!

[Bug c++/49808] New: GCC adds an address-of somewhere!

[Bug c++/49811] Crash at __do_global_dtors_aux when compiled with '-shared -static'

[Bug c++/49811] New: Crash at __do_global_dtors_aux when compiled with '-shared -static'

[Bug c++/49812] New: strange return type for built-in operator++(int, int)

[Bug c++/49812] strange return type for built-in operator++(int, int)

[Bug c++/49813] [C++0x] sinh vs asinh vs constexpr

[Bug c++/49813] New: sinh vs asinh vs constexpr

[Bug c++/49823] [C++0x] ICE on decltype(expr)::type with template

[Bug c++/49823] New: [C++0x] ICE on decltype(expr)::type with template

[Bug c++/49834] New: type deduction in for-each loop in template function

[Bug c++/49837] File with UTF-8 BOM, included from pch, caused compilation error

[Bug c++/49837] New: File with UTF-8 BOM, included from pch, caused compilation error

[Bug c++/49838] [C++0x] ICE in cp_parser_perform_range_for_lookup, at cp/parser.c:8796

[Bug c++/49838] New: [C++0x] ICE in cp_parser_perform_range_for_lookup, at cp/parser.c:8796

[Bug c++/49850] Implicit creation of a temporary object when a constant reference is passed as parameter and the actual and formal types are not identical

[Bug c++/49850] New: Implicit creation of a temporary object when a constant reference is passed as parameter and the actual and formal types are not identical

[Bug c++/49852] [4.7 Regression] cp-demangle.c segfault

[Bug c++/49852] New: [4.7 Regression] cp-demangle.c segfault

[Bug c++/49855] New: internal compiler error: in fold_convert_const_int_from_real

[Bug c++/49867] [C++0x] ICE on lambda inside switch with case labels in the lambda

[Bug c++/49867] New: [C++0x] ICE on lambda inside switch with case labels in the lambda

[Bug c++/49894] New: Uniform initialization in constructor (C++0x)

[Bug c++/49894] Uniform initialization in constructor (C++0x)

[Bug c++/49896] New: undefined reference to static const integral member whose address is not used, for some values of the constant

[Bug c++/49896] undefined reference to static const integral member whose address is not used, for some values of the constant

[Bug c++/49902] [C++0x] ICE in gimple_expand_cfg when initializer_list constructed using constructor parameters.

[Bug c++/49902] New: [C++0x] ICE in gimple_expand_cfg when initializer_list constructed using constructor parameters.

[Bug c++/49910] New: "internal compiler error: in redirect_jump, at jump.c:1485" when build ppl-0.11.2

[Bug c++/49912] ICE from -freorder-blocks-and-partition : verify_flow_info failed

[Bug c++/49912] New: ICE from -freorder-blocks-and-partition : verify_flow_info failed

[Bug c++/49913] ICE from -O2 -fgraphite-identity : extract_range_from_binary_expr, at tree-vrp.c:2318

[Bug c++/49913] New: ICE from -O2 -fgraphite-identity : extract_range_from_binary_expr, at tree-vrp.c:2318

[Bug c++/49917] g++.dg/init/for1.C wrong?

[Bug c++/49917] New: g++.dg/init/for1.C wrong?

[Bug c++/49919] New: problem with building gcc 4.6.1 on Mac OS X Lion

[Bug c++/49921] [C++0x] Segfault during compilation, decltype and operator->*

[Bug c++/49921] New: Segfault during compilation, decltype and operator->*

[Bug c++/49921] Segfault during compilation, decltype and operator->*

[Bug c++/49924] New: [C++0X] [constexpr] can't initialize a non-static member array of a literal type as a constexpr

[Bug c++/6709] [DR743] decltype cannot be used with the :: operator

[Bug c/35634] [4.4/4.5/4.6/4.7 Regression] operand of pre-/postin-/decrement not promoted

[Bug c/40528] Add a new ifunc attribute

[Bug c/42146] ICE in tree_low_cst

[Bug c/43772] Errant -Wlogical-op warning when testing limits

[Bug c/48388] libgcc compilation causes a segfault

[Bug c/48778] gcc 4.6 -Waddress adds unhelpful new warning case when using from a macro

[Bug c/48910] Current working directory in system include search path

[Bug c/49017] [avr] -ffunction-sections causes linker to fail

[Bug c/49120] [4.5 Regression] bogus "value computed is not used" warning (variable-length array in compound statement)

[Bug c/49595] on amd64, sizeof(__int128_t) > sizeof(intmax_t)

[Bug c/49617] gcc misses uninititialized variables in contained functions

[Bug c/49617] New: gcc misses uninititialized variables in contained functions

[Bug c/49620] New: piece of code from modification to dvblast but cant get it to compile and run correctly

[Bug c/49620] piece of code from modification to dvblast but cant get it to compile and run correctly

[Bug c/49622] Compiler segfault

[Bug c/49622] New: Compiler segfault

[Bug c/49626] Explicit conversion skipped when followed by conversion to a wider type

[Bug c/49633] New: GCC -march=native on Intel Sandy Bridge causes some 'invalid opcode'

[Bug c/49642] constant part of a macro not optimized away as expected due to splitter

[Bug c/49642] New: constant part of a macro not optimized away as expected due to splitter

[Bug c/49644] [ 4.5/4.6 Regression ] post-increment of promoted to complex operand is incorrect.

[Bug c/49644] [4.5 Regression] post-increment of promoted operand is incorrect.

[Bug c/49644] [4.5/4.6 Regression] post-increment of promoted operand is incorrect.

[Bug c/49644] [4.5/4.6/4.7 Regression] post-increment of promoted operand is incorrect.

[Bug c/49644] New: [ 4.5/4.6 Regression ] post-increment of promoted operand is incorrect.

[Bug c/49652] New: SIGFPE in vector_alignment_reachable_p

[Bug c/49652] SIGFPE in vector_alignment_reachable_p

[Bug c/49653] New: Undefined reference to inlined function with -O0,-std=c99

[Bug c/49653] Undefined reference to inlined function with -O0,-std=c99

[Bug c/49654] Linear search through options in handle_pragma_diagnostic

[Bug c/49654] New: Linear search through options in handle_pragma_diagnostic

[Bug c/49655] diagnostic pragma accepts non-warning options

[Bug c/49655] New: diagnostic pragma accepts non-warning options

[Bug c/49656] New: internal compiler error on Mac OS 10.7.0

[Bug c/49674] Improve documentation for __attribute__ __section__

[Bug c/49674] New: Improve documentation for __attribute__ __section__

[Bug c/49685] libgcc_s.so not compiled without optimization when requested

[Bug c/49685] New: libgcc_s.so not compiled without optimization when requested

[Bug c/49702] New: Undefined static functions resolve to external definitions

[Bug c/49702] Undefined static functions resolve to external definitions

[Bug c/49705] New: -Wstrict-overflow should not diagnose unevaluated expressions

[Bug c/49706] New: No warning for (!x > 1) which is always false

[Bug c/49706] No warning for (!x > 1) which is always false

[Bug c/49710] New: segfault

[Bug c/49712] New: internal compiler error: in gen_lsm_tmp_name, at tree-ssa-loop-im.c:2048

[Bug c/49716] internal compiler error: in new_Cloog_Domain_from_ppl_Pointset_Powerset

[Bug c/49716] New: internal compiler error: in new_Cloog_Domain_from_ppl_Pointset_Powerset

[Bug c/49743] New: -g enables var_tracking on -O0 - causes long compilations

[Bug c/49748] char * const * cannot be assigned to char const * const *

[Bug c/49748] New: char * const * cannot be assigned to char const * const *

[Bug c/49754] Let gcc warn about all uninitialized variables

[Bug c/49754] New: Let gcc warn about all uninitialized variables

[Bug c/49768] [4.6/4.7 Regression] C99 style union initializations does not work as expected with optimizations

[Bug c/49768] C99 style union initializations does not work as expected with optimizations

[Bug c/49768] New: C99 style union initializations does not work as expected with optimizations

[Bug c/49769] Configuration mismatch -- extra parts

[Bug c/49769] New: Configuration mismatch -- extra parts

[Bug c/49779] New: Wrong code generated for while loop with guard containing continue

[Bug c/49779] Wrong code generated for while loop with guard containing continue

[Bug c/49801] df_live_verify_transfer_functions fails with to use of CC_REGNUM and checking enabled in rx backend

[Bug c/49801] New: df_live_verify_transfer_functions fails with to use of CC_REGNUM and checking enabled in rx backend

[Bug c/49820] Explicit check for integer negative after abs optimized away

[Bug c/49820] New: Explicit check for integer negative after abs optimized away

[Bug c/49848] False positive warning triggered by -Wmaybe-uninitialized

[Bug c/49848] New: False positive warning triggered by -Wmaybe-uninitialized

[Bug c/49859] gcc could warn about statements between "switch" and first "case"

[Bug c/49859] New: gcc could warn about statements between "switch" and first "case"

[Bug c/49861] Cross compile for mingw32, All executable file can not start up, lead crash!

[Bug c/49861] New: Cross compile for mingw32, All executable file can not start up, lead crash!

[Bug c/49863] -Wunused-result not behaving correctly

[Bug c/49863] New: -Wunused-result not behaving correctly

[Bug c/49874] [h8300] ICE in compute_frame_pointer_to_fb_displacement, at dwarf2out.c:16312

[Bug c/49874] New: [h8300] ICE in compute_frame_pointer_to_fb_displacement, at dwarf2out.c:16312

[Bug c/49877] New: [h8300] ICE in in reload_cse_simplify_operands: insn does not satisfy its constraints

[Bug c/49878] New: [h8300] ICE in based_loc_descr, at dwarf2out.c:10478

[Bug c/49879] [h8300] ICE in maybe_record_trace_start, at dwarf2cfi.c:2439

[Bug c/49879] New: [h8300] ICE in maybe_record_trace_start, at dwarf2cfi.c:2439

[Bug c/49897] New: nesting lastprivate gives incorrect result

[Bug c/49898] New: nested reduction on #pragma omp for gives incorrect result

[Bug c/49905] New: Better sanity checking on sprintf src & dest to produce warning for dodgy code ?

[Bug c/49915] Function call with 2-D arrays and -O2 (or strict-aliasing and inlining) gives random results

[Bug c/49915] New: Function call with 2-D arrays and -O2 (or strict-aliasing and inlining) gives random results

[Bug c/49923] __attirubte__((packed)) on ARM is sometimes dropped

[Bug c/49923] New: __attirubte__((packed)) on ARM is sometimes dropped

[Bug c/49926] New: ice in process_use, at tree-vect-stmts.c:405

[Bug c/7652] -Wswitch-break : Warn if a switch case falls through

[Bug debug/42278] [4.4 Regression] incorrect dwarf data gcc-4.4.2

[Bug debug/44171] gcc -gdwarf-2 -dA unconditionally emits .ascii

[Bug debug/47393] g++.dg/debug/dwarf2/icf.C FAILs on IRIX

[Bug debug/48220] DW_OP_GNU_entry_value/DW_TAG_GNU_call_site_parameter vs register window

[Bug debug/49130] discrepancies between DW_AT_name and demangler

[Bug debug/49262] 3-yr-old infinite loop in dwarf2out.c

[Bug debug/49364] [4.7 regressions] Empty .debug_abbrev sections confuse SGI nm

[Bug debug/49408] member function template id not matching linkage name

[Bug debug/49496] [4.7 Regression] -fcompare-debug failure (length) with -O -ftree-vectorize

[Bug debug/49522] Divide by zero in validate_subreg in emit-rtl.c:695

[Bug debug/49546] class DW_AT_name does not match method's linkage name prefix

[Bug debug/49602] [4.7 Regression] verify_ssa failed (definition does not dominate use) with "-O2 -g"

[Bug debug/49676] inefficiency: DW_AT_GNU_call_site_value calculates everything << 32

[Bug debug/49676] New: inefficiency: DW_AT_GNU_call_site_value calculates everything << 32

[Bug debug/49750] New: -gdwarf-4 bug

[Bug debug/49815] [4.7 regression] ICE in cselib_record_set, at cselib.c:2241 compiling 64-bit libjava on SPARC

[Bug debug/49825] [4.7 Regression] Many testcase failures

[Bug debug/49827] [4.7 regression] sparc64-linux and arm-linux-gnueabi bootstrap failures due to ICE in dwarf2cfi.c connect_traces

[Bug debug/49827] [4.7 regression] sparc64-linux and cris-elf bootstrap failures due to ICE in dwarf2cfi.c connect_traces

[Bug debug/49828] New: reversed order of inlined function parameters

[Bug debug/49828] reversed order of inlined function parameters

[Bug debug/49830] [4.7 regression] m68k-linux bootstrap failure due to ICE in dwarf2out_notice_stack_adjust

[Bug debug/49831] arm-linux-gnueabi bootstrap failures due to ICE in dwarf2cfi.c connect_traces

[Bug debug/49831] New: arm-linux-gnueabi bootstrap failures due to ICE in dwarf2cfi.c connect_traces

[Bug debug/49841] [4.7 regression] AIX bootstrap failure in dwarf2cfi.c:maybe_record_trace_start

[Bug debug/49841] New: dwarf2cfi ICE during bootstrap on AIX

[Bug debug/49846] entryval: missing DW_TAG_GNU_call_site_parameter for stack-passed `double' parameter

[Bug debug/49846] New: entryval: missing DW_TAG_GNU_call_site_parameter for stack-passed `double' parameter

[Bug debug/49864] ICE: in maybe_record_trace_start, at dwarf2cfi.c:2439

[Bug debug/49864] New: ICE: in maybe_record_trace_start, at dwarf2cfi.c:2439

[Bug debug/49871] -gdwarf-3 creates invalid DWARF3 with DW_AT_data_member_location attribute

[Bug debug/49871] New: -gdwarf-3 creates invalid DWARF3 with DW_AT_data_member_location attribute

[Bug debug/49887] [4.7 regression] .debug_macro breaks many Solaris/SPARC tests

[Bug debug/49887] New: [4.7 regression] .debug_macro breaks many Solaris/SPARC tests

[Bug debug/49888] New: VTA: -O2 -g variable value changes, it does not change in the source

[Bug debug/49901] gfortran.dg/debug/[pr35154-dwarf2.f/pr37738.f] failures on darwin

[Bug debug/49906] New: wrong .debug_line for -O0 -g prologue skip

[Bug driver/40227] Solaris standard link libraries missing /lib

[Bug driver/45508] Does adding configure-options for specs-hardcoding make sense?

[Bug driver/46944] gcc should accept -fuse-linker-plugin only if linker handles -plugin

[Bug driver/49631] Driver --help should use common help code

[Bug driver/49631] New: Driver --help should use common help code

[Bug driver/49726] -g0 file.S -g does not produce debug info

[Bug driver/49726] New: -g0 file.S -g does not produce debug info

[Bug driver/49747] New: warning:dereferencing type-punned pointer will break strict-aliasing rules

[Bug driver/49747] warning:dereferencing type-punned pointer will break strict-aliasing rules

[Bug driver/49858] lost ability to use driver for external language support?

[Bug driver/49858] New: lost ability to use driver for external language support?

[Bug fortran/18918] Eventually support Fortran 2008's coarrays [co-arrays]

[Bug fortran/25829] [F2003] Asynchronous IO support

[Bug fortran/29383] Fortran 2003/F95[TR15580:1999]: Floating point exception (IEEE) support

[Bug fortran/31067] MINLOC should sometimes be inlined (gas_dyn is sooooo sloooow)

[Bug fortran/34657] program-unit MY_SUB imports symbol MY_SUB

[Bug fortran/38913] Fortran does not set TYPE_CANONICAL properly

[Bug fortran/40054] [F08] Pointer functions as lvalue

[Bug fortran/40766] this fortran program is too slow

[Bug fortran/43366] [OOP][F2008] Intrinsic assign to polymorphic variable

[Bug fortran/44352] ICE in string_to_single_character

[Bug fortran/45170] [F2003] allocatable character lengths

[Bug fortran/45586] [4.6/4.7 Regression] ICE non-trivial conversion at assignment

[Bug fortran/45859] [Coarray, F2008, IR] Rejects valid actuals to coarray dummies

[Bug fortran/46703] Wrong I/O output (only) when running under valgrind

[Bug fortran/47659] -Wconversion[-extra] should emit warning for constant expressions

[Bug fortran/47720] problems with makefile dependency generation using -M

[Bug fortran/48351] [OOP] Realloc on assignment fails if parent component is CLASS

[Bug fortran/48718] gfortran crash

[Bug fortran/48858] Incorrect error for same binding label on two generic interface specifics

[Bug fortran/48864] -Ofast should imply -fno-protect-parens

[Bug fortran/48876] ICE when initializing character variable with zero-length string

[Bug fortran/48923] Type with Allocatable Length Character Component

[Bug fortran/48926] gfortran.dg/coarray/image_index_1.f90 -fcoarray=single -O2 (test for excess errors)

[Bug fortran/49025] gfortran bug: Local variable does not hide generic procedure.

[Bug fortran/49112] [4.6/4.7 Regression] [OOP] Missing type-bound procedure, "duplicate save" warnings and internal compiler error

[Bug fortran/49138] Add /usr/include/fortran/{,gcc-<version>} to the file/module search path

[Bug fortran/49149] Dependency autogeneration with `-M` rendered useless by requiring .mod files

[Bug fortran/49271] Compiler crashed and asked me to submit a report

[Bug fortran/49297] ICE gfc_conv_component_ref, at fortran/trans-expr.c:268 when compiling molcas7.6

[Bug fortran/49324] Deep copy missing for array constructors of DT w/ allocatable components

[Bug fortran/49438] error during make

[Bug fortran/49466] [4.6/4.7 Regression] Memory leak with assignment of extended derived types

[Bug fortran/49475] [OOP][debugging] Add DWARF info for Fortran's OOP features (extension, member functions)

[Bug fortran/49479] [4.6/4.7 Regression] reshape / optionals / zero sized arrays

[Bug fortran/49501] support ATTRIBUTES ALIGN in gfortran

[Bug fortran/49540] [4.6 Regression] Memory-hog with large DATA stmt

[Bug fortran/49562] [4.6/4.7 Regression] [OOP] assigning value to type-bound function

[Bug fortran/49597] gfortran namelist read bug

[Bug fortran/49623] New: Segfault of "gfortran -L" if no argument follows the "-L"

[Bug fortran/49623] Segfault of "gfortran -L" if no argument follows the "-L"

[Bug fortran/49624] ICE with pointer-bound remapping

[Bug fortran/49624] New: ICE with pointer-bound remapping

[Bug fortran/49627] New: NINT(x,16) doesn't work (at all, ever, I don't think)

[Bug fortran/49627] NINT(x,16) doesn't work (at all, ever, I don't think)

[Bug fortran/49630] [OOP] ICE on obsolescent deferred-length type bound character function

[Bug fortran/49630] New: [OOP] ICE on obsolescent assumed length deferred type bound character function

[Bug fortran/49636] Associate construct confused with slightly complicated case

[Bug fortran/49636] New: Associate construct confused with slightly complicated case

[Bug fortran/49638] [OOP] length parameter is ignored when overriding type bound character functions with constant length.

[Bug fortran/49638] New: [OOP] length parameter is ignored when overriding type bound character functions with constant length.

[Bug fortran/49648] ICE(segfault) with MATHMUL and function-result actual argument

[Bug fortran/49648] ICE(segfault) with MATMUL and function-result actual argument

[Bug fortran/49648] New: ICE(segfault) with MATHMUL and function-result actual argument

[Bug fortran/49659] If-and-condition not obeyed using the g77-compiler (Windows 7, 64-bit).

[Bug fortran/49659] New: If-and-condition not obeyed using the g77-compiler (Windows 7, 64-bit).

[Bug fortran/49675] New: jacobi.F90:90:0: internal compiler error: Segmentation fault

[Bug fortran/49683] New: The system cannot execute the specified program

[Bug fortran/49683] The system cannot execute the specified program

[Bug fortran/49690] [4.6 regression] ICE in gfc_typenode_for_spec, at fortran/trans-types.c:1019

[Bug fortran/49690] [4.6/4.7 regression] ICE in gfc_typenode_for_spec, at fortran/trans-types.c:1019

[Bug fortran/49690] New: [4.6 regression] ICE in gfc_typenode_for_spec, at fortran/trans-types.c:1019

[Bug fortran/49693] New: Spurious "unused-variable" warnings for COMMON block module variables.

[Bug fortran/49698] New: Unmanageable compiler error

[Bug fortran/49698] Unmanageable compiler error

[Bug fortran/49708] [4.5/4.6/4.7 Regression] ICE with allocate and no dimensions

[Bug fortran/49708] New: internal compiler error with allocate and no dimensions

[Bug fortran/49738] Compile errors on OSX darwin 11 (Lion)

[Bug fortran/49738] New: Compile errors on OSX darwin 11 (Lion)

[Bug fortran/49755] ALLOCATE with STAT= produces invalid code for already allocated vars

[Bug fortran/49755] New: ALLOCATE with STAT= produces invalid code for already allocated vars

[Bug fortran/49766] New: Fortran w/ CPP: Add tracking locations of tokens resulting from macro expansion

[Bug fortran/49792] New: OpenMP workshare: Wrong result with array assignment

[Bug fortran/49802] [F2003, F2008] Wrong code with VALUE, F2008: VALUE with arrays/DIMENSION

[Bug fortran/49802] [F2008] Handle VALUE with arrays (DIMENSION)

[Bug fortran/49802] New: [F2008] Handle VALUE with arrays (DIMENSION)

[Bug fortran/49885] [4.6/4.7 Regression] Segmentation fault when writing to an automatic character array

[Bug fortran/49901] gfortran.dg/debug/[pr35154-dwarf2.f/pr37738.f] failures on darwin

[Bug fortran/49901] New: gfortran.dg/debug/[pr35154-dwarf2.f/pr37738.f] failures on darwin

[Bug fortran/49918] New: Spurious -Wconvert warnings when using a BOZ data statement

[Bug fortran/49918] Spurious -Wconvert warnings when using a BOZ data statement

[Bug gcov-profile/49922] New: I try to build libgmp using PGO and lto, but the test will result in "internal compiler error"

[Bug go/48223] gob/check fails on Solaris 2

[Bug go/49889] New: Calling a function whose name is obscured by a local variable does not produce an error

[Bug inline-asm/29357] inline asm %c0 template form not documented

[Bug inline-asm/32811] Cannot flag inline assembler code "noreturn"

[Bug inline-asm/38804] libgcj multilib fails if not able to exec "non" native programs

[Bug inline-asm/49611] Inline asm should support input/output of flags

[Bug inline-asm/49611] New: Inline asm should support input/output of flags

[Bug java/29414] Issues building GNU java on Solaris2.10 X64

[Bug java/49634] New: Dead Java driver code for @FILE handling

[Bug java/49635] New: Odd Java -extdirs / --extdirs handling

[Bug java/49847] New: m68k gcj-4.6 NULL deref in fold_rtx (prev_insn_cc0 == NULL)

[Bug libffi/11398] libffi doesn't support 128-bit long double on Tru64 UNIX V5

[Bug libffi/46660] cls_double_va.c, cls_longdouble_va.c FAIL on IRIX 6.5

[Bug libffi/49594] bootstrap failure in libffi:darwin_closure for powerpc-darwin8

[Bug libfortran/48787] Invalid UP/DOWN rounding with F editing

[Bug libfortran/48906] Wrong rounding results with -m32

[Bug libfortran/48926] gfortran.dg/coarray/image_index_1.f90 -fcoarray=single -O2 (test for excess errors)

[Bug libfortran/49296] [4.6/4.7 Regression] Wrong END OF FILE error for list-directed I/O with strings

[Bug libfortran/49791] [4.4/4.5/4.6/4.7 Regression] Formatted namelist reads fails with: Cannot match namelist object

[Bug libfortran/49791] New: [4.6 Regression] Formatted namelist reads of arrays don't work

[Bug libfortran/49885] [4.6/4.7 Regression] Segmentation fault when writing to an automatic character array

[Bug libfortran/49885] New: Segmentation fault when writing to an automatic character array

[Bug libgcj/40947] Invalid flag usage: Wl,-rpath, -Wx,-option must appear after -_SYSTYPE_SVR4

[Bug libgcj/43447] TestLeak.exe test consumes all available memory on 64-bit Solaris 2

[Bug libgcj/49455] Thread_Interrupt Looper subtest FAILs on IRIX

[Bug libgcj/49456] getstacktrace and getallthreads tests timeout on IRIX

[Bug libgomp/32013] Use posix95 for libgomp on Irix 6.2

[Bug libgomp/36208] Boolean type discrepancy between gfortran and libgomp

[Bug libgomp/42616] OMP'ed loop inside pthread leads to crash.

[Bug libgomp/44093] Linking libgomp.so fails on Solaris 9/x86 with Sun as: relocations remain

[Bug libgomp/45351] many unaligned accesses in libgomp tests

[Bug libgomp/48841] [regression] lot more libgomp testsuite failures compared to 4.4.5

[Bug libgomp/49613] Error with OpenMP / gomp and gcc detected by valgrind

[Bug libgomp/49613] New: Error with OpenMP / gomp and gcc detected by valgrind

[Bug libmudflap/14118] h8300-elf, avr-elf, m68k-elf ports cannot build libmudflap

[Bug libmudflap/15174] libmudflap doesn't compile on Tru64 UNIX

[Bug libmudflap/49549] Use of --noinhibit-exec is unportable

[Bug libmudflap/49550] Many libmudflap tests fail on Solaris 11/x86

[Bug libmudflap/49843] New: 64-bit libmudflap.c++/pass55-frag.cxx FAILs at -O

[Bug libobjc/49804] New: regression gcc4.7 from 20110709 to 20110716 on ia64, sparc64 freebsd9.0 Configuration mismatch! [libgcc-extra-parts] Error

[Bug libobjc/49804] regression gcc4.7 from 20110709 to 20110716 on ia64, sparc64 freebsd9.0 Configuration mismatch! [libgcc-extra-parts] Error

[Bug libobjc/49882] New: class_getSuperClass() returns nil on a newly allocated, but not registered, class

[Bug libobjc/49883] clang + gcc 4.6 runtime = broken

[Bug libobjc/49883] New: clang + gcc 4.6 runtime = broken

[Bug libstdc++/1773] __cplusplus defined to 1, should be 199711L

[Bug libstdc++/36231] ostream includes unistd.h outside namespace std, polluting

[Bug libstdc++/43785] [C++0x] std::make_pair vs explicit template arguments

[Bug libstdc++/48430] std::hash partial specialization for std::unique_ptr and std::shared_ptr are using unary_function

[Bug libstdc++/48882] ?: ternary operator fails in certain contexts - compile error

[Bug libstdc++/48882] [C++0x] ?: ternary operator fails in certain contexts - compile error

[Bug libstdc++/49293] 22_locale/time_get/get_weekday/char/38081-[12].cc fail with glibc 2.14

[Bug libstdc++/49559] [C++0x] stable_sort calls self-move-assignment operator

[Bug libstdc++/49607] [4.7 Regression] FAIL: 22_locale/time_get/get_weekday/wchar_t/wrapped_locale.cc

[Bug libstdc++/49607] New: [4.7 Regression] FAIL: 22_locale/time_get/get_weekday/wchar_t/wrapped_locale.cc

[Bug libstdc++/49668] [C++0x] std::thread does not forward its args as rvalues

[Bug libstdc++/49668] New: [C++0x] std::thread does not forward its args as rvalues

[Bug libstdc++/49717] Debug version checking algorithmic preconditions may have different complexity

[Bug libstdc++/49717] New: Debug version checking algorithmic preconditions may have different complexity

[Bug libstdc++/49745] error: âint truncateâ redeclared as different kind of symbol

[Bug libstdc++/49762] New: symbols not kept in std namespace

[Bug libstdc++/49762] symbols not kept in std namespace

[Bug libstdc++/49778] Can't take pointer to std::make_pair in c++0x

[Bug libstdc++/49778] New: Can't take pointer to std::make_pair in c++0x

[Bug libstdc++/49813] [C++0x] sinh vs asinh vs constexpr

[Bug libstdc++/49818] libsupc++ does not export __cxa_get_globals or related functions

[Bug libstdc++/49818] New: libsupc++ does not export __cxa_get_globals or related functions

[Bug libstdc++/49836] [C++0x] vector<T>::push_back() should not require T to be (move-)assignable

[Bug libstdc++/49836] New: vector<T>::push_back() should not require T to be (move-)assignable

[Bug libstdc++/49870] New: regex_match vs. "^"

[Bug libstdc++/49870] regex_match vs. "^"

[Bug libstdc++/49925] [C++0x] ADL bug mixing boost::shared_ptr and std::make_shared<>

[Bug libstdc++/49925] ADL bug mixing boost::shared_ptr and std::make_shared<>

[Bug libstdc++/49925] New: ADL bug mixing boost::shared_ptr and std::make_shared<>

[Bug lto/46798] [4.6 Regression] invalid conversion in gimple call; verify_stmts failed

[Bug lto/46798] [4.6/4.7 Regression] invalid conversion in gimple call; verify_stmts failed

[Bug lto/47889] [4.6/4.7 Regression] Segmentation fault in useless_type_conversion_p, at tree-ssa.c:1228

[Bug lto/47936] [4.6/4.7 Regression] Missed optimization with LTO due to strict aliasing issues

[Bug lto/48065] LTO: assertion failed in optimize_inline_calls, at tree-inline.c:4246

[Bug lto/48851] lto-plugin.c:224:7: error: missing sentinel in function call [-Werror=format]

[Bug lto/49612] LTO cannot link objects

[Bug lto/49612] New: LTO cannot link objects

[Bug lto/49664] liblto_plugin.so exports too many symbols

[Bug lto/49664] New: liblto_plugin.so exports too many symbols

[Bug lto/49677] New: GCC 4.6.0 LTO files not compatible with GCC 4.6.1

[Bug lto/49697] New: read permission of LTO intermediate files

[Bug lto/49697] read permission of LTO intermediate files

[Bug lto/49700] LTO compile time hog

[Bug lto/49700] New: LTO compile time hog

[Bug lto/49703] -flto makes stack executable by default

[Bug lto/49703] -flto makes stack executable by default with GNU ld linker plugin

[Bug lto/49703] New: -flto makes stack executable by default

[Bug lto/49796] [4.7 Regression] 483.xalancbmk/447.dealII in SPEC CPU 2006 failed to build

[Bug lto/49796] New: [4.7 Regression] 483.xalancbmk/447.dealII in SPEC CPU 2006 failed to build

[Bug lto/49844] Building CodeBlocks on Windows using mingw gcc 4.6.1 "-flto -fuse-linker-plugin" results in many linker stage errors

[Bug lto/49844] New: Building CodeBlocks on Windows using mingw gcc 4.6.1 "-flto -fuse-linker-plugin" results in many linker stage errors

[Bug middle-end/18908] Missed folding opportunities with bools

[Bug middle-end/23830] inline optimization possibility - reorder compilation step

[Bug middle-end/31531] A microoptimization of isnegative of signed integer

[Bug middle-end/31827] limits-exprparen.c: Pid 2297 received a SIGSEGV for stack growth failure

[Bug middle-end/32074] Optimizer does not exploit assertions

[Bug middle-end/32791] missed optimization after inline functions with multiple return statements

[Bug middle-end/33970] Missed optimization using unsigned char loop variable

[Bug middle-end/35700] Problems compiling applications with -pg option using gcc 3.4.4 compiler.

[Bug middle-end/43460] internal compiler error: Segmentation fault on __builtin_unreachable() after asm goto()

[Bug middle-end/43513] The stack pointer is adjusted twice

[Bug middle-end/43690] [4.4 Regression] Internal compiler error detected by avr-gcc.

[Bug middle-end/44071] ICE with asm goto and __builtin_unreachable()

[Bug middle-end/44382] Slow integer multiply

[Bug middle-end/45098] Missed induction variable optimization

[Bug middle-end/45214] Poor initial RTL for bitfield operations

[Bug middle-end/45819] [4.5 Regression] unexpected unaligned access to volatile int

[Bug middle-end/46851] ICE: in compute_affine_dependence, at tree-data-ref.c:3897 with -fcheck-data-deps

[Bug middle-end/47046] gcc.target/i386/sse4_1-movntdqa.c ICEs with -fgraphite-identity

[Bug middle-end/47048] misc vect.exp failures with -fgraphite-identity enabled at -O2.

[Bug middle-end/47089] ICE: in gimple_redirect_edge_and_branch_force, at tree-cfg.c:5003 with -O -fgraphite-identity

[Bug middle-end/47092] [4.6/4.7 Regression] gfortran.fortran-torture/execute/forall_4.f90 is VERY slow with -fgraphite-identity

[Bug middle-end/47128] gcc.dg/graphite/pr43012.c ICEs with cloog-parma

[Bug middle-end/47383] ivopts miscompiles Pmode != ptr_mode

[Bug middle-end/47406] gcc.dg/torture/builtin-modf-1.c FAILs on IRIX 6.5

[Bug middle-end/47593] gcc.dg/torture/pta-ptrarith-2.c execution tests fail with -fgraphite-identity

[Bug middle-end/47594] gfortran.dg/vect/vect-5.f90 execution test fails when compiled with -O2 -fgraphite-identity at -m64

[Bug middle-end/47653] [4.6/4.7 Regression] gcc.c-torture/execute/930614-2.c FAILs with -fstack-check=generic -fgraphite-identity

[Bug middle-end/47654] [4.6/4.7 Regression] gcc.dg/vect/no-section-anchors-vect-outer-4h.c FAILs with -floop-block

[Bug middle-end/47691] [4.6/4.7 Regression] ICE: in create_linear_expr_from_tree, at graphite-sese-to-poly.c:1138 with -fgraphite-identity -ffast-math -fno-tree-scev-cprop

[Bug middle-end/47725] [x32] error: unable to find a register to spill in class DIREG

[Bug middle-end/47727] [x32] Many passes can't handle const symbol when Pmode != ptr_mode

[Bug middle-end/48016] Inconsistency in non-local goto save area

[Bug middle-end/48470] ICE in expand_expr_addr_expr_1 at expr.c:6835

[Bug middle-end/48779] -Wunused-but-set-variable does not report unread unit-static variables

[Bug middle-end/48812] optimizing integer power of 2

[Bug middle-end/48833] gcc.c-torture/execute/pr34415.c FAILs with -flto -fipa-cp-clone -fno-merge-constants

[Bug middle-end/48973] [4.4/4.5 Regression] Inliner bug with one-bit (1-bit) bitfield

[Bug middle-end/48984] [4.7 Regression] Many testsuite failures

[Bug middle-end/49012] weak const optimisations

[Bug middle-end/49029] [4.6/4.7 Regression] ICE in simplify_subreg, at simplify-rtx.c:5266

[Bug middle-end/49054] useless cmp+jmp generated for switch when "default:" is unreachable

[Bug middle-end/49139] always_inline attribute inconsistencies on failure

[Bug middle-end/49310] [4.7 Regression] Compile time hog in var-tracking emit

[Bug middle-end/49319] [4.7 regression] g++.dg/abi/thunk5.C FAILs on Tru64 UNIX

[Bug middle-end/49363] [feature request] multiple target attribute (and runtime dispatching based on cpuid)

[Bug middle-end/49463] [4.7 Regression] LTO doesn't work symbol renamed via asm statement

[Bug middle-end/49491] Superfluous move because of unnecessary spill for 2-operand insn

[Bug middle-end/49495] -O3 causes error message "edge points to wrong declaration:"

[Bug middle-end/49519] [4.7 Regression] Revision 175272 miscompiled 447.dealII in SPEC CPU 2006

[Bug middle-end/49545] [4.6 Regression] New C++ test failures

[Bug middle-end/49545] [4.7 Regression] New C++ test failures

[Bug middle-end/49596] [4.7 Regression] FAIL: gcc.dg/torture/pr43879_1.c

[Bug middle-end/49602] [4.7 Regression] verify_ssa failed (definition does not dominate use) with "-O2 -g"

[Bug middle-end/49603] [4.7 Regression] 177.mesa in SPEC CPU 2000 failed to build

[Bug middle-end/49603] New: [4.7 Regression] 177.mesa in SPEC CPU 2000 failed to build

[Bug middle-end/49628] [4.7 Regression] 447.dealII in SPEC CPU 2006 failed to build

[Bug middle-end/49628] New: [4.7 Regression] 447.dealII in SPEC CPU 2006 failed to build

[Bug middle-end/49629] [4.7 Regression] ICE: in df_refs_verify, at df-scan.c

[Bug middle-end/49629] New: [4.7 Regression] ICE: in df_refs_verify, at df-scan.c

[Bug middle-end/49640] Internal compiler in C99 code (using variable-length arrays) and OpenMP

[Bug middle-end/49640] New: Internal compiler in C99 code (using variable-length arrays) and OpenMP

[Bug middle-end/49649] [4.7 Regression] FAIL: libgomp.graphite/force-parallel-1.c

[Bug middle-end/49649] New: [4.7 Regression] FAIL: libgomp.graphite/force-parallel-1.c

[Bug middle-end/49662] [4.7 Regression] FAIL: gcc.dg/graphite/interchange-XX.c

[Bug middle-end/49662] New: [4.7 Regression] FAIL: gcc.dg/graphite/interchange-XX.c

[Bug middle-end/49671] [4.6/4.7 Regression] volatile goes missing after inlining

[Bug middle-end/49671] New: volatile goes missing after inlining

[Bug middle-end/49675] [4.6/4.7 Regression] ICE (segfault) with -finstrument-functions

[Bug middle-end/49699] Aligned load on unaligned address

[Bug middle-end/49705] -Wstrict-overflow should not diagnose unevaluated expressions

[Bug middle-end/49711] [4.7 Regression] 186.crafty in SPEC CPU 2000 failed to build

[Bug middle-end/49711] New: [4.7 Regression] 186.crafty in SPEC CPU 2000 failed to build

[Bug middle-end/49719] [4.7 Regression] test gcc.target/arm/sibcall-1.c fails for ARM

[Bug middle-end/49719] New: test gcc.target/arm/sibcall-1.c fails for ARM

[Bug middle-end/49721] convert_memory_address_addr_space may generate invalid new insns

[Bug middle-end/49721] New: convert_memory_address_addr_space may generate invalid new insns

[Bug middle-end/49723] gcc.c-torture/compile/pr46934.c: ICE in do_SUBST, at combine.c:707 at -O1 and above

[Bug middle-end/49723] New: gcc.c-torture/compile/pr46934.c: ICE in do_SUBST, at combine.c:707 at -O1 and above

[Bug middle-end/49731] internal compiler error: verify_gimple failed

[Bug middle-end/49731] New: internal compiler error: verify_gimple failed

[Bug middle-end/49732] [4.6/4.7 regression] crash on terminal_interface-curses-menus.adb from ncurses with -gnato

[Bug middle-end/49733] Missed optimization: Variable value not propagated to remove "if" condition

[Bug middle-end/49733] New: Missed optimization: Variable value not propagated to remove "if" condition

[Bug middle-end/49736] [4.7 Regression] Revision 176228 miscompiled 255.vortex in SPEC CPU 2000

[Bug middle-end/49736] New: [4.7 Regression] Revision 176228 miscompiled 255.vortex in SPEC CPU 2000

[Bug middle-end/49774] New: [meta-bug] restrict qualification aliasing issues

[Bug middle-end/49798] .quad instead of .long is used for address for x32

[Bug middle-end/49798] New: .quad instead of .long is used for address for x32

[Bug middle-end/49805] [4.7 Regression] FAIL: FAIL: gcc.target/i386/andor-2.c scan-assembler-not sete

[Bug middle-end/49805] New: [4.7 Regression] FAIL: FAIL: gcc.target/i386/andor-2.c scan-assembler-not sete

[Bug middle-end/49806] [4.7 Regression] FAIL: gcc.dg/tree-ssa/vrp47.c

[Bug middle-end/49806] New: [4.7 Regression] FAIL: gcc.dg/tree-ssa/vrp47.c

[Bug middle-end/49825] [4.7 Regression] Many testcase failures

[Bug middle-end/49825] New: [4.7 Regression] FAIL: g++.dg/tree-prof/partition2.C

[Bug middle-end/49840] [4.7 Regression] New test failures

[Bug middle-end/49840] New: [4.7 Regression] New test failures

[Bug middle-end/49848] False positive warning triggered by -Wmaybe-uninitialized

[Bug middle-end/49875] FAIL: c-c++-common/cxxbitfields-4.c

[Bug middle-end/49875] New: FAIL: c-c++-common/cxxbitfields-4.c

[Bug middle-end/49876] [4.7 Regression] FAIL: gfortran.dg/graphite/pr43097.f

[Bug middle-end/49876] New: [4.7 Regression] FAIL: gfortran.dg/graphite/pr43097.f

[Bug middle-end/49886] [4.6/4.7 Regression] pass_split_functions cannot deal with function type attributes

[Bug middle-end/49886] New: pass_split_functions cannot deal with function type attributes

[Bug middle-end/49893] [4.7 Regression] -O3 generates wrong code for volatile

[Bug middle-end/49893] New: [4.7 Regression] -O3 generates wrong code for volatile

[Bug middle-end/49897] [4.5 Regression] nesting lastprivate gives incorrect result

[Bug middle-end/49897] [4.5/4.6/4.7 Regression] nesting lastprivate gives incorrect result

[Bug middle-end/49897] nesting lastprivate gives incorrect result

[Bug middle-end/49898] [4.5/4.6/4.7 Regression] nested reduction on #pragma omp for gives incorrect result

[Bug middle-end/49899] New: ICE when redeclaring a static function as weak

[Bug middle-end/49905] Better sanity checking on sprintf src & dest to produce warning for dodgy code ?

[Bug other/32998] -frecord-gcc-switches issues

[Bug other/33426] Support of #pragma ivdep

[Bug other/38266] improper fix to curses.h on irix

[Bug other/39951] Dangling symlink ".../include-fixed/mach" created on install

[Bug other/44476] tclStrToD.c takes very long to compile (forever?)

[Bug other/48922] invalid dwarf2 on ia64 with very old gas

[Bug other/49533] [4.7 regression] Firefox profiled build issues

[Bug other/49533] [4.7 regression] Revision 174989 (ipa-inline-transform.c) regressions

[Bug other/49658] New: Typo in gcc/doc/extend.texi

[Bug other/49658] Typo in gcc/doc/extend.texi

[Bug other/49661] et-forest.h uses extern "C"

[Bug other/49661] New: et-forest.h uses extern "C"

[Bug other/49665] 'defined in discarded section' link failures on cpu2006 benchmarks

[Bug other/49665] New: 'defined in discarded section' link failures on cpu2006 benchmarks

[Bug other/49666] New: passing nested function to inline function causes a trampoline call

[Bug other/49752] [4.7 Regression] Non-existing struct `tree_type' in fold_checksum_tree in fold-const.c, can't build with `--enable-checking=fold'

[Bug other/49752] New: Non-existing struct `tree_type' in fold_checksum_tree in fold-const.c, can't build with `--enable-checking=fold'

[Bug other/49767] __mulsc3 runs into infinite recursion if GCC is compiled with -O0 option

[Bug other/49767] New: __mulsc3 runs into infinite recursion if GCC is compiled with -O0 option

[Bug other/49775] [4.6.1 Regression on AVR] ICE in based_loc_descr

[Bug other/49775] New: [4.6.1 Regression on AVR] ICE in based_loc_descr

[Bug other/49829] New: --disable-static --enable-shared regression: cannot find -lstdc++

[Bug other/49892] Error in configure test xgcc in x86_64-apple-darwin11.0.0/libgcc

[Bug other/49892] New: Error in configure test xgcc in x86_64-apple-darwin11.0.0/libgcc

[Bug other/49914] call to abs(long long) in gcc/fold-const.c

[Bug other/49914] New: call to abs(long long) in gcc/fold-const.c

[Bug plugins/49744] New: Use of prev-gcc/xgcc as PLUGINCC breaks bootstap-lean tests

[Bug plugins/49744] Use of prev-gcc/xgcc as PLUGINCC breaks bootstap-lean tests

[Bug preprocessor/7263] __extension__ keyword doesn't suppress warning on LL or ULL constants

[Bug regression/49498] [4.7 Regression]: gcc.dg/uninit-pred-8_b.c bogus warning line 20

[Bug regression/49500] [4.7 Regression]: gcc.dg/tls/alias-1.c

[Bug regression/49684] New: [4.7 Regression]: build fails on crtstuff.c / crtbegin using default CRT_CALL_STATIC_FUNCTION

[Bug rtl-optimization/11320] [3.3 regression] Scheduler bug

[Bug rtl-optimization/34791] [avr] optimisation of 8-bit logic sometimes fails

[Bug rtl-optimization/36884] ifcvt poor optimization

[Bug rtl-optimization/43088] [avr] Suspect optimizer missed code in gcc 4.4.3..

[Bug rtl-optimization/44194] struct returned by value generates useless stores

[Bug rtl-optimization/47449] [x32] canât find a register in class âDIREGâ while reloading âasmâ

[Bug rtl-optimization/47502] [x32] canât find a register in class âSIREGâ while reloading âasmâ

[Bug rtl-optimization/47556] x86: fails to take advantage of high-byte addressing mode

[Bug rtl-optimization/47918] [4.6/4.7 Regression] noreturn discovery broke non local gotos on m68k

[Bug rtl-optimization/47918] [4.6/4.7 Regression] noreturn discovery broke non local gotos on m68k and i386

[Bug rtl-optimization/47958] [x32] reload generates invalid address reference

[Bug rtl-optimization/48757] [4.5/4.6 Regression] internal compiler error: in compensate_edge, at reg-stack.c:2788

[Bug rtl-optimization/48830] [4.4/4.5/4.6 regression] unrecognized insn: storing invalid upper FP reg in SImode

[Bug rtl-optimization/48840] [4.4/4.5 regression] assertion failure in reload1.c

[Bug rtl-optimization/48932] ICE in check_dep, at sched-deps.c:4097

[Bug rtl-optimization/49014] [4.7 Regression] ICE: in reset_sched_cycles_in_current_ebb, at sel-sched.c:7132 with even more insane set of flags

[Bug rtl-optimization/49145] ICE in simplify_const_unary_operation, at simplify-rtx.c:1322

[Bug rtl-optimization/49169] ARM: optimisations strip the Thumb/ARM mode bit off function pointers

[Bug rtl-optimization/49429] [4.7 Regression] dse.c change (r175063) causes execution failures

[Bug rtl-optimization/49472] [4.7 regression] Compiler segfault on valid code

[Bug rtl-optimization/49474] [4.7 Regression] GCC 4.7-20110618 fails to bootstrap on stage 2: gcc/fortran/resolve.c:5360:1: internal compiler error: vector VEC(edge,base) index domain error, in find_implicit_sets at cprop.c:1346

[Bug rtl-optimization/49474] [4.7 Regression] GCC 4.7-pre fails to bootstrap on stage 2: gcc/fortran/resolve.c:5360:1: internal compiler error: vector VEC(edge,base) index domain error, in find_implicit_sets at cprop.c:1346

[Bug rtl-optimization/49474] [4.7 Regression] ppc ICEs with -O3 (bootstrapping with -O3 and --disable-checking)

[Bug rtl-optimization/49474] [4.7 Regression] ppc ICEs with -O3 (bootstrapping with -O3)

[Bug rtl-optimization/49573] wrong rtl pre transformation

[Bug rtl-optimization/49619] [4.5 Regression] ICE in simplify_subreg, at simplify-rtx.c:5362

[Bug rtl-optimization/49619] [4.5/4.6/4.7 Regression] ICE in simplify_subreg, at simplify-rtx.c:5362

[Bug rtl-optimization/49619] New: ICE in simplify_subreg, at simplify-rtx.c:5362

[Bug rtl-optimization/49646] gcc.dg/pr44194-1.c FAILs on Solaris/SPARC, Tru64 UNIX

[Bug rtl-optimization/49646] New: gcc.dg/pr44194-1.c FAILs on Solaris/SPARC, Tru64 UNIX

[Bug rtl-optimization/49682] [alpha] gcc-4.6.1: ICE at -O2 and -O3

[Bug rtl-optimization/49682] New: [alpha] gcc-4.6.1: ICE at -O2 and -O3

[Bug rtl-optimization/49686] [4.7 Regression] CFI notes are missed for delayed slot

[Bug rtl-optimization/49686] New: [4.7 Regression] CFI notes are missed for delayed slot

[Bug rtl-optimization/49710] [4.7 Regression] segfault

[Bug rtl-optimization/49710] segfault

[Bug rtl-optimization/49720] Infinite recursion compiling gold binary_test.cc testcase

[Bug rtl-optimization/49799] gcc arm generates illegal sbfx instruction

[Bug rtl-optimization/49800] New: segfault with -fsched-pressure -fdump-rtl-sched1

[Bug rtl-optimization/49807] Missed byte (subreg) extraction

[Bug rtl-optimization/49807] Missed byte (subreg) extraction when storing to volatile mem

[Bug rtl-optimization/49807] New: Missed byte (subreg) extraction

[Bug rtl-optimization/49839] New: Use constants in registers preferably to inline constants (-Os)

[Bug rtl-optimization/49884] get_last_value in combine ignores register mode

[Bug rtl-optimization/49884] New: get_last_value in combine ignores register mode

[Bug rtl-optimization/49890] New: IRA spill with plenty of available registers

[Bug rtl-optimization/49891] [4.7 regression] ICE in redirect_jump_1

[Bug rtl-optimization/49891] New: [4.7 regression] ICE in redirect_jump_1

[Bug rtl-optimization/49900] [4.7 regression] ICE in advance_target_bb, at sched-ebb.c:691

[Bug rtl-optimization/49900] New: [4.7 regression] ICE in advance_target_bb, at sched-ebb.c:691

[Bug target/15065] [4.4/4.5/4.6/4.7 Regression] bootstrap fails during bulding libstdc++-v3 on Tru64 V5.0

[Bug target/20020] x86_64 - 128 bit structs not targeted to TImode

[Bug target/23621] gcj-dbtool aborts on m68k-linux

[Bug target/29560] [avr] Poor optimization for byte shifts

[Bug target/34734] attribute((progmem)) not handled properly in C++ for AVRs

[Bug target/34888] Stack patterns for AVR not optimal

[Bug target/36356] gcc-4.2.4 bootstrap failure on Solaris/x86 caused by PR31868 fix

[Bug target/36467] [avr] Missed optimization with pointer arithmetic and mul*

[Bug target/36966] arm iwmmxt builtin problem

[Bug target/3746] compilation of mips-tfile missing mips/a.out.h

[Bug target/38159] [avr] ICE: gcc.c-torture/execute/pr38051.c compilation, -O3 -fomit-frame-pointer -funroll-all-loops -finline-functions

[Bug target/38239] The function mcount in gmon.o changes register ecx

[Bug target/38342] [4.4/4.5/4.6/4.7 Regression] __attribute__((__progmem__)) not propagated from typedef to data

[Bug target/38479] Incorrect dwarf generated for function with parameters greater 4 words in length

[Bug target/38730] gcc 4.4.0 20090104 - "make -i check" - over 60 FAILs in "C" compiler

[Bug target/39186] Configury incorrect for 64-bit Targets on Solaris

[Bug target/39212] ice for AVR target: unable to find a register to spill in class 'POINTER_REGS'

[Bug target/39386] [avr] different computation results for O1 and O0 executables

[Bug target/39633] [avr] loop bug

[Bug target/39633] [avr] loop bug: missing 8-bit comparison (*cmpqi)

[Bug target/39788] Fixincluded header defines __regex_t, other header needs regex_t

[Bug target/39819] [avr] Missed optimisation when setting 4-byte values

[Bug target/40183] g++.dg/tls/static-1.C, execution abort

[Bug target/40483] gcc 4.x needs to utilize better COMDAT mechanism under Solaris

[Bug target/41810] Cannot build gcc: gthr-default.h:466: error: '__mutex' was not declared in this scope

[Bug target/41849] optimization fails when register variables are used for an interrupt

[Bug target/41885] AVR Rotate patterns do not correctly consider overlap.

[Bug target/41894] wrong code with -fno-split-wide-types

[Bug target/42753] _Complex_I is reported as undeclared. Code builds with Sun compiler.

[Bug target/42894] [4.5 Regression] Invalid rtl sharing in Thumb1.

[Bug target/43052] Inline memcmp is *much* slower than glibc's

[Bug target/43088] [avr] Suspect optimizer missed code in gcc 4.4.3..

[Bug target/43095] [avr] GCC produces poor code for 4- and 8-byte values

[Bug target/43118] vld4 and vst4 intrinsics are not handled correctly

[Bug target/43181] branches in conditional move code

[Bug target/43324] core dump on throw

[Bug target/43746] -fmerge-constants and -fmerge-all-constants don't work at AVR target

[Bug target/43804] [4.5/4.6 regression] ICE in reload_cse_simplify_operands

[Bug target/43920] Choosing conditional execution over conditional branches for code size in some cases.

[Bug target/44506] -mtiny-stack causes internal compiler error on gcc for avr

[Bug target/44643] ice in c-typeck.c

[Bug target/44707] operand requires impossible reload

[Bug target/45287] auto-host #defines intmax_t breaks dfp.c (4.5.1)&#8207;

[Bug target/45291] avr miscompilations related to frame pointer registers

[Bug target/46023] gcc.dg/vect/pr43430-2.c FAILs on Solaris 8 and 9/x86

[Bug target/46261] avr-gcc: Segfaults when compiled with the -mint8 option

[Bug target/46278] avr-gcc 4.5.1 doing suboptimal reloads using X

[Bug target/46468] enabling -fomit-frame-pointer by default breaks Wine

[Bug target/46481] long double should default to 64bit even for aix6.1

[Bug target/46622] ARM --target-help headings not translated

[Bug target/46779] wrong code generation for array access

[Bug target/46898] libgcc build failure on lm32-elf

[Bug target/47124] *solaris2 configurations configure, but don't build

[Bug target/47230] [4.6/4.7 Regression] gcc fails to bootstrap on alpha in stage2 with "relocation truncated to fit: GPREL16 against ..."

[Bug target/47364] [x32] internal compiler error: in emit_move_insn, at expr.c:3355

[Bug target/47369] [x32] internal compiler error: in extract_insn, at recog.c:2109

[Bug target/47372] [x32] internal compiler error: in simplify_subreg, at simplify-rtx.c:5222

[Bug target/47381] [x32] internal compiler error: in gen_lowpart_general, at rtlhooks.c:59

[Bug target/47446] [x32] .quad instead of .long is used for address

[Bug target/47509] avr-gcc error: could not split insn

[Bug target/47537] [x32] internal compiler error: in copy_to_mode_reg, at explow.c:635

[Bug target/47715] [x32] TLS doesn't work

[Bug target/47744] [x32] ICE: in reload_cse_simplify_operands, at postreload.c:403

[Bug target/47908] attribute((optimize(2))) causes ICE in m68k_sched_issue_rate

[Bug target/47926] [x32] nested function pointer doesn't work

[Bug target/47947] Variables of type vector double are not copied correctly in gcc-4.5.1 and gcc-4.6.0

[Bug target/47997] gcc on macosx: "ld: warning: -fwritable-strings not compatible with literal CF/NSString"

[Bug target/48084] [x32] internal compiler error: in copy_to_mode_reg, at explow.c:630

[Bug target/48085] [x32] Unnecessary zero-extension

[Bug target/48108] lto should be containerized in a single mach-o section on darwin

[Bug target/48155] Reload doesn't handle subreg properly

[Bug target/48175] [x32] FAIL: gcc.c-torture/execute/builtins/strcat.c

[Bug target/48385] x86-64: Tail call recursion optimization with -mcmodel=large can generate invalid assembly (immediate operand illegal with absolute jump)

[Bug target/48454] gfortran.dg/char_result_13.f90 fails with -O3 -funroll-loops -mvectorize-with-neon-quad

[Bug target/48572] [4.7 regression] gcc.target/mips/mips-{3d,ps}-?.c tests ICE on IRIX 6.5

[Bug target/48789] missed ARM optimization: use LDMIA

[Bug target/48803] arm: Bad assembler produced by bit extract/shift

[Bug target/49049] ICE in copyprop_hardreg_forward_1, at regcprop.c:767

[Bug target/49057] scheduling difference of subs cause 80% performance difference

[Bug target/49146] segv from libgcc_s when raising an exception, or unwinding stack with backtrace with ms_abi

[Bug target/49202] MMIX: Wrong debugging information generated (UNKNOWN: length 2)

[Bug target/49206] [4.5/4.6/4.7 Regression] RA failure in spill_failure, at reload1.c:2113

[Bug target/49313] Inefficient libgcc implementations for avr

[Bug target/49335] [4.6/4.7 Regression] ARM: Invalid assembler generated while compiling C++ code from 'codeblocks'

[Bug target/49398] [4.7 Regression] bootstrap broken for arm-linux-gnueabi with thumb mode.

[Bug target/49404] ARM _Unwind_Backtrace returns _URC_FAILURE too eagerly

[Bug target/49423] [arm] internal compiler error: in push_minipool_fix

[Bug target/49473] [arm] poor scheduling of loads

[Bug target/49487] Internal compiler error in AVR code (bytewise rotate)

[Bug target/49541] [4.6/4.7 regression] TLS support partially broken in 64-bit mode

[Bug target/49547] LZCNT should be enabled only if ABM or LZCNT bits are set

[Bug target/49583] Reloading stack operands in the wrong order, so needs to insert fxch

[Bug target/49600] Bad SSE2 int->float split in i386.md

[Bug target/49606] mips64: o64 Unrecognizable insn when one noreturn function calling another noreturn function

[Bug target/49606] mips64: Unrecognizable insn when one noreturn function calling another noreturn function

[Bug target/49606] New: mips64: Unrecognizable insn when one noreturn function calling another noreturn function

[Bug target/49607] [4.7 Regression] FAIL: 22_locale/time_get/get_weekday/wchar_t/wrapped_locale.cc

[Bug target/49614] New: FAIL: gcc.dg/vmx/gcc-bug-i.c -O0 (test for excess errors)

[Bug target/49621] [4.5 regression] ICE in trunc_int_for_mode, at explow.c:57

[Bug target/49621] [4.5/4.6/4.7 regression] ICE in trunc_int_for_mode, at explow.c:57

[Bug target/49621] New: [4.5/4.6/4.7 regression] ICE in trunc_int_for_mode, at explow.c:57

[Bug target/49633] GCC -march=native on Intel Sandy Bridge causes some 'invalid opcode'

[Bug target/49641] [4.6 Regression] Wrong code for ARMv4T and stmia

[Bug target/49641] [ARM] Wrong code for ARMv4T and stmia

[Bug target/49641] New: [ARM] Wrong code for ARMv4T and stmia

[Bug target/49650] New: MIPS should not use target_flags_explicit in insn conditions

[Bug target/49656] internal compiler error on Mac OS 10.7.0

[Bug target/49660] 64-bit gcc doesn't enable -mv8plus with -m32 on Solaris/SPARC

[Bug target/49660] New: 64-bit gcc doesn't enable -mv8plus with -m32 on Solaris/SPARC

[Bug target/49670] internal compiler error: in extract_insn, at recog.c:2104

[Bug target/49678] New: scan for mov fails in gcc.target/arm/pr42575.c

[Bug target/49678] scan for mov fails in gcc.target/arm/pr42575.c

[Bug target/49684] [4.7 Regression]: build fails on crtstuff.c / crtbegin using default CRT_CALL_STATIC_FUNCTION

[Bug target/49687] [4.6 Regression][avr] Missed optimization for widening MUL

[Bug target/49687] AVR: Missed optimization for widening MUL

[Bug target/49687] New: AVR: Missed optimization for widening MUL

[Bug target/49688] [alpha]: Many execution test failures

[Bug target/49688] New: [alpha]: Many execution test failures

[Bug target/49696] New: ICE on mips when compiling drizzle

[Bug target/49699] New: Aligned load on unaligned address

[Bug target/49713] Conflicting types for 'arm_dbx_register_number'

[Bug target/49713] New: Conflicting types for 'arm_dbx_register_number'

[Bug target/49714] [4.7 Regression] Revision 176128 introduced many ICEs in insn_default_length, at config/i386/i386.md:600

[Bug target/49714] New: [4.7 Regression] Revision 176128 introduced many ICEs in insn_default_length, at config/i386/i386.md:600

[Bug target/49715] New: Could do more efficient unsigned-to-float to conversions based on range information

[Bug target/49723] gcc.c-torture/compile/pr46934.c: ICE in do_SUBST, at combine.c:707 at -O1 and above

[Bug target/49742] [4.7 Regression] ICE for gcc.dg/vect/O3-pr39675-2.c on ARM

[Bug target/49743] -g enables var_tracking on -O0 - causes long compilations

[Bug target/49746] Generated PA-RISC2.0w code cannot be assembled by GNU as-2.21.1

[Bug target/49746] New: Generated PA-RISC2.0w code cannot be assembled by GNU as-2.21.1

[Bug target/49758] -O2 incorrectly swaps overlapping memory accesses

[Bug target/49758] New: -O2 incorrectly swaps overlapping memory accesses

[Bug target/49764] [avr-g++] Rejects attribute progmem

[Bug target/49764] [gcc-avr] Compiling for Arduino is not working

[Bug target/49764] New: [gcc-avr] Compiling for Arduino is not working

[Bug target/49765] New: Support x32 with TARGET_LEGITIMIZE_ADDRESS/LEGITIMIZE_RELOAD_ADDRESS

[Bug target/49765] Support x32 with TARGET_LEGITIMIZE_ADDRESS/LEGITIMIZE_RELOAD_ADDRESS

[Bug target/49780] [x32] internal compiler error: in create_mem_ref, at tree-ssa-address.c:806

[Bug target/49780] New: internal compiler error: in create_mem_ref, at tree-ssa-address.c:806

[Bug target/49781] New: Unnecessary lea in x32 mode

[Bug target/49781] Unnecessary lea in x32 mode

[Bug target/49798] .quad instead of .long is used for address for x32

[Bug target/49799] gcc arm generates illegal sbfx instruction

[Bug target/49799] New: gcc arm generates illegal sbfx instruction

[Bug target/49816] arm.c:3999:12: error: converting 'false' to pointer type 'rtx'

[Bug target/49816] New: arm.c:3999:12: error: converting 'false' to pointer type 'rtx'

[Bug target/49817] libiberty/stack-limit.c causes a bootstrap failure on all FreeBSD targets

[Bug target/49817] New: libiberty/stack-limit.c causes a bootstrap failure on all FreeBSD targets

[Bug target/49821] [4.6 regression] ICE in dwarf2out_cfi_begin_epilogue, at dwarf2out.c:3015

[Bug target/49821] New: [4.6 regression] ICE in dwarf2out_cfi_begin_epilogue, at dwarf2out.c:3015

[Bug target/49824] AVR: Missing documentation for OS_task and OS_main attributes

[Bug target/49824] New: AVR: Missing documentation for OS_task and OS_main attributes

[Bug target/49826] [4.7 Regression] Symbols are not decorated with attribute stdcall and -mrtd

[Bug target/49826] New: [4.7 Regression] Symbols are not decorated with attribute stdcall and -mrtd

[Bug target/49832] [x32] too many memory references for `lea'

[Bug target/49832] New: too many memory references for `lea'

[Bug target/49832] too many memory references for `lea'

[Bug target/49833] [x32] PIC doesn't work

[Bug target/49833] New: PIC doesn't work

[Bug target/49839] Use constants in registers preferably to inline constants (-Os)

[Bug target/49842] New: sparc64-portbld-freebsd9.0 internal compiler error: in connect_traces, at dwarf2cfi.c:2632

[Bug target/49842] sparc64-portbld-freebsd9.0 internal compiler error: in connect_traces, at dwarf2cfi.c:2632

[Bug target/49853] [x32] PIC doesn't work with external symbol

[Bug target/49853] New: [x32] PIC doesn't work with external symbol

[Bug target/49854] New: Clean up SPE/e500 option handling

[Bug target/49856] ICE when compiling mktime.c (gnulib, embedded in libvirt)

[Bug target/49856] New: ICE when compiling mktime.c (gnulib, embedded in libvirt)

[Bug target/49857] New: Put constant switch-tables into flash

[Bug target/49857] Put constant switch-tables into flash

[Bug target/49860] [x32] Error: cannot represent relocation type BFD_RELOC_64 in x32 mode

[Bug target/49860] New: [x32] Error: cannot represent relocation type BFD_RELOC_64 in x32 mode

[Bug target/49862] New: bfin.c warnings

[Bug target/49865] [4.7 Regression] Unnecessary reload causes small bloat

[Bug target/49865] New: Unneccessary reload causes small size regression from 4.6.1

[Bug target/49865] Unnecessary reload causes small size regression from 4.6.1

[Bug target/49866] [4.6 Regression] -mcmodel=large tail call fails to assemble

[Bug target/49866] New: [4.6 Regression] -mcmodel=large tail call fails to assemble

[Bug target/49868] New: Implement named address space to place/access data in flash memory

[Bug target/49877] [h8300] ICE in in reload_cse_simplify_operands: insn does not satisfy its constraints

[Bug target/49878] [h8300] ICE in based_loc_descr, at dwarf2out.c:10478

[Bug target/49879] [h8300] ICE in maybe_record_trace_start, at dwarf2cfi.c:2439

[Bug target/49880] New: SuperH: ICE when -m4 is used with -mdiv=call-div1

[Bug target/49880] SuperH: ICE when -m4 is used with -mdiv=call-div1

[Bug target/49881] [AVR] Inefficient stack manipulation around calls

[Bug target/49881] New: [AVR] Inefficient stack manipulation around calls

[Bug target/49903] [avr] Redundant comparisons in binary-search switch/case expansion

[Bug target/49903] New: AVR: Redundant comparisons in binary-seach switch/case expansion

[Bug target/49904] New: Internal error with multiplication and -msoft-float

[Bug target/49909] FSF gcc 4.6.1 fails to bootstrap on Core Solo/Core Duo

[Bug target/49909] New: FSF gcc 4.6.1 fails to bootstrap on Core Solo/Core Duo

[Bug target/49920] New: unable to find a register to spill in class âDIREGâ

[Bug target/49920] unable to find a register to spill in class âDIREGâ

[Bug testsuite/21954] gcc.dg/compat/struct-layout-1 fails to link on Tru64 UNIX V4.0F

[Bug testsuite/30777] testsuite/gcc.target/i386/abi-1.c failure on openSolaris

[Bug testsuite/39215] Running Testsuite with Multilib Flags exposes many errors in Testsuite (and gcc)

[Bug testsuite/48727] FAIL: g++.dg/opt/devirt2.C scan-assembler-times xyzzy 2

[Bug testsuite/49542] [4.7 regression] 2 failures in the vectorization testsuite in 64-bit mode

[Bug testsuite/49643] FAIL: g++.dg/rtti/anon-ns1.C scan-assembler "*N[^"]+1AE"

[Bug testsuite/49643] New: FAIL: g++.dg/rtti/anon-ns1.C scan-assembler "*N[^"]+1AE"

[Bug testsuite/49694] FAIL: gnat.dg/specs/debug1.ads scan-assembler-times byte\t0x1\t# DW_AT_artificial 4

[Bug testsuite/49694] New: FAIL: gnat.dg/specs/debug1.ads scan-assembler-times byte\t0x1\t# DW_AT_artificial 4

[Bug testsuite/49741] make -k check-c++0x not multilib aware

[Bug testsuite/49741] New: make -k check-c++0x not multilib aware

[Bug testsuite/49753] [4.6/4.7 Regression] FAIL: g++.dg/torture/pr49309.C

[Bug testsuite/49753] New: FAIL: g++.dg/torture/pr49309.C

[Bug testsuite/49757] FAIL: gcc.target/tic6x/*.c

[Bug testsuite/49757] New: FAIL: gcc.target/tic6x/*.c

[Bug testsuite/49917] g++.dg/init/for1.C wrong?

[Bug translation/42146] ICE in tree_low_cst

[Bug translation/49704] gcc/cp/semantics.c: "unexpected ast"

[Bug translation/49704] New: gcc/cp/semantics.c: "unexpected ast"

[Bug tree-optimization/18046] Missed jump threading optimization

[Bug tree-optimization/18437] vectorizer failed for matrix multiplication

[Bug tree-optimization/21485] [4.4/4.5/4.6/4.7 Regression] missed load PRE, PRE makes i?86 suck

[Bug tree-optimization/23286] missed fully redundant expression

[Bug tree-optimization/26388] Variable sized storage allocation should be promoted to stack allocation

[Bug tree-optimization/44303] [graphite] Segmentation fault within CLooG

[Bug tree-optimization/45313] [graphite] interchange-7.c is miscompiled

[Bug tree-optimization/45450] [graphite] some programs do not pass the legality check

[Bug tree-optimization/46021] 3 tree-ssa tests XPASS almost everywhere

[Bug tree-optimization/46032] openmp inhibits loop vectorization

[Bug tree-optimization/46194] [4.5 Regression] gcc.dg/graphite/block-0.c FAILs with -ftree-parallelize-loops

[Bug tree-optimization/47407] gcc.dg/tree-ssa/pr42585.c FAILs on Tru64 UNIX V5.1B

[Bug tree-optimization/48172] [4.5 Regression] incorrect vectorization of loop in GCC 4.5.* with -O3

[Bug tree-optimization/48321] gcc.dg/graphite/id-pr46845.c FAILs on IRIX 6.5: ICE in commit_one_edge_insertion, at cfgrtl.c:1566

[Bug tree-optimization/48648] internal compiler error: in translate_clast, at graphite-clast-to-gimple.c:1123

[Bug tree-optimization/48795] -Warray-bounds false positive

[Bug tree-optimization/48799] [4.7 Regression] ice in pred_chain_length_cmp

[Bug tree-optimization/48805] ICE in rename_uses, at sese.c:533 while compiling qutecom 2.2 with -fgraphite-identity

[Bug tree-optimization/48822] [4.5 Regression] G++ gets stucks and never finishes compilation when enabling -O2/3 optimization options.

[Bug tree-optimization/49033] [4.6/4.7 Regression] ICE in compute_affine_dependence (tree-data-ref.c:4090) with -O3 -fcheck-data-deps -march=amdfam10

[Bug tree-optimization/49040] ICE in translate_clast, at graphite-clast-to-gimple.c:1123

[Bug tree-optimization/49094] ARM aligned(1) attribute is sometimes dropped

[Bug tree-optimization/49115] [4.5 Regression] invalid return value optimization (?) when exception is thrown and caught

[Bug tree-optimization/49140] [4.6 regression] wrong code with -O2 and -O3, not with -O3 -no-inline

[Bug tree-optimization/49161] [4.5 Regression] Fix VRP on switch stmts

[Bug tree-optimization/49170] [4.7 regression] Several libstdc++ tests fail to link on Solaris 8/9: cexp missing

[Bug tree-optimization/49227] [4.7 Regression] ice in inline_small_functions

[Bug tree-optimization/49309] [4.6 Regression] ICE with -fmudflap: verify_stmts failed: type mismatch in pointer plus expression

[Bug tree-optimization/49309] [4.6/4.7 Regression] ICE with -fmudflap: verify_stmts failed: type mismatch in pointer plus expression

[Bug tree-optimization/49316] ICE in in function_and_variable_visibility, at ipa.c:926 with g++.dg/tls/diag-1.C

[Bug tree-optimization/49452] [4.7 regression] comp-goto-2.c regresses in testing

[Bug tree-optimization/49460] [4.5 Regression] g++: Internal error: Segmentation fault (program cc1plus) using -O2 or -O3

[Bug tree-optimization/49471] cactusADM/dealII build with autopar fails on x86, and fails on power7 when -m32 is enabled.

[Bug tree-optimization/49471] ICE when -ftree-parallelize-loops is enabled together with -m32 on power7

[Bug tree-optimization/49513] DOM inhibits if-conversion and vectorization

[Bug tree-optimization/49518] [4.6 Regression] ICE in vect_enhance_data_refs_alignment, at tree-vect-data-refs.c:1555

[Bug tree-optimization/49518] [4.6/4.7 Regression] ICE in vect_enhance_data_refs_alignment, at tree-vect-data-refs.c:1555

[Bug tree-optimization/49542] [4.7 regression] 2 failures in the vectorization testsuite in 64-bit mode

[Bug tree-optimization/49580] SPEC2006 GCC benchmark build failure when run with autopar

[Bug tree-optimization/49601] [4.7 Regression] ICE at ipa-inline-analysis.c:1188

[Bug tree-optimization/49602] New: verify_ssa failed (definition does not dominate use) with "-O2 -g"

[Bug tree-optimization/49610] New: Segfault with -ftree-vectorize (or -O3)

[Bug tree-optimization/49610] Segfault with -ftree-vectorize (or -O3)

[Bug tree-optimization/49615] [4.6 Regression] internal compiler error: verify_stmts failed / LHS in noreturn call with pointer-to-never-returning-member

[Bug tree-optimization/49616] New: REGRESSION vectorization fails in case of runtime dimensioned vector

[Bug tree-optimization/49616] REGRESSION vectorization fails in case of runtime dimensioned vector

[Bug tree-optimization/49618] New: When building uClibc with GCC 4.6.1 old_atexit is miscompiled

[Bug tree-optimization/49618] When building uClibc with GCC 4.6.1 old_atexit is miscompiled

[Bug tree-optimization/49622] [4.4 Regression] Compiler segfault

[Bug tree-optimization/49632] ICE in compute_affine_dependence (tree-data-ref.c:4038) with -O3

[Bug tree-optimization/49632] New: ICE in compute_affine_dependence (tree-data-ref.c:4038) with -O3

[Bug tree-optimization/49642] constant part of a macro not optimized away as expected due to splitter

[Bug tree-optimization/49645] [4.7 regression] g++.dg/tree-ssa/pr8781.C FAILs on Tru64 UNIX

[Bug tree-optimization/49645] New: [4.7 regression] g++.dg/tree-ssa/pr8781.C FAILs on Tru64 UNIX

[Bug tree-optimization/49647] gcc.dg/tree-ssa/20030807-7.c XPASSes everywhere

[Bug tree-optimization/49647] New: gcc.dg/tree-ssa/20030807-7.c XPASSes everywhere

[Bug tree-optimization/49651] [4.4/4.5 Regression] nested lambdas and -O3 produced incorrect integer variable increments

[Bug tree-optimization/49651] [4.4/4.5/4.6/4.7 Regression] nested lambdas and -O3 produced incorrect integer variable increments

[Bug tree-optimization/49651] [C++0x] nested lambdas and -O3 produced incorrect integer variable increments

[Bug tree-optimization/49657] array subscript warnings when building gcc with -O2

[Bug tree-optimization/49657] New: array subscript warnings when building gcc with -O2

[Bug tree-optimization/49662] [4.7 Regression] XFAIL: gcc.dg/graphite/interchange-XX.c, PRE confuses loop interchange

[Bug tree-optimization/49666] passing nested function to inline function causes a trampoline call

[Bug tree-optimization/49695] conditional moves for stores

[Bug tree-optimization/49695] New: conditional moves for stores

[Bug tree-optimization/49709] Bad code gen with -fipa-sra

[Bug tree-optimization/49709] New: Bad code gen with -fipa-sra

[Bug tree-optimization/49712] internal compiler error: in gen_lsm_tmp_name, at tree-ssa-loop-im.c:2048

[Bug tree-optimization/49715] Could do more efficient unsigned-to-float to conversions based on range information

[Bug tree-optimization/49724] [4.6/4.7 Regression] FAIL: gnat.dg/socket1.adb execution test

[Bug tree-optimization/49725] [4.6 Regression] FAIL: c34005a

[Bug tree-optimization/49725] [4.6 regression] ICE at -O2 on ACATS c34005a

[Bug tree-optimization/49730] loop not vectorized if inside another loop

[Bug tree-optimization/49730] New: loop not vectorized if inside another loop

[Bug tree-optimization/49735] [4.7 Regression] mips64-elf libgcc build fails with apparently infinite recursion.

[Bug tree-optimization/49735] New: mips64-elf libgcc build fails with apparently infinite recursion.

[Bug tree-optimization/49742] [4.7 Regression] ICE for gcc.dg/vect/O3-pr39675-2.c on ARM

[Bug tree-optimization/49742] New: ICE for gcc.dg/vect/O3-pr39675-2.c on ARM

[Bug tree-optimization/49749] New: Reassociation rank algorithm does not include all non-NULL operands

[Bug tree-optimization/49749] Reassociation rank algorithm does not include all non-NULL operands

[Bug tree-optimization/49756] New: g++ ICE

[Bug tree-optimization/49760] New: vectorization inhibited if indices are references

[Bug tree-optimization/49760] vectorization inhibited if indices are references

[Bug tree-optimization/49761] New: restrict keyword ignored if in structure

[Bug tree-optimization/49761] restrict keyword ignored if in structure

[Bug tree-optimization/49768] [4.6/4.7 Regression] C99 style union initializations does not work as expected with optimizations

[Bug tree-optimization/49770] [4.7 Regression] wrong code with -fno-tree-forwprop

[Bug tree-optimization/49770] New: [4.7 Regression] wrong code with -fno-tree-forwprop

[Bug tree-optimization/49771] [4.7 Regression] wrong code with -ftree-vectorize

[Bug tree-optimization/49771] New: [4.7 Regression] wrong code with -ftree-vectorize

[Bug tree-optimization/49772] [4.7 Regression] ICE: in ipa_pta_execute, at tree-ssa-structalias.c:6790 with -fipa-pta

[Bug tree-optimization/49772] New: [4.7 Regression] ICE: in ipa_pta_execute, at tree-ssa-structalias.c:6790 with -fipa-pta

[Bug tree-optimization/49773] New: use of class data members prevent vectorization

[Bug tree-optimization/49773] use of class data members prevent vectorization

[Bug tree-optimization/49782] New: Missed optimization due to dependency analysis

[Bug tree-optimization/49788] New: Extra Load immediate with zero

[Bug tree-optimization/49790] New: ICE in partition_view_bitmap, at tree-ssa-live.c:369

[Bug tree-optimization/49795] New: vectorization of conditional code happens only on local variables

[Bug tree-optimization/49795] vectorization of conditional code happens only on local variables

[Bug tree-optimization/49809] [4.7 regression] gimple_check failure at -O3

[Bug tree-optimization/49809] New: [4.7 regression] gimple_check failure at -O3

[Bug tree-optimization/49822] [4.7 regression] Segfault in remove_prop_source_from_use

[Bug tree-optimization/49822] New: [gcc-4.7 regression] Segfault in remove_prop_source_from_use

[Bug tree-optimization/49849] loop optimization prevents vectorization

[Bug tree-optimization/49849] New: loop optimization prevents vectorization

[Bug tree-optimization/49851] IVOPTs makes a mess out of polyhedron air derivx and derivy

[Bug tree-optimization/49851] New: IVOPTs makes a mess out of polyhedron air derivx and derivy

[Bug tree-optimization/49869] New: Excessive loop versioning done by vectorization + predictive commoning

[Bug tree-optimization/49872] Missed optimization: Could coalesce neighboring memsets

[Bug tree-optimization/49872] New: Missed optimization: Could coalesce neighboring memsets

[Bug tree-optimization/49873] New: Optimizer regression

[Bug tree-optimization/49873] Optimizer regression

[Bug tree-optimization/49911] New: vrp2 + -fstrict-enums incorrectly remove predicate

[Bug tree-optimization/49911] vrp2 + -fstrict-enums incorrectly remove predicate

[Bug tree-optimization/49916] matrix-reorg optimization segmentation fault

[Bug tree-optimization/49916] New: matrix-reorg optimization segmentation fault

[Bug tree-optimization/49926] [4.7 Regression] ice in process_use, at tree-vect-stmts.c:405

code won't compile on new version of gcc

x86_64: undefined reference to `typeinfo for __int128'


Indexes: [Date Index] [Subject Index] [Author Index] [Thread Index]
Site Nav: [Browse other archives for this mailing list]
[Browse other mailing lists at this site]
Search: Limit to:

Mail converted by MHonArc 2.6.3