gcc-bugs archive
subject index for November, 2008

This is the mail archive of the gcc-bugs@gcc.gnu.org mailing list for the GCC project.

Indexes: [Date Index] [Subject Index] [Author Index] [Thread Index]
Site Nav: [Browse other archives for this mailing list]
[Browse other mailing lists at this site]
Search: Limit to:

Out of Office AutoReply: Сувенирная продук ция с вашим логотипом

[Bug ada/16094] Illegal program not detected, RM 3.4.1(5)

[Bug ada/16095] Illegal program not detected, X'Access of wrong type

[Bug ada/16212] Bug box in Gigi, code=316, on legal Ada 83 program

[Bug ada/19419] Overlapping memcpy with array slices

[Bug ada/20974] ACATS c250002: gnatchop cannot create file with special character

[Bug ada/23187] MAXPATHLEN usage in gcc/ada/*.c

[Bug ada/23390] abstract function in private part not overloading previous function is not allowed

[Bug ada/25844] [4.2/4.3/4.4 regression] ICE on overloaded renames

[Bug ada/27243] [4.2 regression] ACATS c37215h fails

[Bug ada/30094] bogus use of CROSS_COMPILE in adaint.c

[Bug ada/30614] compiler puts the blame on in parameter mode, not pointer to constant, for assignment to component

[Bug ada/30827] [Ada] GNAT.compiler_version problem for official releases?

[Bug ada/33602] FAIL: c452001

[Bug ada/34118] Please enable stack checking (-fstack-check) by default

[Bug ada/34289] gnatmake -s doesn't work

[Bug ada/35533] FAIL: gnat.dg/derived_aggregate.adb execution test

[Bug ada/37543] Assembler error during compilation

[Bug ada/37681] [4.4 regression] Building 64-bit libada fails on Solaris/x86: alignment error

[Bug ada/37681] [4.4 Regression] Building 64-bit libada fails on Solaris/x86: alignment error

[Bug ada/37799] SEGV compiling ada/ada.ads in stage2

[Bug ada/37945] GNAT Sockaddr and Sockaddr_In does not match c-structures on RTEMS

[Bug ada/37977] Missing ada multilib support for s390x

[Bug ada/37993] New: bootstrap with ada fails: a-direct.ads:426:09: alignment for "Search_Typeb82s" must be at least 8

[Bug ada/37993] [4.4 Regression] bootstrap with ada fails: a-direct.ads:426:09: alignment for "Search_Typeb82s" must be at least 8

[Bug ada/37993] [4.4 Regression] missing Ada multilib support

[Bug ada/37993] [4.4 Regression] missing Ada multilib support for darwin

[Bug ada/38009] New: Assert_Failure sinfo.adb:1002

[Bug ada/38009] Assert_Failure sinfo.adb:1002

[Bug ada/38127] New: FAIL: cd1c04e

[Bug ada/38127] [4.4 Regression] ACATS cd1c04e fails on sparc, hppa

[Bug ada/38131] New: [4.4 Regression] ACATS cc70a01 and cxa4016 segv on exception on sparc-linux

[Bug ada/38131] [4.4 regression] ACATS cc70a01 and cxa4016 segv on exception

[Bug ada/38229] New: FAIL: c954a01

[Bug ada/38315] New: Unclear type error message when inheriting from interface and tagged type

[Bug ada/38325] New: Long_Long_Float'Image returns a wrong value in some cases

[Bug ada/38325] Long_Long_Float'Image returns a wrong value in some cases

[Bug ada/38327] New: Rejects legal program involving T'Class'Read

[Bug ada/38329] New: Illegal program not detected, "private with" in a generic package

[Bug ada/38330] New: Illegal program not detected, RM 4.3.1(16/2)

[Bug ada/38331] New: Illegal program not detected, "=" not predefined for class-wide types, ARM 4.5.2(6) and AI05-71

[Bug ada/38331] Illegal program not detected, "=" not predefined for class-wide types, ARM 4.5.2(6) and AI05-71

[Bug ada/38332] New: Program fails to raise Constraint_Error as mandated by ARM 4.7(4)

[Bug ada/38333] New: Illegal program not detected, ARM 6.1(20): pragma Import illegal for abstract subprograms

[Bug boehm-gc/38162] [4.4 Regression] FAIL: gctest

[Bug bootstrap/33100] [4.3/4.4 regression] on bootstrap getting section .eh_frame: bad cie version 0: offset 0x0

[Bug bootstrap/33304] Bootstrap failure on solaris2 using cc due to empty macro arguments

[Bug bootstrap/33503] [4.3/4.4 Regression] problems with libtool wrapper scripts on mingw32

[Bug bootstrap/35619] [4.3/4.4 Regression] fixed includes not being found if building in src dir

[Bug bootstrap/36908] bootstrap forever with BOOT_CFLAGS="-O2 -ftree-loop-distribution"

[Bug bootstrap/37035] gcc-4.2.2 build failed on solaris-8

[Bug bootstrap/37279] bootstrap on sparc fails on genattrtab

[Bug bootstrap/37422] [4.4 regression] IRA merge breaks Solaris/x86 bootstrap

[Bug bootstrap/37660] Error Building libssp, recent update

[Bug bootstrap/37739] [4.4 Regression] bootstrap broken with core gcc > gcc-4.2.x

[Bug bootstrap/37859] Bootstrap failure on mips64octeon-unknown-linux-gnu

[Bug bootstrap/37915] bootstrap broken for cygwin

[Bug bootstrap/37923] [4.4 Regression] CPPFLAGS now unset for stage 1 build of libcpp files.

[Bug bootstrap/37996] New: libgcc.mvars missing dependency on the variable tmake_file, maybe others

[Bug bootstrap/38010] New: gcc/config.gcc needs adjustment for darwin10

[Bug bootstrap/38010] gcc/config.gcc needs adjustment for darwin10

[Bug bootstrap/38014] New: [4.4 regression] in-tree gmp and mpfr libraries no longer work

[Bug bootstrap/38014] [4.4 regression] in-tree gmp and mpfr libraries no longer work

[Bug bootstrap/38014] [4.4 Regression] in-tree gmp and mpfr libraries no longer work

[Bug bootstrap/38035] GCC 4.3.2 Make fails on ubuntu - configure: error: cannot compute suffix of object files

[Bug bootstrap/38088] New: gcc fails to compile with undefined symbol: __LONG_LONG_MAX__ error

[Bug bootstrap/38088] gcc fails to compile with undefined symbol: __LONG_LONG_MAX__ error

[Bug bootstrap/38100] New: gcc fails to compile with (undefined symbol) gimple_check_failed error

[Bug bootstrap/38100] gcc fails to compile with (undefined symbol) gimple_check_failed error

[Bug bootstrap/38106] New: gcc fails to compile with ld:libgcc.map: file format not recognized error

[Bug bootstrap/38106] gcc fails to compile with ld:libgcc.map: file format not recognized error

[Bug bootstrap/38262] New: [4.4 regression] GCC components unnecessarily link with shared gmp/mpfr

[Bug bootstrap/38262] [4.4 regression] GCC components unnecessarily link with shared gmp/mpfr

Re: [Bug bootstrap/38262] New: [4.4 regression] GCC components unnecessarily link with shared gmp/mpfr

[Bug bootstrap/38286] configure: error: cannot compute suffix of object files - cannot find as

[Bug bootstrap/38288] New: i386/i386.c: 7 * set but not used variables

[Bug bootstrap/38300] New: [4.4 Regression] libstdc++ and libgcj contain a reference to _Unwind_GetIPInfo

[Bug bootstrap/38300] [4.4 Regression] libstdc++ and libgcj contain a reference to _Unwind_GetIPInfo

[Bug bootstrap/38302] New: inefficient use of strlen in for loop

[Bug bootstrap/38302] inefficient use of strlen in for loop

[Bug bootstrap/38314] New: gcc trunk doesn't build libjava on x86_64-apple-darwin10

[Bug bootstrap/38314] gcc trunk doesn't build libjava on x86_64-apple-darwin10

[Bug bootstrap/38314] multilib bootstrap broken for x86_64-apple-darwin10

[Bug c++/10690] [DR 115] Even when used within typeid(), a template-id generating an overload set with only one function should silently decay to a pointer to function

[Bug c++/11006] [CNI] ICE with use of __java_boolean

[Bug c++/11407] [DR 115] Function cannot be resolved

[Bug c++/12255] exception-specifications unchecked during assignment of pointer to function

[Bug c++/15179] bad parse error recovery with missing typename

[Bug c++/15745] exception specification incorrectly changes the type of the exception thrown

[Bug c++/15795] No way to teach operator new anything about alignment requirements

[Bug c++/17920] add __attribute__((reimpl)) as a replacement for the (optional) virtual keyword for reimplementations of virtual functions

[Bug c++/20423] Warning -Woverloaded-virtual triggers to often

[Bug c++/20681] [4.2/4.3/4.4 Regression] wrong "control reaches" warning with switches

[Bug c++/23287] [4.2/4.3/4.4 regression] Explicitly invoking destructor of template class in a template and is dependent

[Bug c++/25185] deep typedef substitution in error message

[Bug c++/26693] [4.2/4.3/4.4 regression] Access checks not performed for types in templates

[Bug c++/28513] [4.2/4.3/4.4 Regression] QOI: Diagnostic missing since 3.3.x when naming rule is violated

[Bug c++/28743] [4.2/4.3/4.4 regression] ICE with invalid specialization

[Bug c++/31063] Spurious/missing warn_unused_result warnings affected by presence/absense of copy constructor

[Bug c++/31503] gcc exhausts memory when compiling pixie with optimizations

[Bug c++/31742] warn_unused_result prints no warning for return value with destructor

[Bug c++/32344] crash with EH on multiprocessor machines

[Bug c++/32519] [4.2/4.3/4.4 regression] g++ allows access to protected template member functions of base class

[Bug c++/32687] Invalid code generation for reading signed negative bitfield value (g++ optimization)

[Bug c++/34158] Template delete doesn't call if exception thrown in constructor

[Bug c++/34269] [4.2/4.3 regression] Incomplete __decltype/__typeof expressions accepted

[Bug c++/34269] [4.2/4.3/4.4 regression] Incomplete __decltype/__typeof expressions accepted

[Bug c++/34588] g++.dg/other/spu2vmx-1.C doesn't find spu2vmx.h on powerpc-*-darwin*

[Bug c++/34983] i486-linux-gnu-g++: Internal error: Killed (program cc1plus)

[Bug c++/35319] [4.3/4.4 regression] ICE throwing fixed-point types

[Bug c++/35334] [4.2/4.3/4.4 regression] Broken diagnostic for complex cast

[Bug c++/35335] [4.2/4.3/4.4 regression] Broken diagnostic: 'expr_stmt' not supported by dump_expr

[Bug c++/35405] [4.2/4.3/4.4 Regression] Internal compiler error

[Bug c++/35652] [4.2/4.3/4.4 Regression] offset warning should be given in the front-end

[Bug c++/35758] vector_size attribute lost in function arguments for templates

[Bug c++/359] [DR 45] g++ incorrectly grants access to private members to nested classes

[Bug c++/36089] [4.2/4.3/4.4 Regression] Funny rejects valid with constant integral expression

[Bug c++/36334] [4.2/4.3/4.4 Regression] typedef to function type leads to problems

[Bug c++/36410] [4.2/4.3 Regression] ICE with transparent union

[Bug c++/36410] [4.2/4.3/4.4 Regression] ICE with transparent union

[Bug c++/36478] [4.3/4.4 regression] warning not emitted when code expanded from macro

[Bug c++/36631] [4.3 Regression] attribute always_inline -> sorry, unimplemented: recursive inlining

[Bug c++/36631] [4.3/4.4 Regression] attribute always_inline -> sorry, unimplemented: recursive inlining

[Bug c++/36654] [4.2/4.3 Regression] Inlined con/de-structor breaks virtual inheritance dllimport classes

[Bug c++/36654] [4.3 regression] Inlined con/de-structor breaks virtual inheritance dllimport classes

[Bug c++/36796] Support c++ override keyword

[Bug c++/36846] ICE with variadic templates partial specialisation

[Bug c++/37012] numerous stackalign related testsuite failures on i686-apple-darwin9

[Bug c++/37066] partial specialization of function depends on the order

[Bug c++/37105] stackalign failures

[Bug c++/37142] [4.2/4.3/4.4 Regression] ICE: in dependent_type_p, at cp/pt.c:15585

[Bug c++/37256] [4.4 Regression] extern template / explicit instantiation broken in 4.4.0-pre

[Bug c++/37302] function parameters are declared too late

[Bug c++/37314] [4.2/4.3/4.4 Regression] seg violation

[Bug c++/37352] thunks for virtual function should work on lto

[Bug c++/37540] [4.4 regression] ICE on __decltype of method call in function template

[Bug c++/37561] [4.2/4.3 Regression] Revision 140405 caused g++.old-deja/g++.mike/warn1.C

[Bug c++/37561] [4.2/4.3/4.4 Regression] Revision 140405 caused g++.old-deja/g++.mike/warn1.C

[Bug c++/37563] [4.3 regression] Trouble calling qualified member function

[Bug c++/37563] [4.3/4.4 regression] Trouble calling qualified member function

[Bug c++/37740] [C++0x] "foo f{...}" form compiles, but "new foo{...}" one doesn't

[Bug c++/37847] Invalid tree sharing with CHANGE_DYNAMIC_TYPE_EXPR

[Bug c++/37862] Parenthesised indirection alters class member access

[Bug c++/37932] narrowing conversion with -std=c++0x

[Bug c++/37962] [4.4 regression] ICE with (auto*) casts

[Bug c++/37964] [4.4 regression] ICE with operator auto

[Bug c++/37967] [4.4 regression] ICE with function returning auto

[Bug c++/37971] [4.2/4.3/4.4 Regression] Rejects default argument that is a template via access failure

[Bug c++/37984] New: unable to access virtual functions from derived class passed as a refference

[Bug c++/37984] unable to access virtual functions from derived class passed as a refference

[Bug c++/37991] New: excessive memory consumption - possible hang

[Bug c++/37991] excessive memory consumption - possible hang

[Bug c++/38000] New: System header files not found once -isystem /usr/include is used

[Bug c++/38002] New: gcc crash using -fvisibility-ms-compat

[Bug c++/38002] gcc crash using -fvisibility-ms-compat

[Bug c++/38005] New: inconsistent precedence of operators in namespaces

[Bug c++/38005] inconsistent precedence of operators in namespaces

[Bug c++/38007] New: g++ instantiate same operator twice due to bitfield in -O0 mode, causing symbol already defined assembler error

[Bug c++/38007] [4.2/4.3 Regression] g++ instantiate same operator twice due to bitfield in -O0 mode, causing symbol already defined assembler error

[Bug c++/38007] [4.2/4.3/4.4 Regression] g++ instantiate same operator twice due to bitfield in -O0 mode, causing symbol already defined assembler error

[Bug c++/38012] New: vectorizer ignores 'restrict'

[Bug c++/38012] vectorizer ignores 'restrict'

[Bug c++/38020] New: Undiagnosed const violation in pointer conversion in CRTP context.

[Bug c++/38020] Undiagnosed const violation in pointer conversion in CRTP context.

[Bug c++/38021] New: C++ hang for new keywords

[Bug c++/38021] [4.4 Regression] C++ hang for new keywords

[Bug c++/38021] C++ hang for new keywords

[Bug c++/38022] New: [4.4 regression] Incorrect warning with -Wshadow

[Bug c++/38022] [4.4 regression, g++] Incorrect warning with -Wshadow

[Bug c++/38027] New: bitfields and -O2 or greater

[Bug c++/38027] bitfields and -O2 or greater

[Bug c++/38030] New: g++ template with overloaded function behave differently on "g++ 4.3.2" and "g++ 3.4.6"

[Bug c++/38030] [4.2/4.3 Regression] name-lookup for non-dependent name in template function is wrong

[Bug c++/38030] [4.2/4.3/4.4 Regression] g++ template with overloaded function behave differently on "g++ 4.3.2" and "g++ 3.4.6"

[Bug c++/38030] [4.2/4.3/4.4 Regression] name-lookup for non-dependent name in template function is wrong

[Bug c++/38031] New: g++ template with overloaded function behave differently on "g++ 4.3.2" and "g++ 3.4.6"

[Bug c++/38031] g++ template with overloaded function behave differently on "g++ 4.3.2" and "g++ 3.4.6"

[Bug c++/38032] New: g++ template with overloaded function behave differently on "g++ 4.3.2" and "g++ 3.4.6"

[Bug c++/38032] g++ template with overloaded function behave differently on "g++ 4.3.2" and "g++ 3.4.6"

Re: [Bug c++/38035] New: GCC 4.3.2 Make fails on ubuntu - configure: error: cannot compute suffix of object files

[Bug c++/38035] New: GCC 4.3.2 Make fails on ubuntu - configure: error: cannot compute suffix of object files

[Bug c++/38045] New: floating point exception triggered incorrectly

[Bug c++/38045] floating point exception triggered incorrectly

[Bug c++/38045] floating point exception triggered when it shouldn't be

[Bug c++/38053] New: add a warning for b/c*d

[Bug c++/38053] add a warning for b/c*d

[Bug c++/38055] New: key for compilation -Wconversion

[Bug c++/38063] New: C++ operator new returns misaligned address

[Bug c++/38063] C++ operator new returns misaligned address

[Bug c++/38064] New: [c++0x] operator== doesn't work for enum classes

[Bug c++/38064] [c++0x] operator== doesn't work for enum classes

[Bug c++/38067] New: monetary_members.cc: 4 * call to wrong C++ delete

[Bug c++/38068] New: Friend Functions of the Base accessing Derived Class Members

[Bug c++/38068] Friend Functions of the Base accessing Derived Class Members

[Bug c++/38069] New: function pointer exception specification not checked during assignment

[Bug c++/38069] function pointer exception specification not checked during assignment

[Bug c++/38071] New: function pointer exception specification not checked during assignment

[Bug c++/38071] function pointer exception specification not checked during assignment

[Bug c++/38072] New: ICE on valid code.

[Bug c++/38072] ICE on valid code.

[Bug c++/38076] New: FAIL: g++.dg/other/anon5.C

[Bug c++/38076] FAIL: g++.dg/other/anon5.C

[Bug c++/38078] New: Friend Functions of the Base accessing Derived Class Members

[Bug c++/38078] Friend Functions of the Base accessing Derived Class Members

[Bug c++/38087] New: Pseudo destructor call

[Bug c++/38087] Pseudo destructor call

[Bug c++/38089] New: g++ crash on invalid code

[Bug c++/38089] g++ crash on invalid code

[Bug c++/38103] New: Warning about correctly escaped comment

[Bug c++/38103] Warning about correctly escaped comment

[Bug c++/38123] New: [4.3 regression] error: incorrect sharing of tree nodes ap->fp_offset = D.2748;

[Bug c++/38123] [4.3 regression] error: incorrect sharing of tree nodes ap->fp_offset = D.2748;

[Bug c++/38124] New: gcc fails to compile with Internal error, aborting at dw2gencfi.c line 1267 errror

[Bug c++/38124] gcc fails to compile with Internal error, aborting at dw2gencfi.c line 1267 errror

[Bug c++/38132] New: std::string is faster with -D_GLIBCXX_DEBUG=1 than without

[Bug c++/38132] extern template prohibits inlining

[Bug c++/38132] std::string is faster with -D_GLIBCXX_DEBUG=1 than without

[Bug c++/38172] New: warn_unused_result does not work with structs not containing a copy constructor

[Bug c++/38172] warn_unused_result does not work with structs not containing a copy constructor

[Bug c++/38173] New: Mistake in Russian translation of error text "functional cast expression list treated as compound expression"

[Bug c++/38174] New: Missing some built-in candidates for operator overloading

[Bug c++/38175] New: Explicit instantiation of a template hides symbols with the default visibility attribute

[Bug c++/38175] Explicit instantiation of a template hides symbols with the default visibility attribute

[Bug c++/38178] New: devirtualization is missing in lto

[Bug c++/38178] [LTO] devirtualization is missing in lto

[Bug c++/38185] New: Wrong register used to get struct information

[Bug c++/38185] Wrong register used to get struct information

[Bug c++/38206] New: g++ crashes when compiling trivial code (~10 line test case)

[Bug c++/38206] g++ crashes when compiling trivial code (~10 line test case)

[Bug c++/38211] New: g++ 4.2 SIGSEGV in tree_inlinable_function_p

[Bug c++/38211] [4.2 regression] g++ 4.2 SIGSEGV in tree_inlinable_function_p

[Bug c++/38215] New: g++ internal compiler error

[Bug c++/38215] g++ internal compiler error

[Bug c++/38228] New: ICE when abusing std::function

[Bug c++/38228] ICE when abusing std::function

[Bug c++/38232] New: "value-initialization of reference" warning too strict

[Bug c++/38232] [4.4 Regression] "value-initialization of reference" warning too strict

[Bug c++/38233] [4.4 Regression] 'map' value type + new uninitted const member warnings causes error

[Bug c++/38242] New: Overeager ADL searches associated namespaces of base class's template arguments

[Bug c++/38242] Overeager ADL searches associated namespaces of base class's template arguments

[Bug c++/38253] New: g++.dg/ipa/iinline-1.C scan-ipa-dump inline fails on powerpc-apple-darwin9

[Bug c++/38253] g++.dg/ipa/iinline-1.C scan-ipa-dump inline fails on powerpc-apple-darwin9

[Bug c++/38255] New: Invalid access with nested classes

[Bug c++/38255] Invalid access with nested classes

[Bug c++/38256] New: [4.4 regression] ICE with "operator auto"

[Bug c++/38256] [4.4 regression] ICE with "operator auto"

[Bug c++/38257] New: [4.4 regression] ICE with auto and #pragma omp parallel

[Bug c++/38257] [4.4 regression] ICE with auto and #pragma omp parallel

[Bug c++/38260] New: vector_size attribute vs specialization

[Bug c++/38265] New: STL treats explicit constructors as converting constructors

[Bug c++/38265] STL treats explicit constructors as converting constructors

[Bug c++/38266] New: improper fix to curses.h on irix

[Bug c++/38266] improper fix to curses.h on irix

[Bug c++/38276] New: [c++0x] ICE on templates, simple test-case

[Bug c++/38276] [c++0x] ICE on templates, simple test-case

[Bug c++/38278] [4.4 Regression] C++ namespace collision

[Bug c++/38297] New: O2 causes invalid code

[Bug c++/38297] O2 causes invalid code

[Bug c++/38309] New: internal compiler error: iinternal compiler error: in write_type, at cp/mangle.c:1695n write_type, at cp/mangle.c:1695

[Bug c++/38309] ICE in write_type, at cp/mangle.c:1695

[Bug c++/38313] New: g++ fails to parse a member function with a parenthesized type name as its declarator

[Bug c++/38313] g++ fails to parse a member function with a parenthesized type name as its declarator

[Bug c++/38317] New: buffer overflow detected while building a to be cross-compiled application

[Bug c++/38317] buffer overflow detected while building a to be cross-compiled application

[Bug c++/38334] New: pmf accesses violate strict-aliasing rules

[Bug c++/38335] New: Code warning

[Bug c++/38335] Code warning

[Bug c++/7221] wrong linkage of typedef-named classes

[Bug c/10676] Using unnamed fields in initializers

[Bug c/17662] testsuite for IMA testcases

[Bug c/19820] How to get results from a V2SF ?

[Bug c/21920] aliasing violations

[Bug c/22020] poor error message for invalid cast in constant initializer

[Bug c/25509] can't disable __attribute__((warn_unused_result))

[Bug c/25702] feature request: generate a warning for sizeof on a pointer

[Bug c/31887] bad warning converting qualified void* to qualified array pointer

[Bug c/32455] [4.2/4.3/4.4 regression] ICE with modified va_list, allows declaration of __builtin_*

[Bug c/32588] Bogus "error: initializer element is not constant"

[Bug c/32643] [4.2/4.3/4.4 Regression] Wrong error message with unsigned char a = uchar&512

[Bug c/33193] slopiness in __real/__imag

[Bug c/35069] Casting from a volatile type to a non-volatile type should cause a warning

[Bug c/35198] [4.2/4.3/4.4 Regression] missed evaluation of VM array type when used as a cast

[Bug c/35392] Warning "array subscript is above array bounds" in inline fct

[Bug c/35430] [4.2/4.3 regression] ICE with complex arithmetic

[Bug c/35430] [4.2/4.3/4.4 regression] ICE with complex arithmetic

[Bug c/35764] improper load from volatile

[Bug c/36113] fix C enumerators

[Bug c/36359] [Regression] compile error in linux-kernel 2.6.26-rc4 with -O2

[Bug c/36651] 64-bit enumerator incorrectly demoted to 32 bits

[Bug c/36892] Support __attribute__((deprecated("text string")))

[Bug c/37106] [4.4 Regression] ICE with -fpic or -fPIC: in mems_in_disjoint_alias_sets_p, at alias.c:278

[Bug c/37866] "passing argument from incompatible pointer type" warning cannot be passed to -Werror=

[Bug c/37924] [4.2/4.3 Regression] ice in smallest_mode_for_size, at stor-layout.c:219

[Bug c/37955] internal compiler error: in vectorizable_store, at tree-vect-transform.c:5447

[Bug c/37985] New: unsigned char shift lacks "statement with no effect" warning

[Bug c/37985] unsigned char shift lacks "statement with no effect" warning

[Bug c/37987] New: iwmmxt: insn does not satisfy its constraints on (int64_t)

[Bug c/37987] iwmmxt: insn does not satisfy its constraints on (int64_t)

[Bug c/37989] New: PR37528 fix broke --disable-shared on mingw32

[Bug c/37989] PR37528 fix broke --disable-shared on mingw32

[Bug c/37990] New: -Os produces redundant instructions

[Bug c/37990] -Os produces redundant instructions

[Bug c/37995] New: using <stdio.h> fails if gcc invoked in a directory which has a subdirectory called "gcc"

[Bug c/37995] using <stdio.h> fails if gcc invoked in a directory which has a subdirectory called "gcc"

[Bug c/38001] New: regression in 4.3: alignment checks wrongly optimized away (runtime failure)

[Bug c/38001] regression in 4.3: alignment checks wrongly optimized away (runtime failure)

[Bug c/38003] New: ice with -O2

[Bug c/38003] ice with -O2

[Bug c/38011] New: vectorizer ignores alignment, useless versioning

[Bug c/38015] New: Converting between int and vector using intrinsics goes through memory

[Bug c/38018] New: gcc.dg/pr37106-1.c doesn't work

[Bug c/38018] gcc.dg/pr37106-1.c doesn't work

[Bug c/38019] New: Cannot use nested designated initializer with unnamed inner aggregate

[Bug c/38019] Cannot use nested designated initializer with unnamed inner aggregate

[Bug c/38023] New: isinfl(-inf) returns 1

[Bug c/38023] isinfl(-inf) returns 1

[Bug c/38029] New: --with-dwarf2 installation fails

[Bug c/38037] New: false uninitialized warnings when using a pointer as a guard

[Bug c/38037] false uninitialized warnings when using a pointer as a guard

[Bug c/38038] New: -03 -fgraphite-identity causes ICE when compiling ac.f90 Polyhedron 2005 benchmark

[Bug c/38046] New: 'warning: comparison between signed and unsigned' shouldn't be given for equality comparisons

[Bug c/38046] 'warning: comparison between signed and unsigned' shouldn't be given for equality comparisons

[Bug c/38047] New: -Wredundant-decls does not take scope into account

[Bug c/38047] -Wredundant-decls does not take scope into account

[Bug c/38050] New: -Wredundant-decls does not take scope into account

[Bug c/38050] -Wredundant-decls does not take scope into account

[Bug c/38052] New: genautomata segfaults when -O2 is enabled

[Bug c/38052] genautomata segfaults when -O2 is enabled

[Bug c/38056] New: Missed tail calls on ia64

[Bug c/38057] New: BUG: AVR-GCC ATMega2561 wrong addressing (probably eicall).

[Bug c/38061] New: Triangle.c in pymol 1.1r2 ICEs compiler n build_graphite_scops, at graphite.c:1852

[Bug c/38061] Triangle.c in pymol 1.1r2 ICEs compiler n build_graphite_scops, at graphite.c:1852

[Bug c/38090] New: Internal compiler error: in extract_insn while building linux-kernel from git with -Os or -O1 and higher

[Bug c/38090] Internal compiler error: in extract_insn while building linux-kernel from git with -Os or -O1 and higher

[Bug c/38091] New: [Patch] H8SX: Bit instructions enhancement

[Bug c/38091] [Patch] H8SX: Bit instructions enhancement

[Bug c/38093] New: undefined predicates in bfin.md

[Bug c/38096] New: optimization regression

[Bug c/38096] optimization regression

[Bug c/38105] New: -Wundef -Werror -Wno-error=undef result in error, not warning

[Bug c/38107] New: gcc source contains a struct with no data members (actually 1 byte in size) and compiler does not initialize it, resulting in IBM Rational Purify reporting an Uninitialized Memory Read.

[Bug c/38110] New: gcc.dg/pr30286.c fails on i686-apple-darwin9

[Bug c/38110] gcc.dg/pr30286.c fails on i686-apple-darwin9

[Bug c/38116] New: Excessive warnings when using assert and -Wconversion on 64bit platforms

[Bug c/38116] Excessive warnings when using assert and -Wconversion on 64bit platforms

[Bug c/38121] New: Excessive warnings when using -Wconversion and char/bool/short function arguments

[Bug c/38121] Excessive warnings when using -Wconversion and char/bool/short function arguments

[Bug c/38126] New: suboptimal code for (a && b || !a && !b)

[Bug c/38133] New: xgcc: Internal error: Killed (program cc1) by compiling gcc 4.3.2

[Bug c/38133] xgcc: Internal error: Killed (program cc1) by compiling gcc 4.3.2

[Bug c/38134] New: gcc-4.4 speed regression with sse code

[Bug c/38134] gcc-4.4 speed regression with sse code

[Bug c/38136] New: vim crashes on startup when compiled with -O3 but works with -O2

[Bug c/38136] vim crashes on startup when compiled with -O3 but works with -O2

[Bug c/38140] New: ice for C code with -O2

[Bug c/38140] [4.4 Regression] ice for C code with -O2

[Bug c/38140] ice for C code with -O2

[Bug c/38157] New: -fconserve-stack enabled by default

[Bug c/38167] New: Inline accessor to stdin is breaks on -O2 optimization

[Bug c/38167] Accessor to stdin breaks on -O2 optimization

[Bug c/38167] Accessor to stdin is breaks on -O2 optimization

[Bug c/38167] Inline accessor to stdin is breaks on -O2 optimization

[Bug c/38179] New: need a warning: macro parameter is not a whole expression within macro body

[Bug c/38179] need a warning: macro parameter is not a whole expression within macro body

[Bug c/38182] New: stddef.h assumes machinee/ansi.h defines _ANSI_H_

[Bug c/38182] stddef.h assumes machinee/ansi.h defines _ANSI_H_

[Bug c/38183] New: Useless move to memory when passing small structs to functions

[Bug c/38183] Useless move to memory when passing small structs to functions

[Bug c/38186] New: when using gcc compile the code with option "-g3", I find the inline assemble code are palced in section .debug_macinfo

[Bug c/38186] when using gcc compile the code with option "-g3", I find the inline assemble code are palced in section .debug_macinfo

[Bug c/38187] New: when using gcc compile the code with option "-g3", I find the inline assemble code are palced in section .debug_macinfo

[Bug c/38187] when using gcc compile the code with option "-g3", I find the inline assemble code are palced in section .debug_macinfo

[Bug c/38209] New: [avr] branch optimisation generates worse code

[Bug c/38209] [avr] branch optimisation generates worse code

[Bug c/38214] New: Unrecognized command line option "-fipa-marix-reorg" although it's documented

[Bug c/38214] Unrecognized command line option "-fipa-marix-reorg" although it's documented

[Bug c/38217] New: gcc.dg/sync-2.c and gcc.dg/sync-3.c fail execution test on powerpc-apple-darwin9

[Bug c/38217] gcc.dg/sync-2.c and gcc.dg/sync-3.c fail execution test on powerpc-apple-darwin9

[Bug c/38218] New: gcc.dg/and-1.c scan-assembler-not nand fails on powerpc-apple-darwin9

[Bug c/38218] gcc.dg/and-1.c scan-assembler-not nand fails on powerpc-apple-darwin9

[Bug c/38219] New: gcc.dg/tree-ssa/vrp47.c fails on powerpc-apple-darwin9

[Bug c/38219] gcc.dg/tree-ssa/vrp47.c fails on powerpc-apple-darwin9

[Bug c/38227] New: gcc fails to correctly pass arguments with ms_abi function pointers

[Bug c/38227] gcc fails to correctly pass arguments with ms_abi function pointers

[Bug c/38231] New: Improperly parsing -g -o causes bad info to be passed to ld on FreeBSD and ld segfaults

[Bug c/38231] Improperly parsing -g -o causes bad info to be passed to ld on FreeBSD and ld segfaults

[Bug c/38239] New: mcount in gmon.o change register ecx

[Bug c/38243] New: Restrict constraint violation not an error with -pedantic-errors

[Bug c/38243] Restrict constraint violation not an error with -pedantic-errors

[Bug c/38245] New: apparent improper segfault in compiler output

[Bug c/38246] New: Restrict constraint violation not an error with -pedantic-errors

[Bug c/38246] Restrict constraint violation not an error with -pedantic-errors

[Bug c/38269] New: Segmentation fault in main_block_label when using -fno-unit-at-a-time and precompiled headers containing inline functions

[Bug c/38269] Segmentation fault in main_block_label when using -fno-unit-at-a-time and precompiled headers containing inline functions

[Bug c/38274] New: why the option "-fstack-protector-all" doesn't works?

[Bug c/38279] New: Float point exception while compiling firefox using profile guided optimization

[Bug c/38279] Float point exception while compiling firefox using profile guided optimization

[Bug c/38281] New: ice: Segmentation fault

[Bug c/38286] New: configure: error: cannot compute suffix of object files - cannot find as

[Bug c/38286] configure: error: cannot compute suffix of object files - cannot find as

[Bug c/38295] New: Support pointer difference as constant in static initializer

[Bug c/38295] Support pointer difference as constant in static initializer

[Bug c/38296] New: documentation: improve documentation of __builtin_constant_p()

[Bug c/38299] New: internal error: segmentation fault

[Bug c/38308] New: -Wformat does not work for wide strings

[Bug c/38308] -Wformat does not work for wide strings

[Bug c/38310] New: -ftree-parallelize-loops=4 causes ICE with gcc-4.3.2

[Bug c/38310] -ftree-parallelize-loops=4 causes ICE with gcc-4.3.2

[Bug c/38322] New: ICE in gcc.dg/cpp/trad/include.c -fno-show-column at -m32 and -m64

[Bug c/448] <stdint.h>-related issues (C99 issues)

[Bug c/6614] [-Wconversion] incorrect conversion warning for function taking a short

[Bug c/9049] No support for selective enabling/disabling of some warnings

[Bug debug/26908] -g3 (-ggdb3) emits broken calls to asm-defined functions

[Bug debug/27017] [4.2/4.3 Regression] Debug information for static local class members are not emitted

[Bug debug/27017] [4.2/4.3/4.4 Regression] Debug information for static local class members are not emitted

[Bug debug/27574] [4.2/4.3 Regression] MIssing debug info at -O0 for a local variable in a C++ constructor

[Bug debug/27574] [4.2/4.3/4.4 Regression] MIssing debug info at -O0 for a local variable in a C++ constructor

[Bug debug/30161] GCC should generate dwarf info about template parameters

[Bug debug/36690] [4.3/4.4 Regression] .debug_line first line is behind the first instruction

[Bug debug/37616] Lines with 'break', 'goto', and 'continue' are not available for debugging.

[Bug debug/37941] Too many DW_TAG_Subprogram tags generated

[Bug debug/37982] Extraneous DW_TAG_variable tag

[Bug debug/38058] New: gcc does not emit DW_TAG_template_type_parameter

[Bug debug/38058] gcc does not emit DW_TAG_template_type_parameter

[Bug debug/38101] New: dbxout_expand_expr() doesn't check return value of DECL_VALUE_EXPR()

[Bug debug/38101] dbxout_expand_expr() doesn't check return value of DECL_VALUE_EXPR()

[Bug debug/38226] New: Configure time option "--with-stabs" does not work

[Bug debug/38226] Configure time option "--with-stabs" does not work

[Bug driver/21706] MAXPATHLEN usage in [gcc]/gcc/tlink.c

[Bug driver/29075] g++.dg/rtti/repo1.C fails to link on Darwin PPC at -m64

[Bug driver/38000] [4.3/4.4 Regression] System header files not found once -isystem /usr/include is used

[Bug driver/38316] New: The "--help=xxx" option does not play well with -pipe or -save-temps

[Bug fortran/19925] Implied do-loop in an initialization expression is broken

[Bug fortran/27766] [meta] -fbounds-check related bugs

[Bug fortran/30388] gfortran42 is slower than g77 3.4 about 10%

[Bug fortran/31610] ICE with transfer, merge in gfc_conv_expr_descriptor

[Bug fortran/32512] efficiency of RESHAPE and SPREAD

[Bug fortran/32795] allocatable components are nullified prematurely

[Bug fortran/33584] FAIL: gfortran.dg/integer_exponentiation_4.f90 -O (internal compiler error)

[Bug fortran/33759] ICE in transfer_simplify_4.f90 at any level of optimization

[Bug fortran/34136] Add entry point and symbol for linker

[Bug fortran/34143] alloc_comp_constructor.f90 fails with -fdefault-integer-8

[Bug fortran/34640] ICE when assigning item of a derived-component to a pointer

[Bug fortran/34771] [4.3 only] Parenthesis around character variables: No expression

[Bug fortran/34820] internal compiler error: in gfc_conv_descriptor_data_get, at fortran/trans-array.c:147

[Bug fortran/34871] Flavor VARIABLE vs. FUNCTION: Accepts invalid

[Bug fortran/34955] transfer_assumed_size_1.f90: Valgrind error: invalid read of size 3

[Bug fortran/35040] usage of init expression in its own definition

[Bug fortran/35219] zdotu (copy of BLAS version) works in x86, x86_64, segfaults in arm.

[Bug fortran/35681] wrong result for vector subscripted array expression in MVBITS

[Bug fortran/35718] deallocating non-allocated pointer target does not fail

[Bug fortran/35754] -std=f95: Reject "1P2E12.4" w/o a comma after the "P"

[Bug fortran/35769] inappropriate FORALL error

[Bug fortran/35810] [TR 15581 / F2003] Automatic reallocation on assignment to allocatable variables

[Bug fortran/35820] internal compiler error with nested FORALL

[Bug fortran/35824] Overloading problems with derived type with allocatable array

[Bug fortran/35840] ICE for character expression in I/O specifier

[Bug fortran/35937] Wrong type for charlength of function

[Bug fortran/35952] Segmentation fault with character strings only when compiling with -funroll-loops and -O3

[Bug fortran/35983] C_LOC in derived type constructor gives weird result

[Bug fortran/36205] Hangup with array_constructor_24.f90 at -O3

[Bug fortran/36322] ICE with PROCEDURE using a complicated interface

[Bug fortran/36426] Endless loop in gfc_apply_interface_mapping_to_expr

[Bug fortran/36463] [4.4 regression] gfc_get_default_type(): Bad symbol

[Bug fortran/36463] [4.4 Regression] ICE in expand_expr_real_1, at expr.c:7264 with rev.136554

[Bug fortran/36463] gfc_get_default_type(): Bad symbol

[Bug fortran/36526] pointer in pure function

[Bug fortran/36704] Procedure pointer as function result

[Bug fortran/36928] array temporary for interleaving assignment

[Bug fortran/36933] unneeded temporary with derived type containing an array as argument

[Bug fortran/37131] inline matmul for small matrix sizes

[Bug fortran/37159] RANDOM_SEED: PUT= check array size at compile time

[Bug fortran/37254] Reject valid PROCEDURE statement with implicit interface

[Bug fortran/37319] [4.4 regression] gfortran.dg/function_kinds_5.f90 fails

[Bug fortran/37445] Host-associated proc not found if same-name generic is use-associated

[Bug fortran/37468] unknown option -i<something> not recognized by gfortran driver

[Bug fortran/37469] Invalid GMP usage

[Bug fortran/37469] Invalid GMP usage on gfortran.dg/parameter_array_init_3.f90

[Bug fortran/37469] invalid GMP usage on gfortran.dg/parameter_array_init_3.f90

[Bug fortran/37472] bad output on default-format write of double in common block with -m64 flag i

[Bug fortran/37597] internal procedure fails to access host-associated module procedure

[Bug fortran/37644] compiler Segmentation fault

[Bug fortran/37735] Allocatable components in vectors of derived types cause ICE on assignment

[Bug fortran/37749] ICE on array section with vector subscript

[Bug fortran/37779] Missing RECURSIVE not detected

[Bug fortran/37792] ICE in gfc_conv_array_initializer; works with -fno-range-check

[Bug fortran/37803] Call mpfr_check_range after setting emin/emax

[Bug fortran/37821] [4.4 Regression] gfortran is ignoring #includes with the syntax <file.h>

[Bug fortran/37829] ICE in resolve_symbol

[Bug fortran/37832] System_Clock

[Bug fortran/37833] internal compiler error: in gfc_conv_function_call, at fortran/trans-expr.c:1108

[Bug fortran/37836] ICE in gfc_trans_auto_array_allocation

[Bug fortran/37903] [4.3/4.4 Regression] wrong-code for complicated vector subscripts

[Bug fortran/37925] some error during 'make' on GCC 4.3.2

[Bug fortran/37926] Program gives wrong output (connected to char len)

[Bug fortran/37988] New: Edit descriptor checking (compile time) for "<Holerith>T)"

[Bug fortran/37988] Edit descriptor checking (compile time) for "<Holerith>T)"

[Bug fortran/37992] New: [4.4 Regression] ICE segfault for "character(len=len(x)) :: foo,x"

[Bug fortran/37992] [4.4 Regression] ICE segfault for "character(len=len(x)) :: foo,x"

[Bug fortran/37992] ICE while resolving charlen for rejected statements

[Bug fortran/37999] New: Fortran shape and kind intrinsic

[Bug fortran/37999] Fortran shape and kind intrinsic

[Bug fortran/38024] New: possibly syndax erros with Fortran 95

[Bug fortran/38024] possibly syndax erros with Fortran 95

[Bug fortran/38024] possibly syntax erros with Fortran 95

[Bug fortran/38033] New: Bounds of a pointer/allocatable array not stabilized

[Bug fortran/38033] Bounds of a pointer/allocatable array not stabilized

[Bug fortran/38039] New: -02/O3 -fgraphite-identity causes ICE when compiling aermod.f90 Polyhedron 2005 benchmark

[Bug fortran/38040] New: -O2 -fgraphite-identity causes ICE compiling capacita.f90 Polyhedron 2005 benchmark

[Bug fortran/38041] New: -O2 -fgraphite-identity causes ICE compiling channel.f90 Polyhedron 2005 benchmark

[Bug fortran/38042] New: -O1/-O2/-O3 -fgraphite-identity causes ICE when compiling fatigue.f90 Polyhedron 2005 benchmark

[Bug fortran/38043] New: -O1/-O2/-O3 -fgraphite-identity causes ICE when compiling gas_dyn.f90 Polyhedron 2005 benchmark

[Bug fortran/38044] New: -O1/-O2/-O3 -fgraphite-identity causes ICE when compiling induct.f90 Polyhedron 2005 benchmark

[Bug fortran/38044] -O1/-O2/-O3 -fgraphite-identity causes ICE when compiling induct.f90 Polyhedron 2005 benchmark

[Bug fortran/38060] New: gfortran code generation error using -03 that is removed when using -O2

[Bug fortran/38060] gfortran code generation error using -03 that is removed when using -O2

[Bug fortran/38065] New: bug5

[Bug fortran/38065] bug5

[Bug fortran/38065] private/public confusion with a contained function

[Bug fortran/38066] New: bug6 ambiguous reference

[Bug fortran/38066] bug6 ambiguous reference

[Bug fortran/38082] New: string truncated on return from subroutine (calling mkdtemp bind(c))

[Bug fortran/38082] string truncated on return from subroutine (calling mkdtemp bind(c))

[Bug fortran/38094] New: gfortran.dg/private_type_4.f90 -O doesn't work

[Bug fortran/38094] [4.4 regression] gfortran.dg/private_type_4.f90 -O doesn't work

[Bug fortran/38095] New: character ICE

[Bug fortran/38095] character ICE

[Bug fortran/38111] New: unneeded temporary

[Bug fortran/38111] unneeded temporary

[Bug fortran/38112] New: unneeded temporary

[Bug fortran/38112] unneeded temporary

[Bug fortran/38113] New: -Warray-temporaries output

[Bug fortran/38113] on warning/error: skip whitespaces, move position marker to actual variable name

[Bug fortran/38114] New: unneeded temp

[Bug fortran/38114] unneeded temp

[Bug fortran/38115] New: unneeded temp

[Bug fortran/38115] unneeded temp

[Bug fortran/38119] New: [4.4 Regression] character ICE in gfc_trans_create_temp_array

[Bug fortran/38119] [4.4 Regression] character ICE in gfc_trans_create_temp_array

[Bug fortran/38122] New: "file already opened in another unit" error when opening /dev/null or /dev/tty twice

[Bug fortran/38122] "file already opened in another unit" error when opening /dev/null or /dev/tty twice

[Bug fortran/38135] New: FORALL gives wrong result

[Bug fortran/38135] FORALL gives wrong result

[Bug fortran/38135] RESHAPE gives wrong result

[Bug fortran/38137] New: MERGE: -fbounds-check runtime check for same string length

[Bug fortran/38138] New: [4.4 Regression] Revision 141890 caused gfortran.dg/proc_decl_18.f90

[Bug fortran/38138] [4.4 Regression] Revision 141890 caused gfortran.dg/proc_decl_18.f90

[Bug fortran/38152] New: ICE for procedure pointer assignment

[Bug fortran/38152] ICE for procedure pointer assignment

[Bug fortran/38160] New: C Binding: Kind parameter checking too strict and too late

[Bug fortran/38160] C Binding: Kind parameter checking too strict and too late

[Bug fortran/38171] New: equivalence and nested modules broken

[Bug fortran/38171] [regression] equivalence and nested modules broken

[Bug fortran/38181] New: calls to SIZE not optimized out of loops

[Bug fortran/38181] calls to SIZE not optimized out of loops

[Bug fortran/38184] New: invariant RESHAPE not expanded if SOURCE is empty

[Bug fortran/38184] invariant RESHAPE not expanded if SOURCE is empty

[Bug fortran/38188] New: Inconsistent function results depending on irrelevant write statement

[Bug fortran/38188] Inconsistent function results depending on irrelevant write statement

[Bug fortran/38199] New: missed optimization, regression: I/O performance

[Bug fortran/38199] [4.4 regression] I/O performance

[Bug fortran/38199] missed optimization, regression: I/O performance

[Bug fortran/38199] missed optimization: I/O performance

[Bug fortran/38205] New: Tranformational function SUM rejected in initialization expressions

[Bug fortran/38205] Tranformational function SUM rejected in initialization expressions

[Bug fortran/38220] New: C_LOC intrinsic non-pure and without explicit interface

[Bug fortran/38247] New: problem with contained subprocedure.

[Bug fortran/38247] problem with contained subprocedure.

[Bug fortran/38248] New: Fatal Error: Reading module mmm: Expected left parenthesis

[Bug fortran/38248] Fatal Error: Reading module mmm: Expected left parenthesis

[Bug fortran/38248] Ignored temporary module files manipulation errors

[Bug fortran/38249] New: read(*,*) seems to have broken

[Bug fortran/38249] read(*,*) seems to have broken

[Bug fortran/38252] New: Empty function with CONTAINS triggers Internal Error

[Bug fortran/38252] [4.4 Regression] Empty function with CONTAINS triggers Internal Error

[Bug fortran/38252] Empty function with CONTAINS triggers Internal Error

[Bug fortran/38259] New: Add version number to .mod file

[Bug fortran/38268] New: gfortran doesn't link any 64 bits binaries on Solaris

[Bug fortran/38268] gfortran doesn't link any 64 bits binaries on Solaris

[Bug fortran/38273] New: Cray pointers: Document that

[Bug fortran/38282] New: Add the remaining HPF bit intrinsics

[Bug fortran/38282] Add the remaining HPF bit intrinsics

[Bug fortran/38285] New: Wrong I/O output: Interaction between F and P for output

[Bug fortran/38285] Wrong I/O output: Interaction between F and P for output

[Bug fortran/38289] New: "procedure( ), pointer" rejected

[Bug fortran/38289] "procedure( ), pointer" rejected

[Bug fortran/38290] New: ICE with invalid proc-pointer

[Bug fortran/38290] ICE with invalid proc-pointer

[Bug fortran/38291] New: Rejects I/O with POS= if FMT=*

[Bug fortran/38291] Rejects I/O with POS= if FMT=*

[Bug fortran/38303] New: poor error message

[Bug fortran/38303] poor error message

[Bug fortran/38305] New: Bug in gfortran with combination of P and F in a format.

[Bug fortran/38305] Bug in gfortran with combination of P and F in a format.

[Bug fortran/38312] New: poor error message

[Bug fortran/38312] poor error message

[Bug fortran/38318] New: moving the allocation of temps out of loops.

[Bug fortran/38319] New: Memory leaks in allocatable component expressions

[Bug fortran/38319] Memory leaks in allocatable component expressions

[Bug fortran/38323] New: gfortran.dg/parameter_array_init_3.f90 -O compilation test ICEs at -m32 and -m64

[Bug fortran/38323] gfortran.dg/parameter_array_init_3.f90 -O compilation test ICEs at -m32 and -m64

[Bug fortran/38324] New: Wrong lbound given to allocatable components

[Bug gcov-profile/32316] internal compiler error: Segmentation fault

[Bug gcov-profile/38292] New: corrupted profile info with -O[23] -fprofile-use

[Bug java/35217] TestClosureGC.jar execution - gij test regression on i686-apple-darwin9

[Bug java/37068] [4.4 Regression] libgcj linkage failure: Incorrect library ABI version detected

[Bug java/37900] [4.4 Regression] StringBuffer_1 failures

[Bug java/38075] New: Scanner(System.in) causes next*() to behave incorrectly

[Bug java/38176] New: Java: 4 * use of toUpperCase/toLowerCase().equals()

[Bug java/38189] New: Java: set but not used local variable in tight loop

[Bug java/38190] New: ConcurrentHashMap.java: 2 * unused local variables

[Bug java/38191] New: gjdoc/Main.java: dead local variable

[Bug java/38192] New: SwingCallbackHandler.java: remove unused local variable

[Bug java/38193] New: HashMap.java: unused local variable

[Bug java/38195] New: ClassRmicCompiler.java: remove unused variable

[Bug java/38197] New: JobSheetsSupported.java: unused local variable

[Bug java/38198] New: DefaultTableColumnModel.java: redundant call to new

[Bug java/38298] New: libjava link failures.

[Bug libf2c/38194] New: DefaultListSelectionModel.java: remove dead for loop ?

[Bug libffi/38129] New: FAIL: libffi.special/unwindtest.cc -shared-libgcc -lstdc++ execution test

[Bug libffi/38129] FAIL: libffi.special/unwindtest.cc -shared-libgcc -lstdc++ execution test

[Bug libfortran/25830] [libgfortran] Optionally support multi-process locking

[Bug libfortran/32784] [win32] Using 'CONOUT$', 'CONIN$', or 'CONERR$' as assigned file generates Fortran runtime error: Bad file descriptor

[Bug libfortran/37294] Namelist I/O to array character internal units

[Bug libfortran/37754] [4.4 Regression] READ I/O Performance regression from 4.3 to 4.4

[Bug libfortran/37839] st_parameter_dt has unwanted padding, is out of sync with compiler

[Bug libfortran/38097] New: gfortran does not allow blanks in exponent in float (even with BN)

[Bug libfortran/38097] I/O with blanks in exponent fails; blank="NULL", BN edit descriptor

[Bug libfortran/38225] New: [4.4 regression] RESHAPE bounds with multi-dimensional SOURCE

[Bug libfortran/38225] [4.4 regression] RESHAPE bounds with multi-dimensional SOURCE

[Bug libfortran/38234] New: [4.4 Regression] In Reshape, SOURCE can be bigger than result

[Bug libfortran/38234] [4.4 Regression] In Reshape, SOURCE can be bigger than result

[Bug libgcj/16923] -D* Options passed to JNI_CreateJavaVM are ignored

[Bug libgcj/33764] [4.2/4.3 regression] gij is built as 32-bit binary when building multilib gcc

[Bug libgcj/33764] [4.2/4.3/4.4 regression] gij is built as 32-bit binary when building multilib gcc

[Bug libgcj/38006] New: Incorrect proplist on inherit.png

[Bug libgcj/38102] New: error building libjavamath on OS X 10.4.11 PPC

[Bug libgcj/38162] New: [4.4 Regression] FAIL: gctest

[Bug libgcj/38251] New: [4.4 Regression] tools.zip doesn't build on systems with short command lines

[Bug libgcj/38251] [4.4 Regression] tools.zip doesn't build on systems with short command lines

[Bug libgomp/26165] Cannot find libgomp.spec after 'make install' on x86_64 and ppc64

[Bug libgomp/28708] FAIL: libgomp.fortran/vla6.f90 -O0 execution test

[Bug libgomp/29987] libgomp.c++/ctor-9.C failure

[Bug libgomp/37935] omp_set_schedule not documented in libgomp.texi

[Bug libgomp/37938] libgomp testsuite failures on ia64-linux

[Bug libgomp/38086] New: libgomp fails to build if assembler doesn't support .symver

[Bug libgomp/38270] New: libgomp test failures due to missing memory barrier

[Bug libgomp/38270] libgomp test failures due to missing memory barrier

[Bug libgomp/38283] New: FAIL: libgomp.fortran/pr25162.f

[Bug libgomp/38283] FAIL: libgomp.fortran/pr25162.f

[Bug libobjc/27466] RFE: Support for libobjc equivalent of std::set_unexpected

[Bug libobjc/38307] New: Calling of the +initialize method is not completely thread-safe

[Bug libstdc++/14410] Bug with implementation of set for const iterators in g++ ...

[Bug libstdc++/24803] [c++0x] reference_wrapper and pointers to member functions

[Bug libstdc++/25191] exception_defines.h #defines try/catch

[Bug libstdc++/28811] --with-pic vs static libraries and libstdc++

[Bug libstdc++/35569] [c++0x] std::bind result functor doesn't accept rvalues

[Bug libstdc++/36505] C++ includes do not work

[Bug libstdc++/37144] A bug in include/ext/pb_ds/detail/pat_trie_/constructors_destructor_fn_imps.hpp

[Bug libstdc++/37351] [c++0x] std::result_of requires nested template

[Bug libstdc++/37718] Demangling of variadic functions

[Bug libstdc++/37957] Wrong behaviour of num_get<>::do_get(bool) in the case when one target sequence is a prefix of the other one

[Bug libstdc++/37958] num_get<>::do_get(bool) sets eofbit flag incorrectly when boolalpha == true

[Bug libstdc++/37986] New: std::tr1::variate_generator does not conform to TR1.

[Bug libstdc++/37986] std::tr1::variate_generator does not conform to TR1.

[Bug libstdc++/38000] [4.3 Regression] System header files not found once -isystem /usr/include is used

[Bug libstdc++/38000] [4.3/4.4 Regression] System header files not found once -isystem /usr/include is used

[Bug libstdc++/38017] New: [4.4 Regression] 30_threads/thread/cons/X.cc

[Bug libstdc++/38017] [4.4 Regression] 30_threads/thread/cons/X.cc

[Bug libstdc++/38067] monetary_members.cc: 4 * call to wrong C++ delete

[Bug libstdc++/38080] New: dead links in libstdc++ headers

[Bug libstdc++/38081] New: time_get<>::do_get_weekday does not always recognize full names of weekdays

[Bug libstdc++/38081] time_get<>::do_get_weekday does not always recognize full names of weekdays

[Bug libstdc++/38092] New: libstdc++ doesn't build with GNU ld 2.19 and Sun as: no .symver support

[Bug libstdc++/38107] gcc source contains a struct with no data members (actually 1 byte in size) and compiler does not initialize it, resulting in IBM Rational Purify reporting an Uninitialized Memory Read.

[Bug libstdc++/38128] New: FAIL: ext/pb_ds/regression/hash_data_map_rand.cc execution test

[Bug libstdc++/38128] FAIL: ext/pb_ds/regression/hash_data_map_rand.cc execution test

[Bug libstdc++/38196] New: num_put<>::do_put(bool) performs 'internal' padding incorrectly when boolalpha==true

[Bug libstdc++/38196] num_put<>::do_put(bool) performs 'internal' padding incorrectly when boolalpha==true

[Bug libstdc++/38210] New: num_put<>::do_put(void*) performs padding incorrectly when adjustfield==internal

[Bug libstdc++/38210] num_put<>::do_put(void*) performs padding incorrectly when adjustfield==internal

[Bug libstdc++/38233] New: 'map' value type + new uninitted const member warnings causes error

[Bug libstdc++/38233] 'map' value type + new uninitted const member warnings causes error

[Bug libstdc++/38233] [4.4 Regression] 'map' value type + new uninitted const member warnings causes error

[Bug libstdc++/38238] New: std::tr1::bind fails to compile with pointer to member function

[Bug libstdc++/38238] std::tr1::bind fails to compile with pointer to member function

[Bug libstdc++/38244] New: bitset initialization from 0 rejected.

[Bug libstdc++/38244] [4.4 Regression] bitset initialization from 0 rejected.

[Bug libstdc++/38244] bitset initialization from 0 rejected.

[Bug libstdc++/38265] STL treats explicit constructors as converting constructors

[Bug libstdc++/38304] New: Conflict with the STL standard. std::set<T>::iterator

[Bug libstdc++/38304] Conflict with the STL standard. std::set<T>::iterator

[Bug middle-end/17982] stop calling assemble_external before final assembly output time

[Bug middle-end/19020] libcalls are removed (-ftrapv does not work)

[Bug middle-end/19419] Overlapping memcpy with discriminated types

[Bug middle-end/22141] [4.2/4.3/4.4 Regression] Missing optimization when storing structures

[Bug middle-end/29215] [4.2/4.3 Regression] extra store for memcpy

[Bug middle-end/29215] [4.2/4.3/4.4 Regression] extra store for memcpy

[Bug middle-end/29609] [4.2/4.3/4.4 Regression] Even with -O0 -g gcc optimizes a goto away and I cannot debug

[Bug middle-end/30286] [4.1 Regression] Segfault with -O2 -ftrapv

[Bug middle-end/30521] "if (i == n) ++i;" or "i += i == n;"?

[Bug middle-end/31029] Fold does not fold a + C == a

[Bug middle-end/31029] Fold does not fold C - a == a

[Bug middle-end/31878] Spurious warnings generated due to not optimizing first

[Bug middle-end/34483] wo_prof_two_strs.c:56: internal compiler error: in find_new_var_of_type, at ipa-struct-reorg.c:605

[Bug middle-end/35193] [4.3/4.4 Regression] can't find a register in class 'R1_REGS' while reloading 'asm'

[Bug middle-end/35314] [4.2/4.3 regression] ICE with __builtin_setjmp and -fmudflap

[Bug middle-end/35314] [4.2/4.3/4.4 regression] ICE with __builtin_setjmp and -fmudflap

[Bug middle-end/35560] Missing CSE/PRE for memory operations involved in virtual call.

[Bug middle-end/35964] ICE with -funroll-loops on arm/arm eabi

[Bug middle-end/36125] [4.4 Regression] FAIL: 26_numerics/complex/13450.cc: ICE in verify_gimple_expr, at tree-cfg.c:3962

[Bug middle-end/36315] [4.4 Regression] ICE with -fprofile-use (Invalid read of size 8)

[Bug middle-end/36359] missed optimization in some cases with PRE VRP and other passes combined together

[Bug middle-end/36509] [4.4 Regression]: gcc.dg/Wstrict-aliasing-float-ptr-int-obj.c

[Bug middle-end/36550] Wrong "may be used uninitialized" warning (conditional PHIs)

[Bug middle-end/36902] Array bound warning with dead code after optimization

[Bug middle-end/37071] [4.4 Regression] EH is broken

[Bug middle-end/37135] [4.3/4.4 Regression] code size increase for bit-fields assignment

[Bug middle-end/37286] [4.4 regression] gfortran, trunk: ICE subst_stack_regs_pat, at reg-stack.c:1537

[Bug middle-end/37316] [4.4 Regression] Small structs are not passed correctly on hppa64-*-*

[Bug middle-end/37323] [4.4 Regression] __builtin_apply failures

Re: [Bug middle-end/37379] [graphite] ICE compiling aermod.f90 with -ffast-math -floop-block -O2 -fgraphite

[Bug middle-end/37565] __optimize__ attribute doesn't work correctly

[Bug middle-end/37672] ICE when compile libiberty/md5.c with -fgraphite

[Bug middle-end/37742] [4.4 Regression] ICE in vectorizer with restrict pointer

[Bug middle-end/37790] limits-fnargs.c takes very long time to compile at -O2

[Bug middle-end/37807] Exponential compile time with MMX builtins.

[Bug middle-end/37809] [4.2/4.3 Regression] Incorrect code with MMX right shift __builtin_ia32_psradi

[Bug middle-end/37809] [4.2/4.3/4.4 Regression] Incorrect code with MMX right shift __builtin_ia32_psradi

[Bug middle-end/37843] [4.4 Regression] unaligned stack in main due to tail call optimization

[Bug middle-end/37851] [graphite] ICE in expand_scalar_variables_expr, at graphite.c:3617

[Bug middle-end/37857] [graphite] Segmentation fault

[Bug middle-end/37858] [4.3 Regression] ICE when "-fdump-ipa-all -dv" is used

[Bug middle-end/37858] [4.3/4.4 Regression] ICE when "-fdump-ipa-all -dv" is used

[Bug middle-end/37861] [4.3 Regression] Bogus array bounds warning

[Bug middle-end/37861] [4.3/4.4 Regression] Bogus array bounds warning

[Bug middle-end/37861] Bogus array bounds warning

[Bug middle-end/37870] [4.3 Regression] ICE in extract_bit_field_1

[Bug middle-end/37883] [graphite] ICE : in scan_tree_for_params, at graphite.c:2274

[Bug middle-end/37902] [4.3 Regression] in_system_header bug

[Bug middle-end/37908] atomic NAND op generate wrong code; __sync_nand_and_fetch, __sync_fetch_and_nand

[Bug middle-end/37914] [4.4 Regression] internal compiler error: vector VEC(basic_block,base) index domain error

[Bug middle-end/37928] [graphite] ICE :Segmentation fault

[Bug middle-end/37943] [graphite] ICE : in build_graphite_scops, at graphite.c:1823

[Bug middle-end/37951] -ftree-parallelize-loops=2 fails for MA57

[Bug middle-end/37976] [4.4 Regression] ICE in insert_into_preds_of_block

[Bug middle-end/37980] [graphite] ICE : verify_ssa failed

[Bug middle-end/38002] gcc crash using -fvisibility-ms-compat

[Bug middle-end/38004] New: [4.4 Regression] g++.dg/vect/pr36648.cc

[Bug middle-end/38004] [4.4 Regression] g++.dg/vect/pr36648.cc

[Bug middle-end/38012] vectorizer ignores 'restrict'

[Bug middle-end/38028] New: [4.4 Regression] eh failures on spu-elf

[Bug middle-end/38028] [4.4 Regression] eh failures on spu-elf

[Bug middle-end/38038] [graphite] -03 -fgraphite-identity causes ICE when compiling ac.f90 Polyhedron 2005 benchmark

[Bug middle-end/38039] [graphite] -02/O3 -fgraphite-identity causes ICE when compiling aermod.f90 Polyhedron 2005 benchmark

[Bug middle-end/38041] -O2 -fgraphite-identity causes ICE compiling channel.f90 Polyhedron 2005 benchmark

[Bug middle-end/38044] -O1/-O2/-O3 -fgraphite-identity causes ICE when compiling induct.f90 Polyhedron 2005 benchmark

[Bug middle-end/38054] New: Assertion failed in change_decl_assembler_name()

[Bug middle-end/38054] Assertion failed in change_decl_assembler_name()

[Bug middle-end/38059] New: Compile time regression for gcc.dg/20020425-1.c

[Bug middle-end/38070] New: ICE in compare_values_warnv

[Bug middle-end/38070] ICE in compare_values_warnv

[Bug middle-end/38073] New: [graphite] ICE: Segmentation fault

[Bug middle-end/38073] [graphite] ICE: Segmentation fault

[Bug middle-end/38074] New: [4.4 Regression] missed inlining since IRA merge on Core2 Duo

[Bug middle-end/38074] [4.4 Regression] missed inlining since IRA merge on Core2 Duo

[Bug middle-end/38083] New: [graphite] ICE: in verify_loop_structure, at cfgloop.c:1569

[Bug middle-end/38083] [graphite] ICE: in verify_loop_structure, at cfgloop.c:1569

[Bug middle-end/38084] New: [graphite] ICE : in build_graphite_scops, at graphite.c:1829

[Bug middle-end/38084] [graphite] ICE : in build_graphite_scops, at graphite.c:1829

[Bug middle-end/38125] New: [graphite] ICE :Segmentation fault

[Bug middle-end/38125] [graphite] ICE :Segmentation fault

[Bug middle-end/38126] suboptimal code for (a && b || !a && !b)

[Bug middle-end/38133] xgcc: Internal error: Killed (program cc1) by compiling gcc 4.3.2

[Bug middle-end/38140] [4.4 Regression] ice for C code with -O2

[Bug middle-end/38151] structures with _Complex arguments are not passed correctly

[Bug middle-end/38157] -fconserve-stack enabled by default

[Bug middle-end/38158] New: FAIL: gcc.c-torture/execute/pr38051.c execution

[Bug middle-end/38158] FAIL: gcc.c-torture/execute/pr38051.c execution

[Bug middle-end/38167] [4.2 Regression] Accessor to stdin breaks on -O2 optimization

[Bug middle-end/38167] Accessor to stdin breaks on -O2 optimization

[Bug middle-end/38200] [4.4 Regression] internal compiler error: in find_func_aliases, at tree-ssa-structalias.c:3905

[Bug middle-end/38204] New: PRE for post dominating expressions

[Bug middle-end/38204] PRE for post dominating expressions

[Bug middle-end/38209] branch optimisation generates worse code

[Bug middle-end/38212] New: restrict implementation causes wrong-code

[Bug middle-end/38212] restrict implementation causes wrong-code

[Bug middle-end/38219] gcc.dg/tree-ssa/vrp47.c fails on powerpc-apple-darwin9

[Bug middle-end/38236] New: [4.4 Regression] SMT aliases incomplete

[Bug middle-end/38236] [4.4 Regression] SMT aliases incomplete

[Bug middle-end/38237] New: [4.4 regression] multiple weak directives

[Bug middle-end/38237] [4.4 regression] multiple weak directives

[Bug middle-end/38240] New: Vector type definitions not compatible with attribute target

[Bug middle-end/38240] Vector type definitions not compatible with attribute target

[Bug middle-end/38250] New: ICE with -O2 -ftree-loop-distribution

[Bug middle-end/38250] ICE with -O2 -ftree-loop-distribution

[Bug middle-end/38264] New: tree_forwarder_block_p says no to first basic block

[Bug middle-end/38264] tree_forwarder_block_p says no to first basic block

[Bug middle-end/38267] New: rtl epilogues worse than non-rtl epilogues for dbr scheduling

[Bug middle-end/38271] New: Spurious / missing "... used uninitialized in this function" warning

[Bug middle-end/38271] [4.4 Regression] Spurious / missing "... used uninitialized in this function" warning

[Bug middle-end/38271] Spurious / missing "... used uninitialized in this function" warning

[Bug middle-end/38274] why the option "-fstack-protector-all" doesn't works?

[Bug middle-end/38277] New: gcc.c-torture/execute/20010910-1.c wrong code generation by loop distribution enabled

[Bug middle-end/38283] FAIL: libgomp.fortran/pr25162.f

[Bug middle-end/38284] New: verify_stmts failed when compile with -O2 -fira -fipa-pta -fPIC

[Bug middle-end/38284] verify_stmts failed when compile with -O2 -fira -fipa-pta -fPIC

[Bug middle-end/38284] verify_stmts failed when compile with -O2 -fira -fipa-pta -fPIC

[Bug middle-end/38299] internal error: segmentation fault

[Bug middle-end/38310] -ftree-parallelize-loops=4 causes ICE with gcc-4.3.2

[Bug middle-end/38336] New: fold_builtin_memory_op generates invalid GIMPLE

[Bug middle-end/38336] fold_builtin_memory_op generates invalid GIMPLE

[Bug other/27843] gcc-4.2-20060527 make install fails on alphaev68-dec-osf5.1b

[Bug other/30083] double quotes in Makefile confuse solaris /bin/sh

[Bug other/31536] sparc64 build fails with `unknown endianness' error.

[Bug other/32263] Document the required versions of glibc and binutils

[Bug other/346] gcc install clobbers files that it shouldn't touch

[Bug other/37463] [4.4 regression] All Solaris/x86 eh tests fail

[Bug other/37998] New: Unclear documentation of -fno-common

[Bug other/38077] New: strict aliasing is not controllable via the option pragma or is not documented that way

[Bug other/38077] strict aliasing is not controllable via the option pragma or is not documented that way

[Bug other/38108] New: broken c++ diagnostics?

[Bug other/38108] broken c++ diagnostics?

[Bug other/38177] New: Internal compiler error during gcc build with -march=amdfam10

[Bug other/38214] Unrecognized command line option "-fipa-marix-reorg" although it's documented

[Bug other/38294] New: Enable multilib support for mingw

[Bug other/38294] Enable multilib support for mingw

[Bug pch/11654] incorrect stabs when using pre-compiled headers

[Bug pch/13675] #including a precompiled header more than once in the same unit fails

[Bug pch/14933] missing pre-compiled header depends with -MD

[Bug pch/38101] dbxout_expand_expr() doesn't check return value of DECL_VALUE_EXPR()

[Bug pch/9471] #pragma system_header vs. precompiled headers

[Bug preprocessor/35326] [4.2/4.3 regression] ICE with stray digraph token

[Bug preprocessor/38013] New: Option to turn off usage of any precompiled header

[Bug preprocessor/38013] Option to turn off usage of any precompiled header

[Bug preprocessor/38105] -Wundef -Werror -Wno-error=undef result in error, not warning

[Bug preprocessor/38161] New: #elif <non-const expression #defined in this #if> breaks

[Bug preprocessor/38161] [4.4 regression] #elif <non-const expression #defined in this #if> breaks

[Bug preprocessor/38179] need a warning: macro parameter is not a whole expression within macro body

[Bug regression/38200] New: internal compiler error: in find_func_aliases, at tree-ssa-structalias.c:3905

[Bug regression/38223] New: segfault in glib testsuite with trunk

[Bug regression/38223] segfault in glib testsuite with trunk

[Bug regression/38278] New: C++ namespace collision

[Bug rtl-optimization/11826] [ARM] Minor register allocation problem before function return

[Bug rtl-optimization/21676] [4.2/4.3/4.4 Regression] Optimizer regression: SciMark sparse matrix benchmark

[Bug rtl-optimization/32283] [4.3/4.4 regression] Missed induction variable optimization

[Bug rtl-optimization/323] optimized code gives strange floating point results

[Bug rtl-optimization/33249] [4.1 regression] -O3 and -O2 give wrong results

[Bug rtl-optimization/35729] const volatile variable access incorrectly hoisted out of loop

[Bug rtl-optimization/36350] [4.3 Regression] GCC ICE with -frename-registers

[Bug rtl-optimization/36365] [4.3/4.4 Regression] Hang in df_analyze

[Bug rtl-optimization/36438] gcc ICE compiling code with mmx builtin

[Bug rtl-optimization/36758] [4.3/4.4 Regression] addition moved out of the loop when used with an argument

[Bug rtl-optimization/36998] [4.3/4.4 regression] Ada bootstrap broken on i586-*-*

[Bug rtl-optimization/37263] [4.3 Regression] extra code for doloop with unsigned 32bit types on LP64

[Bug rtl-optimization/37296] [4.4 Regression] Bootstrap failure compiling libgcc

[Bug rtl-optimization/37363] [4.4 Regression] Fix for PR 36090 causes libstdc++ regressions

[Bug rtl-optimization/37397] IRA performance impact on SPEC CPU 2K/2006

[Bug rtl-optimization/37489] const_true_rtx returned for float compare

[Bug rtl-optimization/37514] [4.4 Regression] Wrong code generated for 20021120-1.c with -O3 -fomit-frame-pointer on sh4

[Bug rtl-optimization/37769] [4.3/4.4 Regression] internal compiler error: in reg_overlap_mentioned_for_reload_p, at reload.c:6525

[Bug rtl-optimization/37769] internal compiler error: in reg_overlap_mentioned_for_reload_p, at reload.c:6525

[Bug rtl-optimization/37782] [4.4 regression] Stage2 ada compiler miscompiled

[Bug rtl-optimization/37889] [4.3/4.4 Regression] SEGV, conditional execution proactively executed the false arm.

[Bug rtl-optimization/37948] [4.4 Regression] IRA generates slower code

[Bug rtl-optimization/37994] New: peephole2 helper functions not documented.

[Bug rtl-optimization/38026] Miscompilation for CRIS of gfortran.dg/char_result_5.f95 with -fno-gcse

[Bug rtl-optimization/38034] New: Unnecssary register move

[Bug rtl-optimization/38034] Unnecssary register move

[Bug rtl-optimization/38139] New: --enable-checking=all times out during bootstrap

[Bug rtl-optimization/38139] --enable-checking=all times out during bootstrap

[Bug rtl-optimization/38245] [4.4 Regression] apparent improper segfault in compiler output

[Bug rtl-optimization/38245] [4.4 Regression] stack corruption when a call is removed but not the outgoing argument pushes

[Bug rtl-optimization/38272] New: [4.4 Regression] Revision 142207 caused libgomp.fortran/threadprivate2.f90

[Bug rtl-optimization/38272] [4.4 Regression] Revision 142207 caused libgomp.fortran/threadprivate2.f90

[Bug rtl-optimization/38280] New: [4.3 Regression] Revision 142207 breaks 416.gamess/481.wrf/ in SPEC CPU 2006

[Bug rtl-optimization/38280] [4.4 regression] Revision 142207 breaks 416.gamess/481.wrf in SPEC CPU 2006

[Bug rtl-optimization/38281] [4.4 Regression] ice: Segmentation fault

[Bug rtl-optimization/38281] ice: Segmentation fault

[Bug target/18580] vectorizer failures (max, unaligned)

[Bug target/19885] [4.0/4.1 Regression] avr dwarf-2 support is broken for head 4.0/4.1

[Bug target/22076] Strange code for MMX register moves

[Bug target/26397] Program crashes when rethrowing exception

[Bug target/27432] -fschedule-insns -O2 -march=athlon cause compilation error

[Bug target/27855] [4.3/4.4 regression] reassociation causes the RA to be confused

[Bug target/27880] [4.2/4.3 regression] undefined reference to `_Unwind_GetIPInfo'

[Bug target/27880] [4.2/4.3/4.4 regression] undefined reference to `_Unwind_GetIPInfo'

[Bug target/28102] [4.2/4.3/4.4 Regression] GNU Hurd bootstrap error: 'OPTION_GLIBC' undeclared

[Bug target/29031] gcc.dg/asm-b.c execution test aborts at -m64 on powerpc-apple-darwin8

[Bug target/29032] gcc.dg/cleanup-10.c execution test times out on powerpc-apple-darwin8 at -m64

[Bug target/29076] g++.dg/eh/forced1.C when compiled at -m64 on Darwin PPC has bus error

[Bug target/29090] gcc.dg-struct-layout-1 failures on Darwin PPC at -m64

[Bug target/29293] Darwin PPC float to TI integer conversion bug

[Bug target/29987] libgomp.c++/ctor-9.C failure

[Bug target/30280] SIGSEGV on operator==(valarray<bool>, bool)

[Bug target/30518] error from system header file

[Bug target/31175] isinf incorrectly expanded

[Bug target/31535] ICE on attempt to put SPE vector variables in SDA

[Bug target/31850] gcc.c-torture/compile/limits-fnargs.c is slow at compiling for spu-elf

[Bug target/32661] __builtin_ia32_vec_ext suboptimal for pointer/ref args

[Bug target/33331] FreeBSD __sparc64__ define no longer exists

[Bug target/33437] potentially valid construct rejected

[Bug target/33743] unwinding through signal frame

[Bug target/34025] Warning when compiling with -m64 -ffast-math on Intel Darwin

[Bug target/34256] mmx and movd/movq on x86_64

[Bug target/34497] failures on i686-apple-darwin9 in sse4 testcases

[Bug target/34571] [4.3/4.4 Regression] Segfault in alpha_expand_mov at -O3

[Bug target/34587] gcc.dg/initpri1.c fails on *-apple-darwin

[Bug target/34587] gcc.dg/initpri1.c fails on powerpc-apple-darwin

[Bug target/35018] [m68k-elf] Gcc ouputs invalid asm when compiling with -O2 or higher

[Bug target/35090] [4.3/4.4 regression] libjava testsuite failures on hppa-linux

[Bug target/35318] [4.3 regression] ICE with inline asm in reload

[Bug target/35366] [4.4 Regression] gfortran.dg/equiv_7.f90 fails with -m64 -Os on powerpc-apple-darwin9

[Bug target/35574] [4.4 Regression] unrecognizable insn generated for vector move

[Bug target/36133] GCC creates suboptimal ASM : Code includes unneeded TST instructions

[Bug target/36134] GCC creates suboptimal ASM : usage of ADDA.L where LEA could be used

[Bug target/36246] Reload chooses too wide mode for reg->mem->xmmreg reload

[Bug target/36321] Optimization higher or equal to -O2 produce wrong code

[Bug target/36793] x86-64 does not get __sync_synchronize right

[Bug target/37033] [4.4 Regression] Revision 138733 breaks -g vs -g0 for PCH

[Bug target/37170] [4.4 Regression]: gcc.dg/weak/weak-1.c

[Bug target/37344] [4.4 Regression] sparc bootstrap fails with Bus error in libgcc2.c

[Bug target/37362] [4.4 Regression] Bootstrap broken on mipsisa64r2-linux-gcc

[Bug target/37364] [4.4 Regression] IRA generates inefficient code due to missing regmove pass

[Bug target/37437] [4.4 regression] speed regression

[Bug target/37610] [4.4 Regression] FAIL: g++.dg/eh/pr29166.C execution test

[Bug target/37640] __sync_lock_test_and_set on PPC64 causes ICE

[Bug target/37812] [4.4 Regression] Invalid mnemonic 'lvlx'

[Bug target/37814] M68k/Coldfire ICE with -O: insn does not satisfy its constraints

[Bug target/37880] Documentation of option -mcmodel=medium is wrong

[Bug target/37939] [4.2/4.3/4.4 Regression] CRIS port: no addi insn

[Bug target/37942] [4.4 Regression] FAIL: gcc.c-torture/compile/930618-1.c

[Bug target/37989] PR37528 fix broke --disable-shared on mingw32

[Bug target/38015] Converting between int and vector using intrinsics goes through memory

[Bug target/38016] New: [4.2/4.3/4.4 Regression] -fno-ivopts exposes CRIS port bug, more with -fno-gcse

[Bug target/38016] [4.2/4.3/4.4 Regression] -fno-ivopts exposes CRIS port bug, more with -fno-gcse

[Bug target/38018] gcc.dg/pr37106-1.c doesn't work

[Bug target/38025] New: gcc.target/spu/intrinsics-1.c test fails

[Bug target/38025] gcc.target/spu/intrinsics-1.c test fails

[Bug target/38026] New: Miscompilation for CRIS of gfortran.dg/char_result_5.f95 with -fno-gcse

[Bug target/38026] Miscompilation for CRIS of gfortran.dg/char_result_5.f95 with -fno-gcse

[Bug target/38029] --with-dwarf2 installation fails

[Bug target/38052] [4.4 Regression] genautomata segfaults when -O2 is enabled

[Bug target/38054] Assertion failed in change_decl_assembler_name()

[Bug target/38057] [AVR] ATMega2561 wrong addressing (probably eicall).

[Bug target/38062] New: FAIL: gfortran.dg/include_2.f90 -O (test for excess errors): error: stray '#' in program

[Bug target/38072] ICE on valid code.

[Bug target/38085] New: gcc -m64 -pg generates invalid assembler code on Solaris 10/x86

[Bug target/38090] [4.4 Regression] Internal compiler error: in extract_insn while building linux-kernel from git with -Os or -O1 and higher

[Bug target/38093] undefined predicates in bfin.md

[Bug target/38109] New: [avr] Wrong code with gcc.c-torture/execute/20081112-1.c

[Bug target/38109] [avr] Wrong code with gcc.c-torture/execute/20081112-1.c

[Bug target/38118] New: gcc emits non-TLS data as TLS on Solaris 11/SPARC

[Bug target/38118] gcc emits non-TLS data as TLS on Solaris 11/SPARC

[Bug target/38120] missing space in x86 assembly code for some mov instructions

[Bug target/38123] [4.4 regression] error: incorrect sharing of tree nodes ap->fp_offset = D.2748;

[Bug target/38130] New: [4.4.0 regression]__builtin_alloca (vs IRA?) testsuite failures on mingw32

[Bug target/38130] [4.4 regression]__builtin_alloca (vs IRA?) testsuite failures on mingw32

[Bug target/38134] [4.4 Regression] speed regression with inline-asm sse code

[Bug target/38151] structures with _Complex arguments are not passed correctly

[Bug target/38155] New: [4.4 regression] gnat build failure on powerpc biarch

[Bug target/38155] [4.4 regression] gcc build failure on powerpc biarch

[Bug target/38159] New: [avr] ICE: gcc.c-torture/execute/pr38051.c compilation, -O3 -fomit-frame-pointer -funroll-all-loops -finline-functions

[Bug target/38159] [avr] ICE: gcc.c-torture/execute/pr38051.c compilation, -O3 -fomit-frame-pointer -funroll-all-loops -finline-functions

[Bug target/38177] Internal compiler error during gcc build with -march=amdfam10

[Bug target/38183] Useless move to memory when passing small structs to functions

[Bug target/38185] -fstrict-aliasing causes wrong register usage

[Bug target/38201] New: -mfma/-mavx and -msse5/-msse4a don't work together

[Bug target/38201] -mfma/-mavx and -msse5/-msse4a don't work together

[Bug target/38203] New: attribute `noreturn' isn't effective when -mthumb param is active

[Bug target/38203] attribute `noreturn' isn't effective when -mthumb param is active

[Bug target/38208] New: [4.4 Regression] gcc.c-torture/compile/20080806-1.c

[Bug target/38208] [4.4 Regression] gcc.c-torture/compile/20080806-1.c

[Bug target/38216] New: gcc.target/powerpc/pr18096-1.c fails to compile on powerpc-apple-darwin*

[Bug target/38222] gcc.target/i386/sse4_2-popcntl.c fails on i686-apple-darwin9

[Bug target/38227] gcc fails to correctly pass arguments with ms_abi function pointers

[Bug target/38239] The function mcount in gmon.o changes register ecx

[Bug target/38254] New: [4.4 Regression] Revision 142160 causes PR27908 -O3

[Bug target/38254] [4.4 Regression] Revision 142160 causes PR27908 -O3

[Bug target/38269] Segmentation fault in main_block_label when using -fno-unit-at-a-time and precompiled headers containing inline functions

[Bug target/38287] New: wrong-code with -O2 -fPIC on sparc-linux-gnu

[Bug target/38287] [4.1/4.2/4.3 regression] segfault at -O2 -fPIC -mcpu=v8

[Bug target/38288] i386/i386.c: 7 * set but not used variables

[Bug target/38293] New: [4.4 regression] libgfortran build failure on spu-elf

[Bug target/38293] [4.4 regression] libgfortran build failure on spu-elf

[Bug target/38306] New: [4.4 Regression] 15% slowdown of computational kernel

[Bug target/38306] [4.4 Regression] 15% slowdown of computational kernel

[Bug target/38320] New: missed movd opcode (32bits mm -> r/m32).

[Bug target/38320] missed movd opcode (32bits mm -> r/m32).

[Bug target/38326] New: [4.3 regression] libjava build failure on ia64-linux-gnu

[Bug target/38326] [4.3 regression] libjava build failure on ia64-linux-gnu

[Bug testsuite/28837] need to prune "can't find atom for N_GSYM stabs" warnings on Darwin for -m64

[Bug testsuite/28870] [4.2/4.3/4.4 Regression] configuring, over-riding timeout values in testsuite

[Bug testsuite/30176] gcc.dg/tree-prof/stringop-1.c fails

[Bug testsuite/34253] Lots of failures in gcc.dg/vect

[Bug testsuite/34543] gcc.dg/out-of-bounds-1.c fails on -mstrict-align for powerpc-apple-darwin

[Bug testsuite/34569] undefined symbols in builtin-math-4.exe on powerpc-apple-darwin8

[Bug testsuite/34575] gcc.target/powerpc/parity-1.c and popcount-1.c scan-assembler popcntb on darwin9

[Bug testsuite/35677] Intermitent failure "FAIL: libgomp.fortran/crayptr2.f90"

[Bug testsuite/36711] FAIL: gcc.dg/compat/struct-by-value-17a c_compat_* compile

[Bug testsuite/36714] FAIL: gcc.target/i386/quad-sse.c scan-assembler-not call

[Bug testsuite/37202] FAIL: gcc.dg/visibility-1[4-9].c

[Bug testsuite/37241] [4.4 Regression]: FAIL: g++.dg/abi/key2.C

[Bug testsuite/37326] [4.4 Regression] gcc.dg/tree-ssa/ssa-store-ccp-3.c scan-tree-dump-times optimized "conststaticvariable" 1

[Bug testsuite/37326] gcc.dg/tree-ssa/ssa-store-ccp-3.c scan-tree-dump-times optimized "conststaticvariable" 1

[Bug testsuite/37517] gcc.target/i386/quad-sse.c fails with -fPIC

[Bug testsuite/38008] New: gcc/testsuite/gcc.c-torture/execute/builtins/lib/sprintf.c unportable

[Bug testsuite/38008] gcc/testsuite/gcc.c-torture/execute/builtins/lib/sprintf.c unportable

[Bug testsuite/38025] [4.4 Regression] gcc.target/spu/intrinsics-1.c test fails

[Bug testsuite/38036] New: [4.4 Regression][AVR] FAIL: gcc.c-torture/execute/pr37573.c execution

[Bug testsuite/38036] [4.4 Regression][AVR] FAIL: gcc.c-torture/execute/pr37573.c execution

[Bug testsuite/38098] New: gcc.dg/cpp/subframework1.c -fno-show-column fails on darwin9

[Bug testsuite/38098] gcc.dg/cpp/subframework1.c -fno-show-column fails on darwin9

[Bug testsuite/38099] New: tmpdir-gcc.dg-struct-layout-1/t027 c_compat_x_tst.o-c_compat_y_tst.o execute failure

[Bug testsuite/38099] tmpdir-gcc.dg-struct-layout-1/t027 c_compat_x_tst.o-c_compat_y_tst.o execute failure

[Bug testsuite/38151] New: tmpdir-gcc.dg-struct-layout-1/t028 failure at -m64 on i686-apple-darwin9

[Bug testsuite/38151] structures with _Complex arguments are not passed correctly

[Bug testsuite/38151] tmpdir-gcc.dg-struct-layout-1/t028 failure at -m64 on i686-apple-darwin9

[Bug testsuite/38163] New: gcc.dg/tree-ssa/loop-3.c failure at -m64 on i686-apple-darwin9

[Bug testsuite/38163] gcc.dg/tree-ssa/loop-3.c failure at -m64 on i686-apple-darwin9

[Bug testsuite/38164] New: gcc.target/i386/amd64-abi-3.c fails at -m64 on i686-apple-darwin9

[Bug testsuite/38164] gcc.target/i386/amd64-abi-3.c fails at -m64 on i686-apple-darwin9

[Bug testsuite/38165] New: g++.dg/pubtypes.C fails at -m32/-m64 on i686-apple-darwin9

[Bug testsuite/38165] g++.dg/pubtypes.C fails at -m32/-m64 on i686-apple-darwin9

[Bug testsuite/38166] New: g++.dg/ext/visibility/class1.C fails at -m64 on i686-apple-darwin9

[Bug testsuite/38166] g++.dg/ext/visibility/class1.C fails at -m64 on i686-apple-darwin9

[Bug testsuite/38202] New: [avr] FAIL: gcc.dg/torture/pr37868.c

[Bug testsuite/38202] [avr] FAIL: gcc.dg/torture/pr37868.c

[Bug testsuite/38213] New: gcc.dg/ia64-sync-1.c execution test fails on powerpc-apple-darwin9

[Bug testsuite/38213] gcc.dg/ia64-sync-1.c and gcc.dg/ia64-sync-2.c execution tests fails on powerpc-apple-darwin9

[Bug testsuite/38213] gcc.dg/ia64-sync-1.c execution test fails on powerpc-apple-darwin9

[Bug testsuite/38216] gcc.target/powerpc/pr18096-1.c fails to compile on powerpc-*-*

[Bug testsuite/38221] New: FAIL: gcc.c-torture/compile/sync-3.c -O0 (test for warnings, line )

[Bug testsuite/38221] [4.3 Regression]FAIL: gcc.c-torture/compile/sync-3.c -O0 (test for warnings, line )

[Bug testsuite/38221] FAIL: gcc.c-torture/compile/sync-3.c -O0 (test for warnings, line )

[Bug testsuite/38222] New: gcc.target/i386/sse4_2-popcntl.c fails on i686-apple-darwin9

[Bug testsuite/38222] gcc.target/i386/sse4_2-popcntl.c fails on i686-apple-darwin9

[Bug testsuite/38235] New: gfortran.dg/pr37243.f has undefined variables / bounds error

[Bug testsuite/38235] gfortran.dg/pr37243.f has undefined variables / bounds error

[Bug testsuite/38241] New: g++.old-deja/g++.pt/const2.C fails on *-apple-darwin9

[Bug testsuite/38241] g++.old-deja/g++.pt/const2.C fails on *-apple-darwin9

[Bug testsuite/38261] [4.4 Regression] gcc.dg/torture/ipa-pta-1.c & gcc.dg/tree-ssa/alias-2.c fail with -fpic/-fPIC

[Bug testsuite/38263] New: gcc.dg/ipa/ipacost-2.c fails with -fpic/-fPIC

[Bug testsuite/38311] New: ssp-2.c fails on darwin because of duplicated symbols

[Bug testsuite/38311] ssp-2.c fails on darwin because of duplicated symbols

[Bug testsuite/38321] New: gcc/testsuite/gcc.misc-tests/linkage-y.c compiles wrong architecture

[Bug translation/38120] New: missing space in x86 assembly code for some mov instructions

[Bug tree-optimization/14703] Inadequate optimization of inline templated functions, infinite loop in ipa-reference and memory hog

[Bug tree-optimization/15484] [tree-ssa] bool and short function arguments promoted to int

[Bug tree-optimization/17116] Missed jump threading/bypassing optimization with loop and % (or ands)

[Bug tree-optimization/21485] [4.2/4.3/4.4 Regression] missed load PRE, PRE makes i?86 suck

[Bug tree-optimization/21559] [4.2/4.3 Regression] missed jump threading

[Bug tree-optimization/21559] [4.2/4.3/4.4 Regression] missed jump threading

[Bug tree-optimization/23286] missed fully redundant expression

[Bug tree-optimization/26243] [4.2/4.3/4.4 Regression] reassoc is not documented in passes.texi

[Bug tree-optimization/26307] load PRE creates type mismatches

[Bug tree-optimization/26850] unused function not eliminated with -fwhole-program --combine

[Bug tree-optimization/27810] inefficient gimplification of function calls

[Bug tree-optimization/32171] [4.2 regression] ICE w/ -ftree-loop-linear

[Bug tree-optimization/32306] [4.2/4.3/4.4 Regression] redundant && || not eliminated

[Bug tree-optimization/33512] Simple bitwise simplification missed

[Bug tree-optimization/33763] [4.2/4.3/4.4 Regression] Bogus inlining failed in call to `xxx': redefined extern inline functions are not considered for inlining

[Bug tree-optimization/35011] ICE with -fcheck-data-deps

[Bug tree-optimization/35279] incorrect "array subscript is above array bounds" warning in loop at -O3

[Bug tree-optimization/35518] [4.4 Regression] FAIL: gcc.c-torture/execute/20040709-1.c execution at -O2 and above

[Bug tree-optimization/35639] [4.3/4.4 Regression] -fprofile-generate + PRE = big compile-time

[Bug tree-optimization/36038] [4.4 Regression] miscompiled loop in perlbmk for -Os

[Bug tree-optimization/36439] [4.3 Regression] infinite loop in PRE building gimp-plugin-registry

[Bug tree-optimization/36922] [4.4 Regression] ICE in tree-data-ref.c with -ftree-loop-linear

[Bug tree-optimization/37416] [4.4 Regression] Failure to return number of loop iterations

[Bug tree-optimization/37433] [4.4 Regression] tree check: expected function_decl, have string_cst in ccp_fold, at tree-ssa-ccp.c:1050

[Bug tree-optimization/37542] [4.4 Regression] PRE doesn't simplify during phi-translation

[Bug tree-optimization/37573] [4.4 Regression] gcc-4.4 regression: incorrect code generation with -O1 -ftree-vectorize

[Bug tree-optimization/37684] [graphite] basic block containing VDEF of a scalar does not dominate basic block containing VUSE of the same scalar

[Bug tree-optimization/37708] ICE: vector VEC(name_tree,base) index domain error, in loop_iv_stack_get_iv at graphite.c:123

[Bug tree-optimization/37709] [4.4 Regression] inliner gone crazy

[Bug tree-optimization/37716] [4.4 Regression] ice for legal C++ code with -O2 on 20080926

[Bug tree-optimization/37776] ICE compiling Matrix.c in pymol using -fgraphite

[Bug tree-optimization/37837] missed PRE

[Bug tree-optimization/37868] [4.3 Regression] code that breaks TBAA is misoptimized even with -fno-strict-aliasing

[Bug tree-optimization/37869] PTA results wrong for "non-pointer" variables

[Bug tree-optimization/37879] [4.3 Regression] ICE with "wrong" use of noreturn attribute and optimization

[Bug tree-optimization/37950] failure in polyhedron benchmark when ftree-parallelize-loops is enabled

[Bug tree-optimization/37955] [4.4 Regression] internal compiler error: in vectorizable_store, at tree-vect-transform.c:5447

[Bug tree-optimization/37969] [4.3 Regression] "-O2 -funswitch-loops" causes ICE in build_int_cst_wide, at tree.c:891 (OpenOffice.org)

[Bug tree-optimization/37991] [4.4 Regression] excessive memory consumption - possible hang

[Bug tree-optimization/37997] New: PHI translation does not simplify to non-constants

[Bug tree-optimization/38011] vectorizer ignores alignment, useless versioning

[Bug tree-optimization/38042] -O1/-O2/-O3 -fgraphite-identity causes ICE when compiling fatigue.f90 Polyhedron 2005 benchmark

[Bug tree-optimization/38043] -O1/-O2/-O3 -fgraphite-identity causes ICE when compiling gas_dyn.f90 Polyhedron 2005 benchmark

[Bug tree-optimization/38048] New: [4.3 Regression] Wrong alias info for array access

[Bug tree-optimization/38048] [4.3 Regression] Wrong alias info for array access

[Bug tree-optimization/38049] New: points-to results imprecise

[Bug tree-optimization/38051] New: [4.4 Regression] Miscompilation of glibc's memcmp

[Bug tree-optimization/38051] [4.4 Regression] Miscompilation of glibc's memcmp

[Bug tree-optimization/38072] [4.3 Regression] ICE during inlining of valid code

[Bug tree-optimization/38072] ICE during inlining of valid code

[Bug tree-optimization/38072] ICE on valid code.

[Bug tree-optimization/38079] New: gcc segfaults when using -ftree-vectorizer-verbose=9

[Bug tree-optimization/38079] gcc segfaults when using -ftree-vectorizer-verbose=9

[Bug tree-optimization/38104] New: ICE segmentation fault (with -O3 when deref a NULL pointer in the code??)

[Bug tree-optimization/38104] [4.4 Regression] ICE segmentation fault (with -O3 when deref a NULL pointer in the code??)

[Bug tree-optimization/38153] New: failure in testcase when compiled with -ftree-paralleilze-loops

[Bug tree-optimization/38154] New: comp-goto-1.c failing when compiled with -ftree-parallelize-loops=4

[Bug tree-optimization/38156] New: gcc.dg/tree-ssa/update-unswitch-1.c fails when compiled with -ftree-parallelize-loops=4

[Bug tree-optimization/38156] gcc.dg/tree-ssa/update-unswitch-1.c fails when compiled with -ftree-parallelize-loops=4

[Bug tree-optimization/38168] New: failure in gamess benchmark when -ftree-parallelize-loops=4 is enabled

[Bug tree-optimization/38169] New: Wrong string constant optimizing

[Bug tree-optimization/38169] Wrong string constant optimizing

[Bug tree-optimization/38170] New: diff failure in cactusADM benchmark when -ftree-parallelize-loops=4 is enabled

[Bug tree-optimization/38180] New: CCP does not propagate through constant initializers

[Bug tree-optimization/38180] CCP does not propagate through constant initializers

[Bug tree-optimization/38207] New: Union in structs are not well optimized

[Bug tree-optimization/38207] Union in structs are not well optimized

[Bug tree-optimization/38224] New: libdecnumber/bid/host-ieee32.c:50: internal compiler error: fold check: original tree changed by fold

[Bug tree-optimization/38224] libdecnumber/bid/host-ieee32.c:50: internal compiler error: fold check: original tree changed by fold

[Bug tree-optimization/38230] New: SCCVN doesn't do expression lookups during stmt walks

[Bug tree-optimization/38230] SCCVN doesn't do expression lookups during stmt walks

[Bug tree-optimization/38258] New: IV-opts creating poor code for loop exit test

[Bug tree-optimization/38258] [4.4 regression] IV-opts creating poor code for loop exit test

[Bug tree-optimization/38261] New: [4.4 regression] gcc.dg/torture/ipa-pta-1.c & gcc.dg/tree-ssa/alias-2.c fail with -fpic/-fPIC

[Bug tree-optimization/38261] [4.4 Regression] gcc.dg/torture/ipa-pta-1.c & gcc.dg/tree-ssa/alias-2.c fail with -fpic/-fPIC

[Bug tree-optimization/38275] New: bootstrap failure when -ftree-parallelize-loops=4 is enabled

[Bug tree-optimization/38275] bootstrap failure when -ftree-parallelize-loops=4 is enabled

[Bug tree-optimization/38301] New: vectorization breaks type-based aliasing rules

[Bug tree-optimization/38328] New: Massive performance regression for jpeg_idct_islow

[Bug tree-optimization/38328] Massive performance regression for jpeg_idct_islow

Documentation error in [5.47 Built-in functions for atomic memory access]

GCC 4.3 picks non-const operator

Graphite merge regressed PR 35107 ?

Nyaralj te is!

Strange array limitations

szia

Your Efforts rewarded.

RE: Your-Degree is pending.


Indexes: [Date Index] [Subject Index] [Author Index] [Thread Index]
Site Nav: [Browse other archives for this mailing list]
[Browse other mailing lists at this site]
Search: Limit to:

Mail converted by MHonArc 2.6.3