gcc-bugs archive
date index for June, 2008

This is the mail archive of the gcc-bugs@gcc.gnu.org mailing list for the GCC project.

Indexes: [Date Index] [Subject Index] [Author Index] [Thread Index]
Site Nav: [Browse other archives for this mailing list]
[Browse other mailing lists at this site]
Search: Limit to:

June 30, 2008
23:51 [Bug fortran/36676] Namelist Comments Problems jvdelisle at gcc dot gnu dot o
22:40 [Bug middle-end/36598] Failed optimisation of return of struct argment in memcpy-1.c hutchinsonandy at gcc dot gnu
21:43 [Bug fortran/36681] New: compiler error message with gfortran 4.3.1 but not with 4.2.1 hatz at wuw dot at
20:53 [Bug c++/36662] [4.3/4.4 Regression] vector vs template jakub at gcc dot gnu dot org
20:51 [Bug c++/36662] [4.3/4.4 Regression] vector vs template jakub at gcc dot gnu dot org
20:43 [Bug c++/36662] [4.3/4.4 Regression] vector vs template jakub at gcc dot gnu dot org
19:51 [Bug target/36669] Wrong versioning for __float128 hjl dot tools at gmail dot com
19:33 [Bug java/36618] gcc-4.4-20080620 ICE in gcj/gnu.CORBA.OrbFunctional mariah dot lenox at gmail dot
19:31 [Bug target/36669] Wrong versioning for __float128 joseph at codesourcery dot com
19:13 [Bug target/36669] Wrong versioning for __float128 ian at airs dot com
18:31 [Bug target/36669] Wrong versioning for __float128 hjl dot tools at gmail dot com
18:00 [Bug target/36680] ICE in spill_failure, reload1.c:1995 pinskia at gcc dot gnu dot org
17:57 [Bug fortran/36676] Namelist Comments Problems jvdelisle at gcc dot gnu dot o
17:55 [Bug other/31754] Include column number along line in error messages main.cpp:5:38 dseketel at redhat dot com
17:55 [Bug target/36680] New: ICE in spill_failure, reload1.c:1995 dfranke at gcc dot gnu dot org
17:54 [Bug tree-optimization/36679] lnstat command dies if built with O1/O2 shemminger at vyatta dot com
17:53 [Bug other/31754] Include column number along line in error messages main.cpp:5:38 dseketel at redhat dot com
17:51 [Bug other/31754] Include column number along line in error messages main.cpp:5:38 dseketel at redhat dot com
17:22 [Bug target/36669] Wrong versioning for __float128 joseph at codesourcery dot com
17:17 [Bug tree-optimization/36679] lnstat command dies if built with O1/O2 shemminger at vyatta dot com
17:15 [Bug tree-optimization/36679] New: lnstat command dies if built with O1/O2 shemminger at vyatta dot com
17:09 [Bug target/36669] Wrong versioning for __float128 hjl dot tools at gmail dot com
17:06 [Bug ada/36678] New: GNAT from svn uses up infinite amount of memory on twisty generic+tagged testcase baldrick at gcc dot gnu dot or
16:32 [Bug c++/31816] If a function foo is defined before declaring a template class A<T>, overloaded version of foo defined after the class declaration will not be available within class A<T>. jason dot hoos at syclo dot co
16:02 [Bug c/36675] va_list argument breaks inlining (ambiguous warning). laurent dot deniau at cern dot
15:46 [Bug c/36675] va_list argument breaks inlining (ambiguous warning). rguenth at gcc dot gnu dot org
15:45 [Bug fortran/36676] New: Namelist Comments Problems mrnorman at ncsu dot edu
14:18 [Bug c/32415] libgcc_s not found in library search path with --enable-version-specific-runtime-libs dfranke at gcc dot gnu dot org
13:40 [Bug c/36675] New: va_list argument breaks inlining (ambiguous warning). laurent dot deniau at cern dot
13:39 [Bug target/36669] Wrong versioning for __float128 joseph at codesourcery dot com
13:39 [Bug target/36669] Wrong versioning for __float128 hjl dot tools at gmail dot com
13:36 [Bug target/36669] Wrong versioning for __float128 rguenth at gcc dot gnu dot org
13:35 [Bug target/36669] Wrong versioning for __float128 hjl dot tools at gmail dot com
13:30 [Bug target/36669] Wrong versioning for __float128 hjl dot tools at gmail dot com
13:08 [Bug tree-optimization/36648] [4.3/4.4 Regression] segfault in global constructor with -O3 jakub at gcc dot gnu dot org
11:45 [Bug tree-optimization/36648] [4.3/4.4 Regression] segfault in global constructor with -O3 irar at gcc dot gnu dot org
11:41 [Bug middle-end/36671] [4.4 Regression]: gfortran.dg/associated_1.f90 rguenth at gcc dot gnu dot org
11:41 [Bug middle-end/36671] [4.4 Regression]: gfortran.dg/associated_1.f90 rguenth at gcc dot gnu dot org
11:37 [Bug debug/36668] [4.4 Regression] FAIL: g++.dg/other/PR23205.C scan-assembler .stabs.*foobar:c=i rguenth at gcc dot gnu dot org
11:35 [Bug target/36669] Wrong versioning for __float128 rguenth at gcc dot gnu dot org
11:03 [Bug c++/36662] [4.3/4.4 Regression] vector vs template jakub at gcc dot gnu dot org
09:52 [Bug middle-end/36671] [4.4 Regression]: gfortran.dg/associated_1.f90 rguenth at gcc dot gnu dot org
09:40 [Bug target/36669] Wrong versioning for __float128 joseph at codesourcery dot com
08:24 [Bug rtl-optimization/36673] IRA -O3 -fno-pic ICE in save_con_fun_n, at caller-save.c:1389 aldot at gcc dot gnu dot org
06:23 [Bug middle-end/36037] [4.4 regression] segfault in gt_ggc_mx_dw_loc_descr_struct jv244 at cam dot ac dot uk
06:15 [Bug target/36669] Wrong versioning for __float128 hjl dot tools at gmail dot com
06:02 [Bug target/36669] Wrong versioning for __float128 ubizjak at gmail dot com
05:43 [Bug bootstrap/36664] [4.4 Regression] bootstrap failure at rev.137248 dominiq at lps dot ens dot fr
02:05 [Bug target/36223] IV-opt is not optimal for mips sandra at codesourcery dot com
00:30 [Bug middle-end/36445] [4.4 Regression] ICE in expand_expr_real_1 with -O1 with vector registers pinskia at gcc dot gnu dot org
00:29 [Bug middle-end/36444] [4.4 Regression] ICE in gen_lowpart_general with -O1 with vector registers pinskia at gcc dot gnu dot org
00:28 [Bug bootstrap/36664] [4.4 Regression] bootstrap failure at rev.137248 pinskia at gcc dot gnu dot org

June 29, 2008
23:57 [Bug c++/36665] g++: Internal error: Killed (program cc1plus) pinskia at gcc dot gnu dot org
23:31 [Bug c++/36655] unjustified warning for "extern template" when using -pedantic -std=c++0x pinskia at gcc dot gnu dot org
22:13 [Bug middle-end/36671] [4.4 Regression]: gfortran.dg/associated_1.f90 dominiq at lps dot ens dot fr
21:47 [Bug c++/36655] unjustified warning for "extern template" when using -pedantic -std=c++0x paolo dot carlini at oracle do
21:46 [Bug c++/36655] unjustified warning for "extern template" when using -pedantic -std=c++0x paolo at gcc dot gnu dot org
21:45 [Bug c/36674] New: #include location is offset by one row in errors from preprocessed files antalk at chello dot hu
21:41 [Bug rtl-optimization/36673] IRA -O3 -fno-pic ICE in save_con_fun_n, at caller-save.c:1389 astrange at ithinksw dot com
21:41 [Bug rtl-optimization/36673] New: IRA -O3 -fno-pic ICE in save_con_fun_n, at caller-save.c:1389 astrange at ithinksw dot com
21:36 [Bug rtl-optimization/36672] IRA + -fno-pic ICE in emit_swap_insn, at reg-stack.c:829 astrange at ithinksw dot com
21:35 [Bug rtl-optimization/36672] New: IRA + -fno-pic ICE in emit_swap_insn, at reg-stack.c:829 astrange at ithinksw dot com
21:06 [Bug middle-end/36671] New: [4.4 Regression]: gfortran.dg/associated_1.f90 hjl dot tools at gmail dot com
19:47 [Bug fortran/36670] New: Missing compile-time checks on sum and product tkoenig at gcc dot gnu dot org
19:46 [Bug target/36669] New: Wrong versioning for __float128 hjl dot tools at gmail dot com
19:07 [Bug fortran/36341] MATMUL: Bounds check missing (run time & compile time) tkoenig at gcc dot gnu dot org
19:03 [Bug fortran/36515] Integer read from stdin yields a value overflow for a valid integer. jvdelisle at gcc dot gnu dot o
17:58 [Bug fortran/36586] configure: error: GNU Fortran is not working; please report a bug... jvdelisle at gcc dot gnu dot o
17:50 [Bug bootstrap/36664] [4.4 Regression] bootstrap failure at rev.137248 ghazi at gcc dot gnu dot org
16:46 [Bug other/36667] Incorrect XFmode emulation in soft-fp ubizjak at gmail dot com
16:43 [Bug other/36667] Incorrect XFmode emulation in soft-fp hjl dot tools at gmail dot com
16:18 [Bug debug/36668] New: FAIL: g++.dg/other/PR23205.C scan-assembler .stabs.*foobar:c=i danglin at gcc dot gnu dot org
15:45 [Bug other/36667] New: Incorrect XFmode emulation in soft-fp hjl dot tools at gmail dot com
15:32 [Bug tree-optimization/36666] [4.4 Regression] ICE in process_constraint, at tree-ssa-structalias.c:2573 rguenther at suse dot de
15:24 [Bug tree-optimization/36666] [4.4 Regression] ICE in process_constraint, at tree-ssa-structalias.c:2573 dberlin at gcc dot gnu dot org
14:19 [Bug tree-optimization/36666] [4.4 Regression] ICE in process_constraint, at tree-ssa-structalias.c:2573 rguenth at gcc dot gnu dot org
13:34 [Bug tree-optimization/36666] [4.4 Regression] ICE in process_constraint, at tree-ssa-structalias.c:2573 rguenth at gcc dot gnu dot org
13:34 [Bug tree-optimization/36666] New: [4.4 Regression] ICE in process_constraint, at tree-ssa-structalias.c:2573 rguenth at gcc dot gnu dot org
13:19 [Bug c++/36655] unjustified warning for "extern template" when using -pedantic -std=c++0x paolo dot carlini at oracle do
12:55 [Bug c++/36655] unjustified warning for "extern template" when using -pedantic -std=c++0x gcc-bugzilla at contacts dot e
12:54 [Bug c++/36655] unjustified warning for "extern template" when using -pedantic -std=c++0x gcc-bugzilla at contacts dot e
12:26 [Bug tree-optimization/36648] [4.3/4.4 Regression] segfault in global constructor with -O3 irar at il dot ibm dot com
11:15 [Bug c++/36665] g++: Internal error: Killed (program cc1plus) jasenk2 at gmail dot com
11:12 [Bug c++/36665] New: g++: Internal error: Killed (program cc1plus) jasenk2 at gmail dot com
11:05 [Bug bootstrap/36664] New: [4.4 Regression] bootstrap failure at rev.137248 dominiq at lps dot ens dot fr
10:56 [Bug tree-optimization/21485] [4.1/4.2 Regression] codegen regression due to PRE increasing register pressure (missing load PRE really) wbrana at gmail dot com
10:45 [Bug testsuite/36620] gcc.dg/pr36504.c doesn't work on 32bit jakub at gcc dot gnu dot org
10:42 [Bug testsuite/36620] gcc.dg/pr36504.c doesn't work on 32bit jakub at gcc dot gnu dot org
10:40 [Bug testsuite/36620] gcc.dg/pr36504.c doesn't work on 32bit jakub at gcc dot gnu dot org
08:58 [Bug fortran/35971] ICE on valid code janus at gcc dot gnu dot org
07:15 [Bug rtl-optimization/36663] IRA ICE in save_call_clobbered_regs at caller-save.c:1949 astrange at ithinksw dot com
07:15 [Bug rtl-optimization/36663] New: IRA ICE in save_call_clobbered_regs at caller-save.c:1949 astrange at ithinksw dot com
05:42 [Bug libgcj/36640] Build gcc-4.2.1 release fails when configured with --with-xmlj using Sun's ld rob1weld at aol dot com
05:40 [Bug libgcj/36640] Build gcc-4.2.1 release fails when configured with --with-xmlj using Sun's ld rob1weld at aol dot com
05:38 [Bug libmudflap/31845] Need to adjust libmudflap timeout values in testsuite. rob1weld at aol dot com
05:31 [Bug libmudflap/31845] Need to adjust libmudflap timeout values in testsuite. rob1weld at aol dot com
05:29 [Bug libmudflap/31845] Need to adjust libmudflap timeout values in testsuite. rob1weld at aol dot com
05:27 [Bug libgcj/36640] Build gcc-4.2.1 release fails when configured with --with-xmlj using Sun's ld rob1weld at aol dot com
03:29 [Bug ada/25819] CXF3A01 core dump danglin at gcc dot gnu dot org
02:12 [Bug c++/36662] [4.3/4.4 Regression] vector vs template pinskia at gcc dot gnu dot org
02:12 [Bug c++/36662] New: [4.3/4.4 Regression] vector vs template pinskia at gcc dot gnu dot org

June 28, 2008
23:35 [Bug target/36661] x86 asm "+r" operands cause unnecessary spills/copies astrange at ithinksw dot com
23:35 [Bug target/36661] New: x86 asm "+r" operands cause unnecessary spills/copies astrange at ithinksw dot com
21:57 [Bug libfortran/36657] Namelist reading bug with string constant immediately followed by comment jvdelisle at gcc dot gnu dot o
21:48 [Bug libfortran/36657] Namelist reading bug with string constant immediately followed by comment jvdelisle at gcc dot gnu dot o
21:26 [Bug c++/36659] Confusing error message order 'error: ‘functionname’ declared as an ‘inline’ variable' rguenth at gcc dot gnu dot org
21:19 [Bug ada/25819] CXF3A01 core dump danglin at gcc dot gnu dot org
20:37 [Bug fortran/36341] MATMUL: Bounds check missing (run time & compile time) tkoenig at gcc dot gnu dot org
18:36 [Bug libstdc++/36660] pb_ds/detail/resize_policy/sample_resize_trigger.hpp has extra closing brace paolo dot carlini at oracle do
18:34 [Bug libstdc++/36660] pb_ds/detail/resize_policy/sample_resize_trigger.hpp has extra closing brace paolo at gcc dot gnu dot org
18:27 [Bug libstdc++/36660] pb_ds/detail/resize_policy/sample_resize_trigger.hpp has extra closing brace paolo dot carlini at oracle do
18:11 [Bug libstdc++/36616] Open issues from a test run paolo dot carlini at oracle do
17:31 [Bug fortran/36341] MATMUL: Bounds check missing (run time & compile time) dominiq at lps dot ens dot fr
16:58 [Bug target/25343] [4.1/4.2/4.3/4.4 regression] [m68k] testsuite failures debian-gcc at lists dot debian
16:39 [Bug testsuite/36620] gcc.dg/pr36504.c doesn't work on 32bit jsm28 at gcc dot gnu dot org
15:05 [Bug libstdc++/36660] New: pb_ds/detail/resize_policy/sample_resize_trigger.hpp has extra closing brace antalk at chello dot hu
14:39 [Bug fortran/36341] MATMUL: Bounds check missing (run time & compile time) dominiq at lps dot ens dot fr
14:22 [Bug libstdc++/36616] Open issues from a test run hjl dot tools at gmail dot com
14:20 [Bug c++/36659] New: Confusion error message order 'error: ‘functionname’ declared as an ‘inline’ variable' carlo at gcc dot gnu dot org
14:17 [Bug libstdc++/36616] Open issues from a test run hjl dot tools at gmail dot com
12:52 [Bug fortran/36341] MATMUL: Bounds check missing (run time & compile time) dominiq at lps dot ens dot fr
11:20 [Bug tree-optimization/36400] [4.2/4.3 Regression] points-to results wrong rguenth at gcc dot gnu dot org
11:20 [Bug tree-optimization/36373] [4.2/4.3 Regression] Wrong code with struct return rguenth at gcc dot gnu dot org
11:19 [Bug testsuite/36344] [4.3 Regression] gcc.dg/tree-ssa/loadpre8.c XFAILed rguenth at gcc dot gnu dot org
10:50 [Bug target/34856] [4.2/4.3/4.4 Regression] ICE with some constant vectors uweigand at gcc dot gnu dot or
10:49 [Bug target/34856] [4.2/4.3/4.4 Regression] ICE with some constant vectors uweigand at gcc dot gnu dot or
10:30 [Bug libstdc++/36616] Open issues from a test run ubizjak at gmail dot com
09:08 [Bug libstdc++/36616] Open issues from a test run paolo dot carlini at oracle do
07:54 [Bug fortran/36341] MATMUL: Bounds check missing (run time & compile time) tkoenig at gcc dot gnu dot org
07:53 [Bug target/35921] Con/de-structor definition fails to override dllimport declaration dannysmith at users dot source
07:53 [Bug c++/36654] Inlined con/de-structor breaks virtual inheritance dllimport classes dannysmith at users dot source
06:18 [Bug libstdc++/36616] Open issues from a test run ubizjak at gmail dot com
03:56 [Bug libstdc++/31413] FAIL: 22_locale/time_get/get_date/wchar_t/4.cc execution test danglin at gcc dot gnu dot org
03:48 [Bug libstdc++/31413] FAIL: 22_locale/time_get/get_date/wchar_t/4.cc execution test dave at hiauly1 dot hia dot nr
02:56 [Bug libstdc++/31413] FAIL: 22_locale/time_get/get_date/wchar_t/4.cc execution test dtom77 at gmail dot com
01:35 [Bug libfortran/36657] Namelist reading bug with string constant immediately followed by comment jvdelisle at gcc dot gnu dot o
01:00 [Bug other/31754] Include column number along line in error messages main.cpp:5:38 jg at jguk dot org

June 27, 2008
22:44 [Bug debug/36617] Debug info for OpenMP code is almost non-existent jakub at gcc dot gnu dot org
22:37 [Bug c++/36364] [4.1/4.2/4.3/4.4 Regression] Problem with -frepo jakub at gcc dot gnu dot org
22:36 [Bug c++/36364] [4.1/4.2/4.3/4.4 Regression] Problem with -frepo jakub at gcc dot gnu dot org
22:28 [Bug c++/36364] [4.1/4.2/4.3/4.4 Regression] Problem with -frepo jakub at gcc dot gnu dot org
21:56 [Bug tree-optimization/36400] [4.2/4.3/4.4 Regression] points-to results wrong rguenth at gcc dot gnu dot org
21:56 [Bug testsuite/36344] [4.3/4.4 Regression] gcc.dg/tree-ssa/loadpre8.c XFAILed rguenth at gcc dot gnu dot org
21:56 [Bug tree-optimization/36373] [4.2/4.3/4.4 Regression] Wrong code with struct return rguenth at gcc dot gnu dot org
21:32 [Bug other/31754] Include column number along line in error messages main.cpp:5:38 dseketel at redhat dot com
20:51 [Bug c++/36655] unjustified warning for "extern template" when using -pedantic -std=c++0x paolo dot carlini at oracle do
20:46 [Bug c++/36655] unjustified warning for "extern template" when using -pedantic -std=c++0x paolo at gcc dot gnu dot org
20:34 [Bug c++/35499] Symbol resolution optimization should be separately controlled from -fPIC ddenisen at altera dot com
20:20 [Bug libgcj/36658] New: Building gcj for arm linux from trunk (gcc 4.4.0): libjava/gcj/array.h:24: internal compiler error: verify_gimple failed ffileppo at libero dot it
20:13 [Bug libfortran/36657] New: Namelist reading bug with string constant immediately followed by comment anlauf at gmx dot de
19:44 [Bug debug/36617] Debug info for OpenMP code is almost non-existent jakub at gcc dot gnu dot org
18:55 [Bug testsuite/36344] [4.3/4.4 Regression] gcc.dg/tree-ssa/loadpre8.c XFAILed rguenth at gcc dot gnu dot org
18:55 [Bug tree-optimization/36373] [4.2/4.3/4.4 Regression] Wrong code with struct return rguenth at gcc dot gnu dot org
18:55 [Bug tree-optimization/36400] [4.2/4.3/4.4 Regression] points-to results wrong rguenth at gcc dot gnu dot org
18:13 [Bug target/36644] make check fails:FAIL: tr1/8_c_compatibility/cmath/functions.cc (test for excess errors) dtom77 at gmail dot com
18:02 [Bug c++/36655] unjustified warning for "extern template" when using -pedantic -std=c++0x paolo dot carlini at oracle do
17:58 [Bug c++/36655] unjustified warning for "extern template" when using -pedantic -std=c++0x paolo dot carlini at oracle do
17:48 [Bug c++/36052] "type qualifiers ignored" warning pinskia at gcc dot gnu dot org
17:48 [Bug c++/30601] [4.3 regression] -Wreturn-type warns about more than what the documentation says pinskia at gcc dot gnu dot org
17:47 [Bug c++/36656] useless warning: type qualifiers ignored on function return type in template code pinskia at gcc dot gnu dot org
17:47 [Bug c++/36052] "type qualifiers ignored" warning pinskia at gcc dot gnu dot org
17:45 [Bug c++/36656] New: useless warning: type qualifiers ignored on function return type in template code sebor at roguewave dot com
17:41 [Bug c++/36655] New: unjustified warning for "extern template" when using -pedantic -std=c++0x gcc-bugzilla at contacts dot e
17:09 [Bug c++/36654] Inlined con/de-structor breaks virtual inheritance dllimport classes tdragon at tdragon dot net
16:55 [Bug c++/36654] New: Inlined con/de-structor breaks in dllimport classes with virtual inheritance tdragon at tdragon dot net
16:49 D entists Listing in the US kinshasha Doss
15:14 [Bug c/36651] 64-bit enumerator incorrectly demoted to 32 bits pinskia at gcc dot gnu dot org
15:13 [Bug c/36651] 64-bit enumerator incorrectly demoted to 32 bits rguenth at gcc dot gnu dot org
14:26 [Bug debug/36617] Debug info for OpenMP code is almost non-existent jakub at gcc dot gnu dot org
14:00 [Bug target/36584] [4.3/4.4 Regression] Stack is not aligned correctly in recursive function hjl at gcc dot gnu dot org
14:00 [Bug fortran/36652] New: Internal compiler error: in gfc_conv_expr j dot wookey at bristol dot ac
13:05 [Bug c/18624] GCC does not detect local variable set but never used aldot at gcc dot gnu dot org
12:51 [Bug c/36651] 64-bit enumerator incorrectly demoted to 32 bits joseph at codesourcery dot com
12:36 [Bug c/36651] 64-bit enumerator incorrectly demoted to 32 bits jjk at acm dot org
12:36 [Bug c/36651] New: 64-bit enumerator incorrectly demoted to 32 bits jjk at acm dot org
12:33 [Bug c/34867] valgrind error indication in testsuite from c-lex.c:996:c_lex_with_flags for gcc.dg/cpp/charconst.c lauras at gcc dot gnu dot org
12:31 [Bug c/34867] valgrind error indication in testsuite from c-lex.c:996:c_lex_with_flags for gcc.dg/cpp/charconst.c lauras at gcc dot gnu dot org
12:05 [Bug c/36650] New: Unable to build libgcc, xgcc aborts with a segmentation fault marion dot deveaud at siemens
11:53 [Bug testsuite/29071] gcc.dg/20020919-1.c compilation test fails on powerpc-apple-darwin8 at -m64 dominiq at lps dot ens dot fr
10:34 [Bug target/36644] make check fails:FAIL: tr1/8_c_compatibility/cmath/functions.cc (test for excess errors) paolo dot carlini at oracle do
10:33 [Bug target/36644] make check fails:FAIL: tr1/8_c_compatibility/cmath/functions.cc (test for excess errors) paolo dot carlini at oracle do
10:30 [Bug target/36644] make check fails:FAIL: tr1/8_c_compatibility/cmath/functions.cc (test for excess errors) paolo dot carlini at oracle do
10:29 [Bug pch/36649] New: [4.3 Regression] -H option doesn't work as expected rbuergel at web dot de
09:44 [Bug target/36622] 4.3.1 failed to compile gcse.c file. ubizjak at gmail dot com
09:32 [Bug tree-optimization/36648] [4.3/4.4 Regression] segfault in global constructor with -O3 rguenth at gcc dot gnu dot org
09:24 [Bug tree-optimization/36646] [4.3/4.4 regression] Unnecessary moves generated on loop boundaries rguenth at gcc dot gnu dot org
09:01 [Bug libstdc++/36647] configure scripts can not find out version of GNU ld 2.18 paolo dot carlini at oracle do
08:57 [Bug target/36622] 4.3.1 failed to compile gcse.c file. imam dot toufique at intel dot
08:47 [Bug libgcj/36640] Build gcc-4.2.1 release fails when configured with --with-xmlj using Sun's ld rwild at gcc dot gnu dot org
08:47 [Bug c++/36648] segfault in global constructor with -O3 beckmann dot maik at googlemai
08:43 [Bug libgcj/36640] Build gcc-4.2.1 release fails when configured with --with-xmlj using Sun's ld rob1weld at aol dot com
08:35 [Bug c++/36648] segfault in global constructor with -O3 beckmann dot maik at googlemai
07:22 [Bug c++/36648] segfault in global constructor with -O3 beckmann dot maik at googlemai
07:17 [Bug c++/36648] New: segfault in global constructor with -O3 beckmann dot maik at googlemai
07:17 [Bug target/36622] 4.3.1 failed to compile gcse.c file. ubizjak at gmail dot com
06:58 [Bug libstdc++/36647] New: configure script can not find out version of GNU ld 2.18 YLitvinenko at astana dot oilf
05:09 [Bug target/36644] make check fails:FAIL: tr1/8_c_compatibility/cmath/functions.cc (test for excess errors) dtom77 at gmail dot com
05:04 [Bug tree-optimization/36646] [4.4 regression] Unnecessary moves generated on loop boundaries astrange at ithinksw dot com
04:58 [Bug tree-optimization/36646] [4.4 regression] Unnecessary moves generated on loop boundaries astrange at ithinksw dot com
04:58 [Bug tree-optimization/36646] New: [4.4 regression] Unnecessary moves generated on loop boundaries astrange at ithinksw dot com
01:52 [Bug target/36634] -msecure-plt combine gives invalid call insn amodra at bigpond dot net dot

June 26, 2008
21:57 [Bug target/36622] 4.3.1 failed to compile gcse.c file. imam dot toufique at intel dot
21:29 [Bug testsuite/29071] gcc.dg/20020919-1.c compilation test fails on powerpc-apple-darwin8 at -m64 dominiq at lps dot ens dot fr
21:28 [Bug c/36629] ICE in _lshrdi3 when compiling 06/20/08 snapshot on x86_64 hjl dot tools at gmail dot com
21:27 [Bug target/36644] make check fails:FAIL: tr1/8_c_compatibility/cmath/functions.cc (test for excess errors) dtom77 at gmail dot com
21:22 [Bug testsuite/29071] gcc.dg/20020919-1.c compilation test fails on powerpc-apple-darwin8 at -m64 dominiq at lps dot ens dot fr
20:54 [Bug c++/34724] Trouble with friend declaration across namespaces paolo dot carlini at oracle do
20:54 [Bug c++/36645] Friend class template declaration does not check for matching template parameters paolo dot carlini at oracle do
20:53 [Bug c/18624] GCC does not detect local variable set but never used ghazi at gcc dot gnu dot org
20:53 [Bug c++/16517] warn about variables that are only ever assigned to, but never read ghazi at gcc dot gnu dot org
20:52 [Bug c++/16517] warn about variables that are only ever assigned to, but never read ghazi at gcc dot gnu dot org
20:52 [Bug c++/36645] New: Friend class template declaration does not check for matching template parameters jhs at edg dot com
20:49 [Bug target/36644] make check fails:FAIL: tr1/8_c_compatibility/cmath/functions.cc (test for excess errors) paolo dot carlini at oracle do
20:47 [Bug c++/36625] bogus error on __attribute__((aligned(N))) in template code sebor at roguewave dot com
20:45 [Bug c++/34724] Trouble with friend declaration across namespaces paolo dot carlini at oracle do
20:45 [Bug c++/36642] Problem with non matching template args in tr1_impl/hashtable paolo dot carlini at oracle do
20:17 [Bug c++/36644] make check fails:FAIL: tr1/8_c_compatibility/cmath/functions.cc (test for excess errors) paolo dot carlini at oracle do
20:15 [Bug libstdc++/36643] make check error:FAIL: abi_check paolo dot carlini at oracle do
20:05 [Bug libstdc++/36644] New: make check fails:FAIL: tr1/8_c_compatibility/cmath/functions.cc (test for excess errors) dtom77 at gmail dot com
19:54 [Bug libstdc++/36643] New: make check error:FAIL: abi_check dtom77 at gmail dot com
19:43 [Bug c++/36642] Problem with non matching template args in tr1_impl/hashtable paolo dot carlini at oracle do
19:23 [Bug c++/36642] New: Problem with non matching template args in tr1_impl/hashtable jeff dot sullivan at intel dot
19:07 [Bug c++/36641] erroneous ambiguous error for subclasses overloaded templated interfaces pinskia at gcc dot gnu dot org
18:42 [Bug c++/36641] New: erroneous ambiguous error for subclasses overloaded templated interfaces a dot clarke at techsmith dot
18:34 [Bug tree-optimization/36630] [4.3/4.4 Regression] ICE in vect_update_ivs_after_vectorizer irar at il dot ibm dot com
18:14 [Bug tree-optimization/35518] [4.4 Regression] FAIL: gcc.c-torture/execute/20040709-1.c execution at -O2 and above aoliva at gcc dot gnu dot org
18:11 [Bug inline-asm/36639] pointer referenced in asm statement not regarded as VUSE aoliva at gcc dot gnu dot org
17:53 [Bug libgcj/36640] Build gcc-4.2.1 release fails when configured with --with-xmlj using Sun's ld rob1weld at aol dot com
17:45 [Bug target/36622] 4.3.1 failed to compile gcse.c file. ubizjak at gmail dot com
15:59 [Bug target/36622] 4.3.1 failed to compile gcse.c file. imam dot toufique at intel dot
15:34 [Bug libgcj/36640] New: Build gcc-4.2.1 release fails when configured with --with-xmlj using Sun's ld rob1weld at aol dot com
12:39 [Bug other/31754] Include column number along line in error messages main.cpp:5:38 dseketel at redhat dot com
12:12 [Bug tree-optimization/36630] [4.3/4.4 Regression] ICE in vect_update_ivs_after_vectorizer rguenther at suse dot de
11:58 [Bug tree-optimization/36630] [4.3/4.4 Regression] ICE in vect_update_ivs_after_vectorizer irar at il dot ibm dot com
11:39 [Bug c++/36628] [c++0x] incorrect decltype() handling of conditional operator abarbati at iaanus dot com
11:20 [Bug middle-end/36554] [4.4 regression] verify_flow_info ICE can not throw but has EH edges rguenth at gcc dot gnu dot org
11:03 [Bug middle-end/36554] [4.4 regression] verify_flow_info ICE can not throw but has EH edges ebotcazou at gcc dot gnu dot o
10:26 [Bug rtl-optimization/36635] [4.4 Regression] cc1 segfault from svn 137122 rguenth at gcc dot gnu dot org
10:18 [Bug ada/36562] gnatmake not processing shared library projects sam at gcc dot gnu dot org
10:16 [Bug inline-asm/36639] pointer referenced in asm statement not regarded as VUSE rguenth at gcc dot gnu dot org
10:11 [Bug target/35965] -fstack-protector produces segfaulting binaries on arm/armel jules at gcc dot gnu dot org
09:34 [Bug tree-optimization/35518] [4.4 Regression] FAIL: gcc.c-torture/execute/20040709-1.c execution at -O2 and above rguenther at suse dot de
09:24 [Bug target/35659] [4.3/4.4 Regression] Miscompiled code with -O2 (but not with -O2 -funroll-loops) on ia64 mkuvyrkov at gcc dot gnu dot o
09:22 [Bug target/35659] [4.3/4.4 Regression] Miscompiled code with -O2 (but not with -O2 -funroll-loops) on ia64 maxim at codesourcery dot com
08:42 [Bug target/35659] [4.3/4.4 Regression] Miscompiled code with -O2 (but not with -O2 -funroll-loops) on ia64 jakub at gcc dot gnu dot org
08:02 [Bug target/35659] [4.3/4.4 Regression] Miscompiled code with -O2 (but not with -O2 -funroll-loops) on ia64 jakub at gcc dot gnu dot org
07:06 [Bug target/36622] 4.3.1 failed to compile gcse.c file. ubizjak at gmail dot com
06:52 [Bug tree-optimization/36373] [4.2/4.3/4.4 Regression] Wrong code with struct return cnstar9988 at gmail dot com
06:25 [Bug target/36510] gcc.dg/vect/costmodel/ppc failures irar at il dot ibm dot com
06:11 [Bug target/36510] gcc.dg/vect/costmodel/ppc failures irar at gcc dot gnu dot org
06:09 [Bug target/36510] gcc.dg/vect/costmodel/ppc failures irar at gcc dot gnu dot org
05:51 [Bug fortran/36632] OpenMP code with access to module variable causes Fortran compiler to crash burnus at gcc dot gnu dot org
05:13 [Bug inline-asm/36639] pointer referenced in asm statement not regarded as VUSE aoliva at gcc dot gnu dot org
03:47 [Bug inline-asm/36639] pointer referenced in asm statement not regarded as VUSE pinskia at gmail dot com
03:46 Re: [Bug inline-asm/36639] New: pointer referenced in asm statement not regarded as VUSE Andrew Pinski
02:09 [Bug inline-asm/36639] New: pointer referenced in asm statement not regarded as VUSE aoliva at gcc dot gnu dot org
00:59 [Bug ada/36638] New: c34008: Program received signal SIGILL, Illegal instruction danglin at gcc dot gnu dot org
00:35 [Bug tree-optimization/35518] [4.4 Regression] FAIL: gcc.c-torture/execute/20040709-1.c execution at -O2 and above aoliva at gcc dot gnu dot org

June 25, 2008
23:06 [Bug fortran/36526] pointer in pure function pault at gcc dot gnu dot org
22:16 [Bug target/35659] [4.3/4.4 Regression] Miscompiled code with -O2 (but not with -O2 -funroll-loops) on ia64 doko at cs dot tu-berlin dot d
22:02 [Bug c/36635] New: cc1 segfault from svn 137122 regehr at cs dot utah dot edu
21:50 [Bug middle-end/28831] [4.1/4.2/4.3/4.4 Regression] Aggregate copy not elided when using a return value as a pass-by-value parameter jason at gcc dot gnu dot org
21:49 [Bug tree-optimization/35518] [4.4 Regression] FAIL: gcc.c-torture/execute/20040709-1.c execution at -O2 and above rguenther at suse dot de
21:34 [Bug target/35659] [4.3/4.4 Regression] Miscompiled code with -O2 (but not with -O2 -funroll-loops) on ia64 mkuvyrkov at gcc dot gnu dot o
21:31 [Bug target/36634] -msecure-plt combine gives invalid call insn amodra at bigpond dot net dot
21:30 [Bug target/36634] New: -msecure-plt combine gives invalid call insn amodra at bigpond dot net dot
21:25 [Bug c++/36633] [4.4 regression] warning "array subscript is below array bounds" on delete [] with -O2, -Wall paolo dot carlini at oracle do
21:11 [Bug middle-end/36554] [4.4 regression] verify_flow_info ICE can not throw but has EH edges ebotcazou at gcc dot gnu dot o
21:10 [Bug target/36627] X86: wrong mode in subqi_2 ubizjak at gmail dot com
21:07 [Bug target/36627] X86: wrong mode in subqi_2 uros at gcc dot gnu dot org
21:01 [Bug c++/36633] warning "array subscript is below array bounds" on delete [] with -O2, -Wall pinskia at gcc dot gnu dot org
21:00 [Bug c++/36633] warning "array subscript is below array bounds" on delete [] with -O2, -Wall pinskia at gcc dot gnu dot org
20:59 [Bug middle-end/36633] warning "array subscript is below array bounds" on delete [] with -O2, -Wall chris dot fairles at gmail dot
20:57 [Bug middle-end/36633] warning "array subscript is below array bounds" on delete [] with -O2, -Wall chris dot fairles at gmail dot
20:56 [Bug middle-end/36633] warning "array subscript is below array bounds" on delete [] with -O2, -Wall chris dot fairles at gmail dot
20:55 [Bug middle-end/36633] warning "array subscript is below array bounds" on delete [] with -O2, -Wall chris dot fairles at gmail dot
20:54 [Bug middle-end/36633] warning "array subscript is below array bounds" on delete [] with -O2, -Wall chris dot fairles at gmail dot
20:53 [Bug middle-end/36633] New: warning "array subscript is below array bounds" on delete [] with -O2, -Wall chris dot fairles at gmail dot
20:21 [Bug tree-optimization/35518] [4.4 Regression] FAIL: gcc.c-torture/execute/20040709-1.c execution at -O2 and above aoliva at gcc dot gnu dot org
20:05 [Bug middle-end/36554] [4.4 regression] verify_flow_info ICE can not throw but has EH edges laurent at guerby dot net
19:26 [Bug fortran/36632] OpenMP code with access to module variable causes Fortran compiler to crash wirawan0 at gmail dot com
19:24 [Bug fortran/36632] New: OpenMP code segment with module variable causes Fortran compiler to crash wirawan0 at gmail dot com
17:08 [Bug c++/36631] New: [4.3 Regression] attribute always_inline -> sorry, unimplemented: recursive inlining josep dot m dot perez at bsc d
14:28 [Bug tree-optimization/36630] [4.3/4.4 Regression] ICE in vect_update_ivs_after_vectorizer rguenth at gcc dot gnu dot org
13:41 [Bug target/36627] X86: wrong mode in subqi_2 ubizjak at gmail dot com
12:48 [Bug tree-optimization/36630] [4.3/4.4 Regression] ICE in vect_update_ivs_after_vectorizer jakub at gcc dot gnu dot org
12:48 [Bug tree-optimization/36630] New: [4.3/4.4 Regression] ICE in vect_update_ivs_after_vectorizer jakub at gcc dot gnu dot org
12:30 [Bug c/36629] New: ICE in _lshrdi3 when compiling 06/20/08 snapshot on x86_64 michael dot a dot richmond at
12:13 [Bug middle-end/36554] [4.4 regression] verify_flow_info ICE can not throw but has EH edges rguenth at gcc dot gnu dot org
12:13 [Bug tree-optimization/36511] [4.4 Regression] ice for legal code with -O2 rguenth at gcc dot gnu dot org
12:12 [Bug middle-end/36509] [4.4 Regression]: gcc.dg/Wstrict-aliasing-float-ptr-int-obj.c rguenth at gcc dot gnu dot org
12:12 [Bug fortran/36463] [4.4 Regression] ICE in expand_expr_real_1, at expr.c:7264 with rev.136554 rguenth at gcc dot gnu dot org
12:11 [Bug testsuite/36458] [4.4 Regression] Invalid fortran-torture -msse2 tests on Athlon XP rguenth at gcc dot gnu dot org
12:10 [Bug target/36450] [4.4 Regression] ICE in insert_restore/insert_save with GET_MODE_ALIGNMENT mem rguenth at gcc dot gnu dot org
12:10 [Bug middle-end/36445] [4.4 Regression] ICE in expand_expr_real_1 with -O1 with vector registers rguenth at gcc dot gnu dot org
12:09 [Bug middle-end/36444] [4.4 Regression] ICE in gen_lowpart_general with -O1 with vector registers rguenth at gcc dot gnu dot org
12:09 [Bug testsuite/36440] [4.4 Regression] FAIL: g++.dg/cdce3.C on powerpc-apple-darwin8.5.0 rguenth at gcc dot gnu dot org
12:09 [Bug c++/36411] [4.4 regression] ICE with invalid template template parameter rguenth at gcc dot gnu dot org
12:08 [Bug libmudflap/36397] [4.4 regression] ICE with pointer cast and -fmudflap rguenth at gcc dot gnu dot org
12:06 [Bug middle-end/36037] [4.4 regression] segfault in gt_ggc_mx_dw_loc_descr_struct jakub at gcc dot gnu dot org
12:05 [Bug middle-end/36315] [4.4 Regression] ICE with -fprofile-use (Invalid read of size 8) rguenth at gcc dot gnu dot org
12:04 [Bug ada/36207] [4.4 regression] Ada bootstrap fails in uintp.adb:1595 rguenth at gcc dot gnu dot org
12:01 [Bug middle-end/36037] [4.4 regression] segfault in gt_ggc_mx_dw_loc_descr_struct rguenth at gcc dot gnu dot org
12:01 [Bug target/36613] [4.1/4.2/4.3/4.4 Regression] likely codegen bug jakub at gcc dot gnu dot org
11:58 [Bug bootstrap/35619] [4.3/4.4 Regression] fixed includes not being found if building in src dir rguenth at gcc dot gnu dot org
11:55 [Bug middle-end/35412] Correctness with -ftrapv depended on libcall notes rguenth at gcc dot gnu dot org
11:54 [Bug target/35366] [4.4 Regression] gfortran.dg/equiv_7.f90 fails with -m64 -Os on powerpc-apple-darwin9 rguenth at gcc dot gnu dot org
11:52 [Bug target/36613] [4.1/4.2/4.3/4.4 Regression] likely codegen bug rguenth at gcc dot gnu dot org
11:33 [Bug target/35659] [4.3/4.4 Regression] Miscompiled code with -O2 (but not with -O2 -funroll-loops) on ia64 jakub at gcc dot gnu dot org
11:32 [Bug target/35659] [4.3/4.4 Regression] Miscompiled code with -O2 (but not with -O2 -funroll-loops) on ia64 jakub at gcc dot gnu dot org
10:21 [Bug target/35659] [4.3/4.4 Regression] Miscompiled code with -O2 (but not with -O2 -funroll-loops) on ia64 jakub at gcc dot gnu dot org
10:11 [Bug target/36627] X86: wrong mode in subqi_2 rguenth at gcc dot gnu dot org
10:06 [Bug tree-optimization/35518] [4.4 Regression] FAIL: gcc.c-torture/execute/20040709-1.c execution at -O2 and above rguenth at gcc dot gnu dot org
09:16 [Bug c++/36628] [c++0x] incorrect decltype() handling of conditional operator paolo dot carlini at oracle do
08:54 [Bug c++/36626] traditional cast not recognized schwab at suse dot de
08:42 [Bug tree-optimization/35518] [4.4 Regression] FAIL: gcc.c-torture/execute/20040709-1.c execution at -O2 and above rguenth at gcc dot gnu dot org
08:37 [Bug c++/36628] New: incorrect declspec() handling of conditional operator abarbati at iaanus dot com
07:53 [Bug target/36568] infinite _Unwind_Backtrace / thread stack unwinding. pluto at agmk dot net
06:46 [Bug target/36627] New: X86: wrong mode in subqi_2 Erwin dot Unruh at fujitsu-sie
02:30 [Bug c++/36626] New: traditional cast not recognized igodard at pacbell dot net
01:19 [Bug target/36622] 4.3.1 failed to compile gcse.c file. imam dot toufique at intel dot
01:16 [Bug target/36622] 4.3.1 failed to compile gcse.c file. pinskia at gcc dot gnu dot org
01:14 [Bug target/36622] 4.3.1 failed to compile gcse.c file. imam dot toufique at intel dot
01:01 [Bug target/36622] 4.3.1 failed to compile gcse.c file. pinskia at gcc dot gnu dot org

June 24, 2008
23:49 [Bug c++/36625] missing diagnostic on invalid __attribute__((aligned(N))) pinskia at gcc dot gnu dot org
23:48 [Bug c++/36625] missing diagnostic on invalid __attribute__((aligned(N))) pinskia at gcc dot gnu dot org
23:46 [Bug target/36622] 4.3.1 failed to compile gcse.c file. imam dot toufique at intel dot
23:43 [Bug c++/36625] New: missing diagnostic on invalid __attribute__((aligned(N))) sebor at roguewave dot com
23:41 [Bug target/36622] 4.3.1 failed to compile gcse.c file. pinskia at gcc dot gnu dot org
23:41 [Bug c/36624] 4.3.1 failed to compile gcse.c file. pinskia at gcc dot gnu dot org
23:41 [Bug target/36622] 4.3.1 failed to compile gcse.c file. pinskia at gcc dot gnu dot org
23:41 [Bug c/36623] 4.3.1 failed to compile gcse.c file. pinskia at gcc dot gnu dot org
23:39 [Bug target/36621] infinite _Unwind_Backtrace / thread stack unwinding. vinutheraj at gmail dot com
23:38 [Bug c/36624] New: 4.3.1 failed to compile gcse.c file. imam dot toufique at intel dot
23:38 [Bug target/36622] 4.3.1 failed to compile gcse.c file. pinskia at gcc dot gnu dot org
23:37 [Bug c/36623] New: 4.3.1 failed to compile gcse.c file. imam dot toufique at intel dot
23:37 [Bug target/36622] 4.3.1 failed to compile gcse.c file. pinskia at gcc dot gnu dot org
23:33 [Bug c/36622] New: 4.3.1 failed to compile gcse.c file. imam dot toufique at intel dot
23:08 Re: Template problems Andrew Pinski
23:06 Template problems Andrew McPherson
22:44 [Bug middle-end/36594] [4.4 Regression] multiple regressions on powerpc at rev.136976 pinskia at gcc dot gnu dot org
22:43 [Bug middle-end/36594] [4.4 Regression] multiple regressions on powerpc at rev.136976 pinskia at gcc dot gnu dot org
22:43 [Bug middle-end/36594] [4.4 Regression] multiple regressions on powerpc at rev.136976 pinskia at gcc dot gnu dot org
22:03 [Bug target/36568] infinite _Unwind_Backtrace / thread stack unwinding. rguenth at gcc dot gnu dot org
22:03 [Bug target/36621] infinite _Unwind_Backtrace / thread stack unwinding. rguenth at gcc dot gnu dot org
22:03 [Bug target/36568] infinite _Unwind_Backtrace / thread stack unwinding. rguenth at gcc dot gnu dot org
21:46 [Bug tree-optimization/34371] [4.3 Regression] verify_stmts failed (incorrect sharing of tree nodes) pault at gcc dot gnu dot org
21:46 [Bug fortran/36371] [4.3/4.4 Regression] Wrong locus for errors in DATA statement pault at gcc dot gnu dot org
21:30 [Bug libstdc++/36616] Open issues from a test run paolo dot carlini at oracle do
21:28 [Bug target/36621] infinite _Unwind_Backtrace / thread stack unwinding. pluto at agmk dot net
21:04 [Bug target/36568] infinite _Unwind_Backtrace / thread stack unwinding. vinutheraj at gmail dot com
20:58 [Bug target/36621] infinite _Unwind_Backtrace / thread stack unwinding. vinutheraj at gmail dot com
20:47 [Bug c++/23194] Unhelpful diagnostic for incorrect pointer-to-member function syntax jwakely dot gcc at gmail dot c
20:46 [Bug rtl-optimization/323] optimized code gives strange floating point results vincent at vinc17 dot org
20:45 [Bug c++/23194] Unhelpful diagnostic for incorrect pointer-to-member function syntax redi at gcc dot gnu dot org
20:42 [Bug libstdc++/36616] Open issues from a test run ubizjak at gmail dot com
20:20 [Bug target/35419] [4.3/4.4 Regression] bfin libgcc build error bunk at stusta dot de
20:13 [Bug rtl-optimization/323] optimized code gives strange floating point results pepalogik at seznam dot cz
19:11 [Bug tree-optimization/35518] [4.4 Regression] FAIL: gcc.c-torture/execute/20040709-1.c execution at -O2 and above dave at hiauly1 dot hia dot nr
18:33 [Bug libgcj/32198] rmic fails if remote method throws superclass of RemoteException tromey at gcc dot gnu dot org
18:33 [Bug libgcj/32198] rmic fails if remote method throws superclass of RemoteException tromey at gcc dot gnu dot org
18:22 [Bug target/36621] infinite _Unwind_Backtrace / thread stack unwinding. vinutheraj at gmail dot com
17:37 [Bug libgcj/32198] rmic fails if remote method throws superclass of RemoteException cvs-commit at developer dot cl
17:25 [Bug target/36621] New: infinite _Unwind_Backtrace / thread stack unwinding. vinutheraj at gmail dot com
17:19 [Bug libstdc++/36616] Open issues from a test run paolo dot carlini at oracle do
17:14 [Bug libstdc++/36616] Open issues from a test run Markus dot Elfring at web dot
16:34 [Bug libstdc++/36616] Open issues from a test run paolo dot carlini at oracle do
16:32 [Bug libstdc++/36616] Open issues from a test run paolo at gcc dot gnu dot org
16:32 [Bug libstdc++/36616] Open issues from a test run paolo at gcc dot gnu dot org
15:32 [Bug testsuite/36620] New: gcc.dg/pr36504.c doesn't work on 32bit hjl dot tools at gmail dot com
15:30 [Bug ada/36619] Assignment to classwide leads to constraint error fedya_fedyakoff at inbox dot r
15:27 [Bug ada/36619] New: Assignment to classwide leads to constraint error fedya_fedyakoff at inbox dot r
15:20 [Bug libstdc++/36616] Open issues from a test run ubizjak at gmail dot com
15:05 [Bug target/35659] [4.3/4.4 Regression] Miscompiled code with -O2 (but not with -O2 -funroll-loops) on ia64 jakub at gcc dot gnu dot org
14:45 [Bug target/35659] [4.3/4.4 Regression] Miscompiled code with -O2 (but not with -O2 -funroll-loops) on ia64 jakub at gcc dot gnu dot org
13:48 [Bug java/36618] gcc-4.4-20080620 ICE in gcj/gnu.CORBA.OrbFunctional ubizjak at gmail dot com
13:28 [Bug java/36618] New: gcc-4.4-20080620 ICE in gcj/gnu.CORBA.OrbFunctional mariah dot lenox at gmail dot
13:08 [Bug libstdc++/36616] Open issues from a test run paolo dot carlini at oracle do
12:59 [Bug libstdc++/36616] Open issues from a test run ubizjak at gmail dot com
12:49 [Bug target/36615] gcc-4.3.1 fails to compile linux kernel sk_stream_wait_connect() hinko dot kocevar at cetrtapot
12:46 [Bug other/35858] [4.3 Regression] time/memory hog for large c++ source. rguenth at gcc dot gnu dot org
12:41 [Bug target/36613] [4.1/4.2/4.3/4.4 Regression] likely codegen bug rguenth at gcc dot gnu dot org
12:36 [Bug target/34484] pulls in allegedly unneeded floatingpoint exception access funcs joseph at codesourcery dot com
12:35 [Bug libstdc++/36616] Open issues from a test run paolo dot carlini at oracle do
12:29 [Bug target/36613] [4.1/4.2/4.3/4.4 Regression] likely codegen bug rguenth at gcc dot gnu dot org
12:18 [Bug other/35858] [4.3 Regression] time/memory hog for large c++ source. pluto at agmk dot net
12:16 [Bug target/36615] gcc-4.3.1 fails to compile linux kernel sk_stream_wait_connect() hp at gcc dot gnu dot org
12:16 [Bug middle-end/35492] ICE building kernel sk_stream_wait_connect output_operand: invalid operand for 'p' modifier hp at gcc dot gnu dot org
12:15 [Bug libstdc++/36612] __throw_* functions in ext/pb_ds/exception.hpp cause multiple definition errors paolo dot carlini at oracle do
11:54 [Bug libstdc++/36612] __throw_* functions in ext/pb_ds/exception.hpp cause multiple definition errors paolo dot carlini at oracle do
11:45 [Bug middle-end/36614] incorrect "warning: array subscript is above array bounds" rguenth at gcc dot gnu dot org
11:43 [Bug middle-end/36613] [4.1/4.2/4.3/4.4 Regression] likely codegen bug rguenth at gcc dot gnu dot org
11:34 [Bug c++/36608] internal compiler error: in find_outermost_region_in_block, at tree-cfg.c:4739 rguenth at gcc dot gnu dot org
11:22 [Bug target/34484] pulls in allegedly unneeded floatingpoint exception access funcs aldot at gcc dot gnu dot org
11:20 [Bug target/34484] pulls in allegedly unneeded floatingpoint exception access funcs aldot at gcc dot gnu dot org
11:04 [Bug target/36615] gcc-4.3.1 fails to compile linux kernel sk_stream_wait_connect() hinko dot kocevar at cetrtapot
11:02 [Bug target/36615] gcc-4.3.1 fails to compile linux kernel sk_stream_wait_connect() hinko dot kocevar at cetrtapot
10:15 [Bug target/36615] gcc-4.3.1 fails to compile linux kernel sk_stream_wait_connect() hinko dot kocevar at cetrtapot
10:13 [Bug tree-optimization/36504] [4.3/4.4 regression] ICE when building xorg-server with -O3 -fprefetch-loop-arrays jakub at gcc dot gnu dot org
10:12 [Bug tree-optimization/36504] [4.3/4.4 regression] ICE when building xorg-server with -O3 -fprefetch-loop-arrays jakub at gcc dot gnu dot org
10:07 [Bug tree-optimization/36504] [4.3/4.4 regression] ICE when building xorg-server with -O3 -fprefetch-loop-arrays jakub at gcc dot gnu dot org
10:01 [Bug debug/36617] Debug info for OpenMP code is almost non-existent jakub at gcc dot gnu dot org
10:00 [Bug debug/36617] New: Debug info for OpenMP code is almost non-existent jakub at gcc dot gnu dot org
09:09 [Bug rtl-optimization/36419] [4.1/4.3/4.4 Regression] Wrong unwind info with -Os -fasynchronous-unwind-tables jakub at gcc dot gnu dot org
09:05 [Bug tree-optimization/36504] [4.3/4.4 regression] ICE when building xorg-server with -O3 -fprefetch-loop-arrays jakub at gcc dot gnu dot org
09:04 [Bug target/36615] gcc-4.3.1 fails to compile linux kernel sk_stream_wait_connect() hinko dot kocevar at cetrtapot
08:47 [Bug libstdc++/36616] New: Open issues from a test run Markus dot Elfring at web dot
08:41 [Bug target/36615] gcc-4.3.1 fails to compile linux kernel sk_stream_wait_connect() hinko dot kocevar at cetrtapot
08:39 [Bug target/36615] gcc-4.3.1 fails to compile linux kernel sk_stream_wait_connect() hinko dot kocevar at cetrtapot
08:38 [Bug target/36615] New: gcc-4.3.1 fails to compile linux kernel sk_stream_wait_connect() hinko dot kocevar at cetrtapot
08:23 [Bug target/27682] float to int conversion doesn't raise invalid exception aldot at gcc dot gnu dot org
08:02 [Bug target/36584] [4.3/4.4 Regression] Stack is not aligned correctly in recursive function ubizjak at gmail dot com
07:59 [Bug target/36584] [4.3/4.4 Regression] Stack is not aligned correctly in recursive function uros at gcc dot gnu dot org
07:15 [Bug middle-end/36614] incorrect "warning: array subscript is above array bounds" pinskia at gcc dot gnu dot org
06:28 [Bug c/36614] New: incorrect "warning: array subscript is above array bounds" gnu at rothwell dot id dot au
04:33 [Bug middle-end/36613] likely codegen bug pinskia at gcc dot gnu dot org
04:15 [Bug c/36613] New: likely codegen bug regehr at cs dot utah dot edu
03:23 [Bug libstdc++/36612] New: __throw_* functions in ext/pb_ds/exception.hpp cause multiple definition errors chalathip at gmail dot com
02:47 [Bug middle-end/36611] New: false negatives with -Wstrict-aliasing=3 hp at gcc dot gnu dot org
02:38 [Bug middle-end/36593] [4.4 Regression]: gfortran.dg/default_format_1.f90, 22_locale/num_get/get/char/2.cc hp at gcc dot gnu dot org
02:02 [Bug target/33104] Missing error check in .md converter amylaar at gcc dot gnu dot org
01:53 [Bug libobjc/36610] message forwarding broken on x86_64: self is not receiver pinskia at gcc dot gnu dot org
01:48 [Bug objc/36610] New: message forwarding broken on x86_64: self is not receiver hydrologiccycle at gmail dot c

June 23, 2008
22:53 [Bug target/36609] New: AVR wrong code using incorrect RTL for test reversal pattern hutchinsonandy at gcc dot gnu
22:38 [Bug c++/36608] internal compiler error: in find_outermost_region_in_block, at tree-cfg.c:4739 pinskia at gcc dot gnu dot org
22:35 [Bug c++/36608] internal compiler error: in find_outermost_region_in_block, at tree-cfg.c:4739 bmayer at gmail dot com
22:24 [Bug c++/36608] New: internal compiler error: in find_outermost_region_in_block, at tree-cfg.c:4739 bmayer at gmail dot com
22:13 [Bug middle-end/36594] [4.4 Regression] multiple regressions on powerpc at rev.136976 pinskia at gcc dot gnu dot org
21:29 [Bug fortran/36341] MATMUL: Bounds check missing (run time & compile time) tkoenig at gcc dot gnu dot org
19:59 [Bug c/35712] decimal float literal constant zero loses significant trailing zeroes bergner at gcc dot gnu dot org
19:58 [Bug target/35620] ICE passing dereferenced pointer to _Decimal32 bergner at gcc dot gnu dot org
18:04 [Bug c/20319] -fkeep-static-consts with -O asserted doesn't keep consts hans at mesoscopic dot mines d
17:51 [Bug bootstrap/33304] Bootstrap failure on solaris2 using cc due to empty macro arguments ghazi at gcc dot gnu dot org
17:37 [Bug target/36584] [4.3/4.4 Regression] Stack is not aligned correctly in recursive function ubizjak at gmail dot com
16:42 [Bug tree-optimization/36504] [4.3/4.4 regression] ICE when building xorg-server with -O3 -fprefetch-loop-arrays jakub at gcc dot gnu dot org
16:27 [Bug tree-optimization/36504] [4.3/4.4 regression] ICE when building xorg-server with -O3 -fprefetch-loop-arrays jakub at gcc dot gnu dot org
16:09 [Bug c++/36607] New: Incorrect type diagnostic on substracting casted char pointers rschiele at gmail dot com
15:34 [Bug c++/36364] [4.1/4.2/4.3/4.4 Regression] Problem with -frepo jakub at gcc dot gnu dot org
15:23 [Bug fortran/36599] major execution regression for induct.f90 polyhedron benchmark in 4.3.1 on Intel howarth at nitro dot med dot u
14:54 [Bug fortran/36599] major execution regression for induct.f90 polyhedron benchmark in 4.3.1 on Intel howarth at nitro dot med dot u
14:22 [Bug pch/36606] New: segfault when a pch is included through a header file davorin dot ucakar at gmail do
14:03 [Bug fortran/36599] major execution regression for induct.f90 polyhedron benchmark in 4.3.1 on Intel rguenth at gcc dot gnu dot org
13:44 [Bug debug/36589] [4.4 Regression]: No debug info for local static variable at -O0 hjl dot tools at gmail dot com
13:42 [Bug fortran/36599] major execution regression for induct.f90 polyhedron benchmark in 4.3.1 on Intel howarth at nitro dot med dot u
13:39 [Bug tree-optimization/35518] [4.4 Regression] FAIL: gcc.c-torture/execute/20040709-1.c execution at -O2 and above rguenth at gcc dot gnu dot org
13:31 [Bug middle-end/36593] [4.4 Regression]: gfortran.dg/default_format_1.f90, 22_locale/num_get/get/char/2.cc hp at gcc dot gnu dot org
13:20 [Bug target/36533] [4.3/4.4 Regression] Incorrectly assumed aligned_operand jakub at gcc dot gnu dot org
13:17 [Bug target/36533] [4.3/4.4 Regression] Incorrectly assumed aligned_operand jakub at gcc dot gnu dot org
13:14 [Bug middle-end/36593] [4.4 Regression]: gfortran.dg/default_format_1.f90, 22_locale/num_get/get/char/2.cc hp at gcc dot gnu dot org
13:08 [Bug fortran/36597] OpenMP 3: _OPENMP should be 200805 instead of 200505 jakub at gcc dot gnu dot org
13:07 [Bug target/36533] [4.3/4.4 Regression] Incorrectly assumed aligned_operand jakub at gcc dot gnu dot org
12:18 [Bug target/36583] [4.3/4.4 Regression] ICE on 5282/5206 at -O2 rguenth at gcc dot gnu dot org
11:58 [Bug tree-optimization/36508] [4.3 Regression] ICE in compute_antic jakub at gcc dot gnu dot org
11:58 [Bug tree-optimization/36508] [4.3 Regression] ICE in compute_antic jakub at gcc dot gnu dot org
11:53 [Bug tree-optimization/36508] [4.3 Regression] ICE in compute_antic jakub at gcc dot gnu dot org
11:26 [Bug c/36605] New: no previous prototype for 'host_detect_local_cpu' in 06/20/08 snapshot of gcc on MIPS Linux michael dot a dot richmond at
10:40 [Bug c++/36407] [4.3/4.4 regression] ICE with conversion and -fpermissive jakub at gcc dot gnu dot org
10:22 [Bug fortran/36597] OpenMP 3: _OPENMP should be 200805 instead of 200505 jakub at gcc dot gnu dot org
10:15 [Bug tree-optimization/36519] [4.3 Regression] time/memory hog for c++ source. rguenth at gcc dot gnu dot org
10:14 [Bug other/36498] [4.3 Regression] time/memory hog for large c++ source. rguenth at gcc dot gnu dot org
10:12 [Bug tree-optimization/36519] [4.3 Regression] time/memory hog for c++ source. rguenth at gcc dot gnu dot org
10:06 [Bug target/36482] cris gcc 4.2.3 -Os causes internal compiler error (-O0 works) hinko dot kocevar at cetrtapot
09:54 [Bug fortran/36604] ICE on duplicate DATA dfranke at gcc dot gnu dot org
09:54 [Bug fortran/24978] ICE in gfc_assign_data_value_range dfranke at gcc dot gnu dot org
09:48 [Bug middle-end/36593] [4.4 Regression]: gfortran.dg/default_format_1.f90, 22_locale/num_get/get/char/2.cc rguenther at suse dot de
08:53 [Bug fortran/36604] New: ICE on duplicate DATA jakub at gcc dot gnu dot org
08:44 [Bug fortran/36597] OpenMP 3: _OPENMP should be 200805 instead of 200505 jakub at gcc dot gnu dot org
07:39 [Bug middle-end/36593] [4.4 Regression]: gfortran.dg/default_format_1.f90, 22_locale/num_get/get/char/2.cc hp at gcc dot gnu dot org
07:13 [Bug middle-end/36593] [4.4 Regression]: gfortran.dg/default_format_1.f90, 22_locale/num_get/get/char/2.cc hp at gcc dot gnu dot org
06:48 [Bug c++/36523] OpenMP task construct fails to instantiate copy constructor jakub at gcc dot gnu dot org
06:40 [Bug target/36533] [4.3/4.4 Regression] Incorrectly assumed aligned_operand jakub at gcc dot gnu dot org
04:34 [Bug target/27880] [4.2/4.3/4.4 regression] undefined reference to `_Unwind_GetIPInfo' russiane39 at gmail dot com
02:55 [Bug target/36603] Use \r\n for generated *.s files on Windows dannysmith at users dot source
00:47 [Bug fortran/36599] major execution regression for induct.f90 polyhedron benchmark in 4.3.1 on Intel howarth at nitro dot med dot u
00:08 [Bug fortran/36599] major execution regression for induct.f90 polyhedron benchmark in 4.3.1 on Intel howarth at nitro dot med dot u

June 22, 2008
23:43 [Bug middle-end/36594] [4.4 Regression] multiple regressions on powerpc at rev.136976 dje at gcc dot gnu dot org
22:44 [Bug tree-optimization/35518] [4.4 Regression] FAIL: gcc.c-torture/execute/20040709-1.c execution at -O2 and above dave at hiauly1 dot hia dot nr
22:30 [Bug fortran/36599] major execution regression for induct.f90 polyhedron benchmark in 4.3.1 on Intel howarth at nitro dot med dot u
22:24 [Bug tree-optimization/35518] [4.4 Regression] FAIL: gcc.c-torture/execute/20040709-1.c execution at -O2 and above rguenther at suse dot de
21:55 [Bug tree-optimization/16427] dead 0 memset not optimized away pinskia at gcc dot gnu dot org
21:49 [Bug target/36603] Use \r\n for generated *.s files on Windows pinskia at gcc dot gnu dot org
21:42 [Bug target/36603] New: Use \r\n for generated *.s files on Windows tkoenig at gcc dot gnu dot org
21:34 [Bug tree-optimization/35518] [4.4 Regression] FAIL: gcc.c-torture/execute/20040709-1.c execution at -O2 and above dave at hiauly1 dot hia dot nr
21:26 [Bug tree-optimization/36602] memset should be optimized into an empty CONSTRUCTOR rguenth at gcc dot gnu dot org
21:15 [Bug rtl-optimization/323] optimized code gives strange floating point results vincent at vinc17 dot org
21:14 [Bug tree-optimization/35518] [4.4 Regression] FAIL: gcc.c-torture/execute/20040709-1.c execution at -O2 and above rguenther at suse dot de
21:06 [Bug tree-optimization/36602] New: memset should be optimized into an empty CONSTRUCTOR pinskia at gcc dot gnu dot org
20:45 [Bug tree-optimization/35518] [4.4 Regression] FAIL: gcc.c-torture/execute/20040709-1.c execution at -O2 and above danglin at gcc dot gnu dot org
20:44 [Bug fortran/36599] major execution regression for induct.f90 polyhedron benchmark in 4.3.1 on Intel dominiq at lps dot ens dot fr
20:28 [Bug other/36595] Multiple warnings about C++ for C codes pinskia at gcc dot gnu dot org
20:14 [Bug c++/36601] Can't be friended by template class argument pinskia at gcc dot gnu dot org
20:14 [Bug c++/24629] Can't use template argument as friend pinskia at gcc dot gnu dot org
20:06 [Bug c++/36601] New: Can't be friended by template class argument igodard at pacbell dot net
20:05 [Bug tree-optimization/35518] [4.4 Regression] FAIL: gcc.c-torture/execute/20040709-1.c execution at -O2 and above dave at hiauly1 dot hia dot nr
20:03 [Bug tree-optimization/35518] [4.4 Regression] FAIL: gcc.c-torture/execute/20040709-1.c execution at -O2 and above danglin at gcc dot gnu dot org
19:49 [Bug tree-optimization/36600] ICE while building e2fsprogs with -fipa-pta -O2 pinskia at gcc dot gnu dot org
19:48 [Bug tree-optimization/36600] [4.3 Regression] ICE while building e2fsprogs with -fipa-pta -O2 vapier at gentoo dot org
19:47 [Bug tree-optimization/36600] New: [4.3 Regression] ICE while building e2fsprogs with -fipa-pta -O2 vapier at gentoo dot org
18:31 [Bug fortran/36599] major execution regression for induct.f90 polyhedron benchmark in 4.3.1 on Intel howarth at nitro dot med dot u
18:29 minor cc1 crash (SIGILL in my tests) der Mouse
17:54 [Bug fortran/36599] major execution regression for induct.f90 polyhedron benchmark in 4.3.1 on Intel burnus at gcc dot gnu dot org
17:29 [Bug rtl-optimization/323] optimized code gives strange floating point results pepalogik at seznam dot cz
17:00 [Bug fortran/36599] major execution regression for induct.f90 polyhedron benchmark in 4.3.1 on Intel howarth at nitro dot med dot u
17:00 [Bug rtl-optimization/323] optimized code gives strange floating point results pepalogik at seznam dot cz
16:59 [Bug fortran/36599] major execution regression for induct.f90 polyhedron benchmark in 4.3.1 on Intel howarth at nitro dot med dot u
16:58 [Bug fortran/36599] New: major execution regression for induct.f90 polyhedron benchmark in 4.3.1 on Intel howarth at nitro dot med dot u
16:57 [Bug other/36579] gcc refuses to recognize libraries on the command line pinskia at gcc dot gnu dot org
16:26 [Bug fortran/36590] internal error: Can't convert LOGICAL(1) to LOGICAL(1) burnus at gcc dot gnu dot org
16:12 [Bug c/36598] Failed optimisation of return of struct argment in memcpy-1.c hutchinsonandy at gcc dot gnu
16:02 [Bug middle-end/34906] valgrind error indication from testsuite gimplify.c: gimplify_asm_expr rguenth at gcc dot gnu dot org
15:44 [Bug middle-end/36593] [4.4 Regression]: gfortran.dg/default_format_1.f90, 22_locale/num_get/get/char/2.cc rguenth at gcc dot gnu dot org
15:31 [Bug middle-end/34906] valgrind error indication from testsuite gimplify.c: gimplify_asm_expr lauras at gcc dot gnu dot org
15:29 [Bug middle-end/34906] valgrind error indication from testsuite gimplify.c: gimplify_asm_expr lauras at gcc dot gnu dot org
15:24 [Bug c/34867] valgrind error indication in testsuite from c-lex.c:996:c_lex_with_flags for gcc.dg/cpp/charconst.c lauras at gcc dot gnu dot org
15:07 [Bug tree-optimization/14295] [tree-ssa] copy propagation for aggregates rguenth at gcc dot gnu dot org
15:06 [Bug tree-optimization/14295] [tree-ssa] copy propagation for aggregates rguenth at gcc dot gnu dot org
14:51 [Bug c/36598] Failed optimisation of return of struct argment in memcpy-1.c rguenth at gcc dot gnu dot org
14:50 [Bug ada/36591] error: "a-reatim.adb" must be compiled danglin at gcc dot gnu dot org
14:50 [Bug middle-end/34905] valgrind error indication from testsuite typeck.c:comptypes lauras at gcc dot gnu dot org
14:47 [Bug c/36596] occasional segfault in bitmap_elt_clear_from rguenth at gcc dot gnu dot org
14:43 [Bug middle-end/36594] [4.4 Regression] multiple regressions on powerpc at rev.136976 rguenth at gcc dot gnu dot org
14:33 [Bug c/36598] Failed optimisation of return of struct argment in memcpy-1.c hutchinsonandy at gcc dot gnu
13:33 [Bug c/36598] Failed optimisation of return of struct argment in memcpy-1.c joseph at codesourcery dot com
13:26 [Bug c/36598] New: Failed optimisation of return of struct argment in memcpy-1.c hutchinsonandy at gcc dot gnu
12:31 [Bug middle-end/36597] OpenMP 3: _OPENMP should be 200805 instead of 200505 burnus at gcc dot gnu dot org
12:29 [Bug fortran/36590] internal error: Can't convert LOGICAL(1) to LOGICAL(1) burnus at gcc dot gnu dot org
12:28 [Bug middle-end/36597] OpenMP 3: _OPENMP should be 200805 instead of 200505 jakub at gcc dot gnu dot org
12:12 [Bug middle-end/36597] New: OpenMP 3: _OPENMP should be 200805 instead of 200505 burnus at gcc dot gnu dot org
12:11 [Bug c/36596] occasional segfault in bitmap_elt_clear_from marcus at jet dot franken dot
12:11 [Bug c/36596] New: occasional segfault in bitmap_elt_clear_from marcus at jet dot franken dot
12:01 [Bug c/36594] [4.4 Regression] multiple regressions on powerpc at rev.136976 ubizjak at gmail dot com
11:18 [Bug c/36594] [4.4 Regression] multiple regressions on powerpc at rev.136976 dominiq at lps dot ens dot fr
11:15 [Bug bootstrap/36595] New: [4.4 Regression] Multiple warnings about C++ for C codes dominiq at lps dot ens dot fr
11:04 [Bug target/36584] [4.3/4.4 Regression] Stack is not aligned correctly in recursive function jsm28 at gcc dot gnu dot org
11:04 [Bug ada/36575] [4.3/4.4 Regression][Ada] ACATS c460011 runtime fails at -O3 jsm28 at gcc dot gnu dot org
10:07 [Bug c/36594] New: [4.4 Regression] multiple regressions on powerpc at rev.136976 dominiq at lps dot ens dot fr
08:39 [Bug middle-end/36593] [4.4 Regression]: gfortran.dg/default_format_1.f90, 22_locale/num_get/get/char/2.cc hp at gcc dot gnu dot org
05:53 [Bug fortran/36582] Namelist I/O error: Bogus "Cannot match namelist object" jvdelisle at gcc dot gnu dot o
05:50 [Bug fortran/36582] Namelist I/O error: Bogus "Cannot match namelist object" jvdelisle at gcc dot gnu dot o
03:03 [Bug middle-end/36593] [4.4 Regression]: gfortran.dg/default_format_1.f90, 22_locale/num_get/get/char/2.cc hp at gcc dot gnu dot org
03:03 [Bug middle-end/36593] [4.4 Regression]: gfortran.dg/default_format_1.f90, 22_locale/num_get/get/char/2.cc hp at gcc dot gnu dot org
03:01 [Bug middle-end/36593] New: [4.4 Regression]: gfortran.dg/default_format_1.f90, 22_locale/num_get/get/char/2.cc hp at gcc dot gnu dot org
02:27 [Bug middle-end/36509] [4.4 Regression]: gcc.dg/Wstrict-aliasing-float-ptr-int-obj.c hp at gcc dot gnu dot org
00:53 [Bug rtl-optimization/323] optimized code gives strange floating point results vincent at vinc17 dot org

June 21, 2008
22:39 [Bug rtl-optimization/323] optimized code gives strange floating point results pepalogik at seznam dot cz
21:40 [Bug fortran/36276] [4.3 Regression] possible issue with opening fortran files? lauras at gcc dot gnu dot org
21:39 [Bug debug/34908] valgrind error indication from testsuite hashtab.c : htab_hash_string lauras at gcc dot gnu dot org
20:58 [Bug c++/35336] Broken diagnostic: 'bit_field_ref' not supported by dump_expr reichelt at gcc dot gnu dot or
20:17 [Bug fortran/36590] internal error burnus at gcc dot gnu dot org
19:48 [Bug fortran/36592] New: F2003: Procedure pointer in COMMON burnus at gcc dot gnu dot org
19:27 [Bug fortran/36590] internal error jvdelisle at gcc dot gnu dot o
18:22 [Bug pch/34909] valgrind error indication from testsuite c-pch.c: c_common_write_pch rguenth at gcc dot gnu dot org
17:41 [Bug middle-end/34906] valgrind error indication from testsuite gimplify.c: gimplify_asm_expr laurynas dot biveinis at gmail
17:21 [Bug ada/36591] error: "a-reatim.adb" must be compiled dave at hiauly1 dot hia dot nr
17:12 [Bug middle-end/34905] valgrind error indication from testsuite typeck.c:comptypes laurynas dot biveinis at gmail
17:08 [Bug ada/36591] error: "a-reatim.adb" must be compiled charlet at adacore dot com
17:08 Re: [Bug ada/36591] New: error: "a-reatim.adb" must be compiled Arnaud Charlet
16:59 [Bug middle-end/36578] cast to long double not taken into account when result stored to a double joseph at codesourcery dot com
16:58 [Bug ada/36591] New: error: "a-reatim.adb" must be compiled danglin at gcc dot gnu dot org
16:46 [Bug c++/36565] Wrong code generation with -O2 and segfault with -O3 rlblaster at gmail dot com
16:42 [Bug middle-end/36578] cast to long double not taken into account when result stored to a double rguenth at gcc dot gnu dot org
16:39 [Bug fortran/36582] Namelist I/O error: Bogus "Cannot match namelist object" jvdelisle at gcc dot gnu dot o
16:38 [Bug pch/34909] valgrind error indication from testsuite c-pch.c: c_common_write_pch laurynas dot biveinis at gmail
16:33 [Bug ada/36575] [4.3/4.4 Regression][Ada] ACATS c460011 runtime fails at -O3 rguenth at gcc dot gnu dot org
16:32 [Bug c++/36565] Wrong code generation with -O2 and segfault with -O3 rguenth at gcc dot gnu dot org
16:28 [Bug fortran/36590] internal error clerman at fuse dot net
16:22 [Bug tree-optimization/36561] store using long array index not hoisted out of loop rguenth at gcc dot gnu dot org
16:22 [Bug fortran/36590] New: internal error clerman at fuse dot net
16:20 [Bug middle-end/36548] remainder gives the wrong result for wrapping case with unsigned types rguenth at gcc dot gnu dot org
16:01 [Bug target/35271] Stack not aligned at mod 16 byte boundary in x86_64 code hjl dot tools at gmail dot com
16:01 [Bug target/36584] [4.3/4.4 Regression] Stack is not aligned correctly in recursive function hjl dot tools at gmail dot com
15:50 [Bug target/35271] Stack not aligned at mod 16 byte boundary in x86_64 code ubizjak at gmail dot com
15:50 [Bug debug/36589] [4.4 Regression]: No debug info for local static variable at -O0 hjl dot tools at gmail dot com
15:31 [Bug debug/34908] valgrind error indication from testsuite hashtab.c : htab_hash_string lauras at gcc dot gnu dot org
15:31 [Bug fortran/36276] [4.3 Regression] possible issue with opening fortran files? lauras at gcc dot gnu dot org
14:26 [Bug debug/36589] New: [4.4 Regression]: gcc.dg/debug/dwarf2/var1.c scan-assembler xyzzy[^\\\\n\\\\r]+DW_AT_name hjl dot tools at gmail dot com
13:25 [Bug target/36584] [4.3/4.4 Regression] Stack is not aligned correctly in recursive function ubizjak at gmail dot com
11:51 [Bug libstdc++/17995] gcc-3.4.2/libstdc++-v3/libsupc++/eh_alloc.cc:34 paolo dot carlini at oracle do
10:49 [Bug c/36588] New: Request warnings about the precedence of the unary - over the binary * and / vincent at vinc17 dot org
10:05 [Bug debug/34908] valgrind error indication from testsuite hashtab.c : htab_hash_string burnus at gcc dot gnu dot org
10:03 [Bug fortran/36276] [4.3 Regression] possible issue with opening fortran files? burnus at gcc dot gnu dot org
08:58 [Bug c++/36576] gcc 4.3.1 doesn't build for me on openSUSE 10.3 karx11erx at hotmail dot com
08:47 [Bug fortran/36582] Namelist I/O error: Bogus "Cannot match namelist object" fmuldoo at me dot lsu dot edu
08:44 [Bug fortran/36492] incorrect error when compiling burnus at gcc dot gnu dot org
08:33 [Bug fortran/36582] Namelist I/O error: Bogus "Cannot match namelist object" burnus at gcc dot gnu dot org
08:00 [Bug fortran/36492] incorrect error when compiling domob at gcc dot gnu dot org

June 20, 2008
23:14 [Bug other/36579] gcc refuses to recognize libraries on the command line c94wjpn at gmail dot com
20:32 [Bug fortran/36492] incorrect error when compiling clerman at fuse dot net
20:27 [Bug c++/36587] Feature: add warning for constructor call with discarded return. kkylheku at gmail dot com
19:24 [Bug c++/36587] Feature: add warning for constructor call with discarded return. kkylheku at gmail dot com
19:24 [Bug fortran/36586] configure: error: GNU Fortran is not working; please report a bug... kargl at gcc dot gnu dot org
19:22 [Bug c++/36587] New: Feature: add warning for constructor call with discarded return. kkylheku at gmail dot com
19:04 [Bug c/36585] getaddrinfo and friends not work with c99 pinskia at gcc dot gnu dot org
19:00 [Bug fortran/36586] configure: error: GNU Fortran is not working; please report a bug... kanito73 at hotmail dot com
18:58 [Bug fortran/36586] New: configure: error: GNU Fortran is not working; please report a bug... kanito73 at hotmail dot com
18:18 [Bug c/36585] New: getaddrinfo and friends not work with c99 nathanb at vt dot edu
16:40 [Bug target/36584] Stack is not aligned correctly in recursive function ubizjak at gmail dot com
16:40 [Bug target/36584] New: Stack is not aligned correctly in recursive function ubizjak at gmail dot com
16:20 [Bug c/36583] ICE on 5282/5206 at -O2 [regression] joel at gcc dot gnu dot org
16:19 [Bug c/36583] New: ICE on 5282/5206 at -O2 [regression] joel at gcc dot gnu dot org
16:10 [Bug rtl-optimization/323] optimized code gives strange floating point results vincent at vinc17 dot org
15:55 [Bug fortran/36577] Segmentation fault from gfortran compilation kargl at gcc dot gnu dot org
14:35 [Bug libgcj/32028] Make fails at gjdoc - gnu.classpath.tools.gjdoc.ParseException: unmatched input in line 1: @Retention(SOURCE) @Target(METHOD) gnu_andrew at member dot fsf d
14:01 [Bug c++/36576] gcc 4.3.1 doesn't build for me on openSUSE 10.3 pinskia at gcc dot gnu dot org
14:01 [Bug fortran/36342] [4.4 Regression] Missing file name in compilation diagnostics of preprocessed fortran source laurynas dot biveinis at gmail
13:58 [Bug debug/34908] valgrind error indication from testsuite hashtab.c : htab_hash_string lauras at gcc dot gnu dot org
13:58 [Bug fortran/36276] [4.3/4.4 Regression] possible issue with opening fortran files? lauras at gcc dot gnu dot org
13:50 [Bug fortran/36577] Segmentation fault from gfortran compilation zhonghaij at yahoo dot com
13:46 [Bug fortran/36577] Segmentation fault from gfortran compilation zhonghaij at yahoo dot com
13:37 [Bug fortran/36582] Namelist I/O error: Bogus "Cannot match namelist object" jvdelisle at gcc dot gnu dot o
13:33 [Bug fortran/36582] Namelist I/O error: Bogus "Cannot match namelist object" aldot at gcc dot gnu dot org
13:04 [Bug c++/36576] gcc 4.3.1 doesn't build for me on openSUSE 10.3 karx11erx at hotmail dot com
12:37 [Bug c++/36576] gcc 4.3.1 doesn't build for me on openSUSE 10.3 pinskia at gcc dot gnu dot org
12:33 [Bug c++/36576] gcc 4.3.1 doesn't build for me on openSUSE 10.3 karx11erx at hotmail dot com
12:32 [Bug fortran/36582] Namelist I/O error: Bogus "Cannot match namelist object" fmuldoo at me dot lsu dot edu
12:29 [Bug c++/36576] gcc 4.3.1 doesn't build for me on openSUSE 10.3 karx11erx at hotmail dot com
12:28 [Bug fortran/36582] Namelist I/O error: Bogus "Cannot match namelist object" burnus at gcc dot gnu dot org
12:05 [Bug other/31754] Include column number along line in error messages main.cpp:5:38 dseketel at redhat dot com
11:47 [Bug fortran/36582] Namelist error fmuldoo at me dot lsu dot edu
11:46 [Bug fortran/36582] New: Namelist error fmuldoo at me dot lsu dot edu
11:05 [Bug c++/36576] gcc 4.3.1 doesn't build for me on openSUSE 10.3 pinskia at gcc dot gnu dot org
11:03 [Bug c++/36576] gcc 4.3.1 doesn't build for me on openSUSE 10.3 pinskia at gcc dot gnu dot org
11:03 [Bug java/35257] jar: internal error: java.lang.NullPointerException bootstrapping libjava pinskia at gcc dot gnu dot org
11:00 [Bug c++/36576] gcc 4.3.1 doesn't build for me on openSUSE 10.3 karx11erx at hotmail dot com
10:44 [Bug fortran/36526] pointer in pure function pault at gcc dot gnu dot org
09:59 [Bug c++/36576] gcc 4.3.1 doesn't build for me on openSUSE 10.3 karx11erx at hotmail dot com
09:54 [Bug other/31754] Include column number along line in error messages main.cpp:5:38 dseketel at redhat dot com
07:50 [Bug fortran/36581] Fortran compiler does not pass the tests dfranke at gcc dot gnu dot org
07:48 [Bug fortran/36581] Fortran compiler does not pass the tests Jean-Michel dot Male at sbmoff
07:44 [Bug fortran/36581] New: Fortran compiler does not pass the tests Jean-Michel dot Male at sbmoff
05:09 [Bug ada/36573] s-intman.adb:232:50: "SA_ONSTACK" is undefined danglin at gcc dot gnu dot org
05:07 [Bug ada/36573] s-intman.adb:232:50: "SA_ONSTACK" is undefined danglin at gcc dot gnu dot org
03:54 [Bug fortran/36540] libgfortran compile warnings jvdelisle at gcc dot gnu dot o
03:50 [Bug fortran/36577] Segmentation fault from gfortran compilation jvdelisle at gcc dot gnu dot o
02:19 [Bug c++/36523] OpenMP task construct fails to instantiate copy constructor jakub at gcc dot gnu dot org

June 19, 2008
21:43 [Bug ada/36562] gnatmake not processing shared library projects chrisp_42 at bigpond dot com
20:02 [Bug c++/36576] gcc 4.3.1 doesn't build for me on openSUSE 10.3 karx11erx at hotmail dot com
18:59 [Bug objc/36580] New: ICE at -O2 and above (with strict aliasing) with invalid Objective-C code. pinskia at gcc dot gnu dot org
16:12 [Bug other/36579] gcc refuses to recognize libraries on the command line rwild at gcc dot gnu dot org
16:03 [Bug java/35257] jar: internal error: java.lang.NullPointerException bootstrapping libjava pinskia at gcc dot gnu dot org
16:03 [Bug c++/36576] gcc 4.3.1 doesn't build for me on openSUSE 10.3 pinskia at gcc dot gnu dot org
16:00 [Bug c++/36576] gcc 4.3.1 doesn't build for me on openSUSE 10.3 karx11erx at hotmail dot com
15:28 [Bug target/36559] Softfloat library support absent for Coldfire luigi dot mantellini at idf-hi
15:28 [Bug libgcj/32198] rmic fails if remote method throws superclass of RemoteException tromey at gcc dot gnu dot org
15:03 [Bug other/36579] gcc refuses to recognize libraries on the command line pinskia at gcc dot gnu dot org
14:58 [Bug other/36579] New: gcc refuses to recognize libraries on the command line c94wjpn at gmail dot com
14:57 [Bug bootstrap/33396] add --enable-intermodule aldot at gcc dot gnu dot org
14:37 [Bug middle-end/36578] cast to long double not taken into account when result stored to a double vincent at vinc17 dot org
14:20 [Bug middle-end/36578] New: cast to long double not taken into account when result stored to a double vincent at vinc17 dot org
14:10 [Bug c/28706] [4.1 Regression] Compile failure with --combine and explicitly aligned structures aldot at gcc dot gnu dot org
14:09 [Bug rtl-optimization/35604] Label references are not updated after edge insertion ubizjak at gmail dot com
14:08 [Bug target/36527] gcc 4.2.x generates wrong code for ARM target benny at ammitzboell-consult d
14:06 [Bug rtl-optimization/35604] Label references are not updated after edge insertion uros at gcc dot gnu dot org
13:24 [Bug c/34800] Compile failure with --combine and a union with an anonymous struct pinskia at gcc dot gnu dot org
13:21 [Bug c/34800] Compile failure with --combine and a union with an anonymous struct alexandre dot nunes at gmail d
12:24 [Bug fortran/36577] Segmentation fault from gfortran compilation dfranke at gcc dot gnu dot org
12:21 [Bug fortran/36577] Segmentation fault from gfortran compilation dfranke at gcc dot gnu dot org
12:11 [Bug c++/36576] gcc 4.3.1 doesn't build for me on openSUSE 10.3 pinskia at gcc dot gnu dot org
12:11 [Bug java/35257] jar: internal error: java.lang.NullPointerException bootstrapping libjava pinskia at gcc dot gnu dot org
11:40 [Bug fortran/36577] Segmentation fault from gfortran compilation zhonghaij at yahoo dot com
11:38 [Bug fortran/36577] Segmentation fault from gfortran compilation zhonghaij at yahoo dot com
11:33 [Bug fortran/36577] New: Segmentation fault from gfortran compilation zhonghaij at yahoo dot com
10:55 [Bug c/34800] Compile failure with --combine and a union with an anonymous struct aldot at gcc dot gnu dot org
09:07 [Bug c++/36576] New: gcc 4.3.1 doesn't build for me on openSUSE 10.3 karx11erx at hotmail dot com
08:03 [Bug c/21759] Implement warning for codes at the intersection of C and C++ ghazi at gcc dot gnu dot org
07:56 [Bug libgcj/32198] rmic fails if remote method throws superclass of RemoteException jerico dot dev at gmail dot co
07:46 [Bug bootstrap/32272] make exit because build/genmodes.exe doesn't exist laurent at guerby dot net
07:22 [Bug bootstrap/32272] make exit because build/genmodes.exe doesn't exist Ralf dot Wildenhues at gmx dot
06:55 [Bug ada/36575] [4.3/4.4 Regression][Ada] ACATS c460011 runtime fails at -O3 laurent at guerby dot net
06:54 [Bug ada/36575] New: [4.3/4.4 Regression][Ada] ACATS c460011 runtime fails at -O3 laurent at guerby dot net
06:29 [Bug bootstrap/32272] make exit because build/genmodes.exe doesn't exist laurent at guerby dot net
06:01 [Bug bootstrap/30739] awk Prerequisite is not documented rwild at gcc dot gnu dot org
06:01 [Bug bootstrap/30739] awk Prerequisite is not documented rwild at gcc dot gnu dot org
03:38 [Bug ada/36573] s-intman.adb:232:50: "SA_ONSTACK" is undefined charlet at adacore dot com
03:37 Re: [Bug ada/36573] s-intman.adb:232:50: "SA_ONSTACK" is undefined Arnaud Charlet
03:34 Re: Template error when using templated type in stl::vector Andrew McPherson
03:15 Re: Template error when using templated type in stl::vector Andrew Pinski
03:06 Template error when using templated type in stl::vector Andrew McPherson
03:01 [Bug middle-end/36574] [4.4 Regression] build broken with cgraph changes hp at gcc dot gnu dot org
03:00 [Bug middle-end/36574] [4.4 Regression] build broken with cgraph changes hp at gcc dot gnu dot org
02:50 [Bug middle-end/36574] [4.4 Regression] build broken with cgraph changes pinskia at gcc dot gnu dot org
02:48 [Bug middle-end/36574] New: build broken with cgraph changes hp at gcc dot gnu dot org
02:16 [Bug testsuite/36284] gcc.dg-struct-layout fails AVR target - multiple reasons hutchinsonandy at gcc dot gnu
02:12 [Bug ada/36573] s-intman.adb:232:50: "SA_ONSTACK" is undefined dave at hiauly1 dot hia dot nr
01:26 [Bug ada/36573] New: s-intman.adb:232:50: "SA_ONSTACK" is undefined danglin at gcc dot gnu dot org

June 18, 2008
23:57 [Bug other/36572] New: Documentation for some options starting with “no-” not clear n-roeser at gmx dot net
23:01 [Bug middle-end/36571] Default untyped return for AVR is byte register. hutchinsonandy at gcc dot gnu
22:54 [Bug c/36571] New: Default untyped return for AVR is byte register. hutchinsonandy at gcc dot gnu
22:14 [Bug c++/36567] Cannot use std::tr1::tie() with unordered_map<> of std::vector<> paolo dot carlini at oracle do
22:02 [Bug libstdc++/36564] reading from std::ifstream( directory ) ... paolo dot carlini at oracle do
21:55 [Bug target/36570] segmentation fault info at milde dot cz
21:54 [Bug testsuite/36284] gcc.dg-struct-layout fails AVR target - multiple reasons hutchinsonandy at gcc dot gnu
21:53 [Bug target/36570] segmentation fault info at milde dot cz
21:50 [Bug target/36570] segmentation fault info at milde dot cz
21:50 [Bug c++/36460] No space between >'s not always handled in C++0x hutchinsonandy at gcc dot gnu
21:48 [Bug target/36570] segmentation fault pinskia at gcc dot gnu dot org
21:45 [Bug c/36570] New: segmentation fault info at milde dot cz
21:30 [Bug c/36569] Checking printf format of recursive va_args. pinskia at gcc dot gnu dot org
21:09 [Bug regression/36569] Checking printf format of recursive va_args. cazfi74 at gmail dot com
21:07 [Bug regression/36569] New: Checking printf format of recursive va_args. cazfi74 at gmail dot com
19:55 Sell Cisco Systems equipment items helen at nstnetwork dot com
19:37 [Bug target/36568] infinite _Unwind_Backtrace / thread stack unwinding. pluto at agmk dot net
19:36 [Bug target/36568] infinite _Unwind_Backtrace / thread stack unwinding. pluto at agmk dot net
19:35 [Bug target/36568] New: infinite _Unwind_Backtrace / thread stack unwinding. pluto at agmk dot net
19:21 [Bug other/31754] Include column number along line in error messages main.cpp:5:38 dseketel at redhat dot com
19:18 [Bug c++/36567] Cannot use std::tr1::tie() with unordered_map<> of std::vector<> dfeathers at omnitrol dot com
19:06 [Bug c++/36566] Cannot bind packed field nevin at eviloverlord dot com
19:05 [Bug c++/36567] New: Cannot use std::tr1::tie() with unordered_map<> of std::vector<> dfeathers at omnitrol dot com
18:49 [Bug c++/36566] Cannot bind packed field nevin at eviloverlord dot com
18:48 [Bug bootstrap/30739] awk Prerequisite is not documented rwild at gcc dot gnu dot org
18:31 [Bug c++/36566] Cannot bind packed field pinskia at gcc dot gnu dot org
18:28 [Bug c++/36566] New: Cannot bind packed field nevin at eviloverlord dot com
18:25 [Bug other/31754] Include column number along line in error messages main.cpp:5:38 dseketel at redhat dot com
17:58 [Bug c++/36565] New: Wrong code generation with -O2 and segfault with -O3 rlblaster at gmail dot com
17:21 [Bug rtl-optimization/35604] Label references are not updated after edge insertion ubizjak at gmail dot com
17:17 [Bug rtl-optimization/35604] Label references are not updated after edge insertion uros at gcc dot gnu dot org
16:49 [Bug fortran/36342] [4.4 Regression] Missing file name in compilation diagnostics of preprocessed fortran source dfranke at gcc dot gnu dot org
16:25 [Bug debug/34908] valgrind error indication from testsuite hashtab.c : htab_hash_string laurynas dot biveinis at gmail
15:44 [Bug fortran/36342] [4.4 Regression] Missing file name in compilation diagnostics of preprocessed fortran source burnus at gcc dot gnu dot org
15:01 [Bug rtl-optimization/35604] Label references are not updated after edge insertion ubizjak at gmail dot com
13:57 [Bug fortran/36517] Type-spec in array constructor: Invalid error for -std=f2003/f2008 domob at gcc dot gnu dot org
13:57 [Bug fortran/36492] incorrect error when compiling domob at gcc dot gnu dot org
13:56 [Bug fortran/36112] Bounds-checking on character length not working for array-constructors domob at gcc dot gnu dot org
13:55 [Bug fortran/36517] Type-spec in array constructor: Invalid error for -std=f2003/f2008 domob at gcc dot gnu dot org
13:05 [Bug target/36512] relocation overflow kate01123 at gmail dot com
11:52 [Bug c++/36563] g++ compiling virtual method pinskia at gcc dot gnu dot org
11:51 [Bug c++/36563] g++ compiling virtual method pinskia at gcc dot gnu dot org
10:52 [Bug libstdc++/36564] New: reading from std::ifstream( directory ) ... pluto at agmk dot net
07:21 [Bug c++/33435] internal compiler error with templates and openmp E dot Kuemmerle at fz-juelich
07:21 [Bug fortran/36342] [4.4 Regression] Missing file name in compilation diagnostics of preprocessed fortran source P dot Schaffnit at access dot
07:18 [Bug fortran/36342] [4.4 Regression] Missing file name in compilation diagnostics of preprocessed fortran source pault at gcc dot gnu dot org
07:16 [Bug fortran/36553] Missing interface not detected in call to same file function pault at gcc dot gnu dot org
06:00 [Bug c++/36563] New: g++ compiling virtual method zlupin at 21cn dot com
05:34 [Bug fortran/36553] [4.4 Regression] regression due to revision 136821 burnus at gcc dot gnu dot org
04:57 [Bug fortran/36553] [4.4 Regression] regression due to revision 136821 jvdelisle at gcc dot gnu dot o
04:28 [Bug fortran/36553] [4.4 Regression] regression due to revision 136821 jvdelisle at gcc dot gnu dot o
03:45 [Bug ada/36562] New: gnatmake not processing shared library projects chrisp_42 at bigpond dot com
02:36 [Bug target/36551] Failure to compile __thread variable. carlos at systemhalted dot org
00:37 [Bug tree-optimization/36561] New: store using long array index not hoisted out of loop hutchinsonandy at gcc dot gnu
00:19 [Bug fortran/36553] [4.4 Regression] regression due to revision 136821 jvdelisle at gcc dot gnu dot o

June 17, 2008
23:43 [Bug target/36551] Failure to compile __thread variable. dave at hiauly1 dot hia dot nr
22:25 [Bug target/36559] Softfloat library support absent for Coldfire luigi dot mantellini at idf-hi
22:19 [Bug target/36559] Softfloat library support absent for Coldfire pinskia at gcc dot gnu dot org
22:17 [Bug target/36559] Softfloat library support absent for Coldfire luigi dot mantellini at idf-hi
22:12 [Bug target/36559] Softfloat library support absent for Coldfire pinskia at gcc dot gnu dot org
22:09 [Bug target/36559] Softfloat library support absent for Coldfire luigi dot mantellini at idf-hi
22:05 [Bug fortran/36553] [4.4 Regression] regression due to revision 136821 dominiq at lps dot ens dot fr
21:58 [Bug target/36559] Softfloat library support absent for Coldfire luigi dot mantellini at idf-hi
21:48 [Bug libstdc++/36552] includes itself: ext/pb_ds/detail/left_child_next_sibling_heap_/null_metadata.hpp paolo dot carlini at oracle do
21:18 [Bug c/36559] New: Softfloat library support absent for Coldfire luigi dot mantellini at idf-hi
20:50 [Bug inline-asm/36558] New: "V" inline asm constraint not working on sparc64 jakub at jermar dot eu
20:26 [Bug fortran/36112] Bounds-checking on character length not working for array-constructors domob at gcc dot gnu dot org
20:25 [Bug fortran/36112] Bounds-checking on character length not working for array-constructors domob at gcc dot gnu dot org
20:21 GCC error while compiling my server.c program using MySQL linuxfan84
20:12 [Bug target/36557] New: -m32 -mpowerpc64 produces better code than -m64 for a!=0 pinskia at gcc dot gnu dot org
19:34 [Bug fortran/36553] [4.4 Regression] regression due to revision 136821 pault at gcc dot gnu dot org
19:00 [Bug c/36556] OpenMP: incorrect 'not specified in enclosing parallel' david dot mcnamara at crescent
19:00 [Bug c/36556] New: OpenMP: incorrect 'not specified in enclosing parallel' david dot mcnamara at crescent
18:16 [Bug other/31400] enable static linking of support libraries through -static-libXY hjl dot tools at gmail dot com
18:10 [Bug fortran/34396] Length of substrings defined by expressions not correctly computed in constructors pault at gcc dot gnu dot org
18:09 [Bug fortran/36366] [4.3/4.4 Regression] ICE in gfc_conv_component_ref pault at gcc dot gnu dot org
18:04 [Bug c/36555] #pragma omp sections reduction-clause causes internal error david dot mcnamara at crescent
18:01 [Bug c/36555] New: #pragma omp sections reduction-clause causes internal error david dot mcnamara at crescent
17:49 [Bug middle-end/36554] [4.4 regression] verify_flow_info ICE can not throw but has EH edges pinskia at gcc dot gnu dot org
17:46 [Bug ada/36554] New: [4.4 regression] verify_flow_info ICE can not throw but has EH edges laurent at guerby dot net
16:44 [Bug fortran/36553] New: [4.4 Regression] regression due to revision 136821 dominiq at lps dot ens dot fr
15:10 [Bug libstdc++/36552] New: includes itself: ext/pb_ds/detail/left_child_next_sibling_heap_/null_metadata.hpp gcc at abeckmann dot de
15:04 [Bug c++/36530] ptrdiff_t undefined if <stddef.h> is included after <wchar.h> and <wctype.h> faridz at apache dot org
14:21 [Bug middle-end/36548] remainder gives the wrong result for wrapping case with unsigned types pinskia at gcc dot gnu dot org
14:19 [Bug middle-end/36548] likely integer codegen bug pinskia at gcc dot gnu dot org
14:10 [Bug target/36512] relocation overflow kate01123 at gmail dot com
14:07 [Bug c++/33435] internal compiler error with templates and openmp E dot Kuemmerle at fz-juelich
13:55 [Bug target/36450] [4.4 Regression] ICE in insert_restore/insert_save with GET_MODE_ALIGNMENT mem aldot at gcc dot gnu dot org
13:25 [Bug middle-end/36550] Wrong "may be used uninitialized" warning pinskia at gcc dot gnu dot org
13:09 [Bug target/36551] New: Failure to compile __thread variable. carlos at systemhalted dot org
11:50 [Bug tree-optimization/36493] [4.3/4.4 Regression] vectorizer aliasing bug irar at il dot ibm dot com
10:47 [Bug middle-end/36550] Wrong "may be used uninitialized" warning aldot at gcc dot gnu dot org
10:41 [Bug middle-end/36550] Wrong "may be used uninitialized" warning belyshev at depni dot sinp dot
09:53 [Bug middle-end/36550] New: Wrong "may be used uninitialized" warning aldot at gcc dot gnu dot org
08:15 [Bug c++/36549] offsetof defined as function in contravention of ISO/IEC 14882:1998 17.4.1.2 para 5 ajrobb at bigfoot dot com
07:42 [Bug c++/36549] offsetof defined as function in contravention of ISO/IEC 14882:1998 17.4.1.2 para 5 schwab at suse dot de
06:51 [Bug c++/36549] New: offsetof defined as function in contravention of ISO/IEC 14882:1998 17.4.1.2 para 5 ajrobb at bigfoot dot com
04:33 [Bug libfortran/36546] Namelist error with tab following a comma and newline jvdelisle at gcc dot gnu dot o
04:19 [Bug libfortran/36546] Namelist error with tab following a comma and newline jvdelisle at gcc dot gnu dot o
04:15 [Bug libfortran/36546] Namelist error with tab following a comma and newline jvdelisle at gcc dot gnu dot o
01:42 [Bug c/36548] New: likely integer codegen bug regehr at cs dot utah dot edu
01:09 [Bug testsuite/36544] fseek.f90 does not correctly account for newline lengths jvdelisle at gcc dot gnu dot o
01:06 [Bug testsuite/36544] fseek.f90 does not correctly account for newline lengths jvdelisle at gcc dot gnu dot o

June 16, 2008
21:50 [Bug fortran/36342] [4.4 Regression] Missing file name in compilation diagnostics of preprocessed fortran source dfranke at gcc dot gnu dot org
20:23 [Bug fortran/36342] [4.4 Regression] Missing file name in compilation diagnostics of preprocessed fortran source pault at gcc dot gnu dot org
19:51 [Bug other/25757] Small memory leak in 'prefix_from_string' of file 'collect2.c' christophe dot jaillet at wana
19:34 [Bug c++/35022] [4.3/4.4 regression] ICE with parameter pack in template constant parameter chris dot fairles at gmail dot
18:09 [Bug fortran/36132] _gfortran_internal_pack on optional arguments burnus at gcc dot gnu dot org
17:57 [Bug fortran/36342] [4.4 Regression] Missing file name in compilation diagnostics of preprocessed fortran source burnus at gcc dot gnu dot org
17:55 [Bug fortran/36276] [4.3/4.4 Regression] possible issue with opening fortran files? burnus at gcc dot gnu dot org
16:30 [Bug fortran/36515] Integer read from stdin yields a value overflow for a valid integer. jvdelisle at gcc dot gnu dot o
15:04 [Bug c++/33435] internal compiler error with templates and openmp bangerth at dealii dot org
11:15 [Bug other/31754] Include column number along line in error messages main.cpp:5:38 dseketel at redhat dot com
11:14 [Bug other/31754] Include column number along line in error messages main.cpp:5:38 dseketel at redhat dot com
11:13 [Bug c/32415] libgcc_s not found in library search path with --enable-version-specific-runtime-libs jwakely dot gcc at gmail dot c
10:44 [Bug tree-optimization/36493] [4.3/4.4 Regression] vectorizer aliasing bug irar at gcc dot gnu dot org
10:40 [Bug tree-optimization/36493] [4.3/4.4 Regression] vectorizer aliasing bug irar at gcc dot gnu dot org
09:24 [Bug middle-end/32492] [4.3 Regression] attribute always_inline -> sorry, unimplemented: recursive inlining josep dot m dot perez at bsc d
09:11 [Bug c++/36547] internal compiler error: Segmentation fault ninive at gmx dot at
09:10 [Bug target/36527] gcc 4.2.x generates wrong code for ARM target benny at ammitzboell-consult d
08:44 [Bug c++/36547] internal compiler error: Segmentation fault paolo dot carlini at oracle do
08:27 [Bug c++/36547] New: internal compiler error: Segmentation fault ninive at gmx dot at
04:41 [Bug libfortran/36546] Namelist error with tab following a comma and newline jvdelisle at gcc dot gnu dot o
04:22 [Bug libfortran/36546] Namelist error with tab following a comma and newline jvdelisle at gcc dot gnu dot o
04:21 [Bug libfortran/36546] New: Namelist error with tab following a comma and newline jvdelisle at gcc dot gnu dot o
03:39 [Bug bootstrap/27367] [4.2/4.3 Regression] gstdint.h in libdecnumber is not cleaned up with make distclean bje at gcc dot gnu dot org
01:41 [Bug bootstrap/36545] New: Type _uleb128_t doesn't defined properly in /gcc/unwind-dw2.c andry at inbox dot ru
01:26 [Bug bootstrap/36541] Make failed with error about system headers andry at inbox dot ru

June 15, 2008
23:46 [Bug testsuite/36544] New: fseek.f90 does not correctly account for newline lengths jvdelisle at gcc dot gnu dot o
22:50 [Bug middle-end/35853] [4.4 Regression] -d is still referenced in some cases (documentation) hubicka at gcc dot gnu dot org
21:37 [Bug target/36424] avr-gcc use don't saved registers in ISR with -O3 ('-frename-registers' ) optimization aesok at gcc dot gnu dot org
21:33 [Bug target/36424] avr-gcc use don't saved registers in ISR with -O3 ('-frename-registers' ) optimization aesok at gcc dot gnu dot org
20:09 [Bug fortran/36515] Integer read from stdin yields a value overflow for a valid integer. jvdelisle at gcc dot gnu dot o
20:04 [Bug fortran/36515] Integer read from stdin yields a value overflow for a valid integer. jvdelisle at gcc dot gnu dot o
20:02 [Bug fortran/36515] Integer read from stdin yields a value overflow for a valid integer. jvdelisle at gcc dot gnu dot o
19:58 [Bug testsuite/36440] [4.4 Regression] FAIL: g++.dg/cdce3.C on powerpc-apple-darwin8.5.0 danglin at gcc dot gnu dot org
19:37 [Bug testsuite/36087] [4.4 Regression] test failures between revs. 134696 and 134717 danglin at gcc dot gnu dot org
19:12 [Bug libstdc++/36543] New: Precompiled headers are not installed danglin at gcc dot gnu dot org
18:37 [Bug target/36336] ICE push_reload - psuedo reg_equiv_constant hutchinsonandy at gcc dot gnu
18:36 [Bug target/36336] ICE push_reload - psuedo reg_equiv_constant hutchinsonandy at gcc dot gnu
18:26 [Bug target/36336] ICE push_reload - psuedo reg_equiv_constant hutchinsonandy at gcc dot gnu
17:42 [Bug fortran/36540] libgfortran compile warnings jvdelisle at gcc dot gnu dot o
16:12 [Bug c++/36391] Compilation never ends ivan at cvut dot cz
16:06 [Bug c++/36391] Compilation never ends ivan at cvut dot cz
15:14 [Bug fortran/36403] [4.4 Regression] Some fortran tests using eoshift fail on SH fxcoudert at gcc dot gnu dot o
15:14 [Bug fortran/36132] _gfortran_internal_pack on optional arguments fxcoudert at gcc dot gnu dot o
15:12 [Bug fortran/34040] relation between kinds and C types (for math builtins) shouldn't be hardcoded fxcoudert at gcc dot gnu dot o
15:12 [Bug web/16024] Document use of relative path to ${srcdir}/configure when using MSYS fxcoudert at gcc dot gnu dot o
15:12 [Bug fortran/31593] Invariant DO loop variables and subroutines fxcoudert at gcc dot gnu dot o
15:11 [Bug fortran/33197] Fortran 2008: math functions fxcoudert at gcc dot gnu dot o
14:54 [Bug testsuite/36440] [4.4 Regression] FAIL: g++.dg/cdce3.C on powerpc-apple-darwin8.5.0 danglin at gcc dot gnu dot org
14:02 [Bug middle-end/36542] 300% code bloat with -O3 tim at klingt dot org
13:40 [Bug middle-end/36542] 300% code bloat with -O3 pinskia at gcc dot gnu dot org
13:03 [Bug tree-optimization/21485] [4.1/4.2 Regression] codegen regression due to PRE increasing register pressure (missing load PRE really) wbrana at gmail dot com
13:00 [Bug middle-end/36542] 300% code bloat with -O3 tim at klingt dot org
12:43 [Bug middle-end/36542] 300% code bloat with -O3 pinskia at gcc dot gnu dot org
12:38 [Bug middle-end/36542] 300% code bloat with -O3 pinskia at gcc dot gnu dot org
12:37 [Bug middle-end/36542] 300% code bloat with -O3 pinskia at gcc dot gnu dot org
12:37 [Bug bootstrap/36541] Make failed with error about system headers andry at inbox dot ru
12:21 [Bug c++/35320] [4.1/4.2 regression] ICE with invalid friend declaration simartin at gcc dot gnu dot or
12:19 [Bug c++/35317] [4.1/4.2 regression] ICE with operator delete[] and ellipsis simartin at gcc dot gnu dot or
12:07 [Bug c++/35320] [4.1/4.2/4.3/4.4 regression] ICE with invalid friend declaration simartin at gcc dot gnu dot or
11:59 [Bug c++/35317] [4.1/4.2/4.3/4.4 regression] ICE with operator delete[] and ellipsis simartin at gcc dot gnu dot or
11:25 [Bug fastjar/36542] 300% code bloat with -O3 tim at klingt dot org
11:24 [Bug fastjar/36542] New: 300% code bloat with -O3 tim at klingt dot org
09:18 [Bug fortran/36540] libgfortran compile warnings burnus at gcc dot gnu dot org
09:04 [Bug fortran/36540] libgfortran compile warnings schwab at suse dot de
08:05 [Bug fortran/36540] libgfortran compile warnings burnus at gcc dot gnu dot org
05:32 [Bug bootstrap/36541] Make failed with error about system headers dannysmith at users dot source
02:26 [Bug bootstrap/36541] New: Make failed with error about system headers andry at inbox dot ru

June 14, 2008
22:04 [Bug other/36498] [4.3 Regression] time/memory hog for large c++ source. rguenther at suse dot de
20:38 [Bug fortran/36540] New: libgfortran compile warnings burnus at gcc dot gnu dot org
19:51 [Bug java/36247] Segfault with -findirect-dispatch and --jni tromey at gcc dot gnu dot org
19:51 [Bug java/36247] Segfault with -findirect-dispatch and --jni tromey at gcc dot gnu dot org
19:49 [Bug java/36247] Segfault with -findirect-dispatch and --jni tromey at gcc dot gnu dot org
18:16 [Bug testsuite/35406] gfortran.dg/ldist-1.f90 and gcc.dg/tree-ssa/ldist-4.c don't work danglin at gcc dot gnu dot org
17:59 [Bug libfortran/36538] namelist failure with tabs preceding object name jvdelisle at gcc dot gnu dot o
17:00 [Bug fortran/36276] [4.3/4.4 Regression] possible issue with opening fortran files? burnus at gcc dot gnu dot org
16:48 [Bug fortran/36276] [4.3/4.4 Regression] possible issue with opening fortran files? burnus at gcc dot gnu dot org
16:25 [Bug bootstrap/11776] configure from path with spaces does not work pinskia at gcc dot gnu dot org
16:25 [Bug bootstrap/36536] make broken if path to build directory has spaces pinskia at gcc dot gnu dot org
16:09 [Bug bootstrap/36536] make broken if path to build directory has spaces andry at inbox dot ru
15:53 [Bug bootstrap/36536] make broken if path to build directory has spaces andry at inbox dot ru
15:52 [Bug bootstrap/36536] make broken if path to build directory has spaces andry at inbox dot ru
15:44 [Bug tree-optimization/36218] [4.2/4.3/4.4 regression] VRP causes stack overflow while building libgcj aaronavay62 at aaronwl dot com
14:56 [Bug rtl-optimization/35604] Label references are not updated after edge insertion hjl dot tools at gmail dot com
14:05 [Bug tree-optimization/36519] [4.3 Regression] time/memory hog for c++ source. pluto at agmk dot net
13:53 [Bug libfortran/36538] namelist failure with tabs preceding object name jvdelisle at gcc dot gnu dot o
12:24 [Bug libfortran/36538] namelist failure with tabs preceding object name aldot at gcc dot gnu dot org
11:18 [Bug rtl-optimization/35604] Label references are not updated after edge insertion ubizjak at gmail dot com
10:02 [Bug tree-optimization/36218] [4.2/4.3/4.4 regression] VRP causes stack overflow while building libgcj dannysmith at users dot source
08:43 [Bug bootstrap/30739] awk Prerequisite is not documented rwild at gcc dot gnu dot org
07:26 [Bug bootstrap/33781] [4.3/4.4 Regression] "Arg list too long" building libgcc.a rwild at gcc dot gnu dot org
07:10 [Bug bootstrap/36536] make broken if path to build directory has spaces pinskia at gcc dot gnu dot org
07:10 [Bug bootstrap/36536] make broken if path to build directory has spaces pinskia at gcc dot gnu dot org
07:10 [Bug bootstrap/36537] make broken if path to build directory has spaces pinskia at gcc dot gnu dot org
06:53 [Bug target/36539] IRA doesn't allocate asm output being returned to eax pinskia at gcc dot gnu dot org
06:49 [Bug target/36539] [4.4 regression] IRA doesn't allocate asm output being returned to eax astrange at ithinksw dot com
06:48 [Bug target/36539] New: [4.4 regression] IRA doesn't allocate asm output being returned to eax astrange at ithinksw dot com
06:28 [Bug tree-optimization/36218] [4.2/4.3/4.4 regression] VRP causes stack overflow while building libgcj aph at gcc dot gnu dot org
06:00 [Bug tree-optimization/36218] [4.2/4.3/4.4 regression] VRP causes stack overflow while building libgcj ian at airs dot com
05:23 [Bug c++/35320] [4.1/4.2/4.3/4.4 regression] ICE with invalid friend declaration simartin at gcc dot gnu dot or
05:15 [Bug fortran/36535] gfortran.dg/parameter_array_init_4.f90 doesn't work jvdelisle at gcc dot gnu dot o
05:15 [Bug fortran/36534] Bogus: '__convert_s1_s4' at (1) is obsolescent in fortran 95 jvdelisle at gcc dot gnu dot o
04:41 [Bug libfortran/36538] namelist failure with tabs preceding object name jvdelisle at gcc dot gnu dot o
04:40 [Bug libfortran/36538] namelist failure with tabs preceding object name jvdelisle at gcc dot gnu dot o
04:32 [Bug libfortran/36538] namelist failure with tabs preceding object name jvdelisle at gcc dot gnu dot o
03:54 [Bug libfortran/36538] namelist failure with tabs preceding object name jvdelisle at gcc dot gnu dot o
03:29 [Bug libfortran/36538] namelist failure with tabs preceding object name jvdelisle at gcc dot gnu dot o
03:28 [Bug libfortran/36538] New: namelist failure with tabs preceding object name jvdelisle at gcc dot gnu dot o
03:05 [Bug bootstrap/36537] New: make broken if path to build directory has spaces andry at inbox dot ru
02:55 [Bug bootstrap/36536] New: make broken if path to build directory has spaces andry at inbox dot ru
00:20 [Bug c++/35317] [4.1/4.2/4.3/4.4 regression] ICE with operator delete[] and ellipsis simartin at gcc dot gnu dot or
00:13 [Bug c++/36530] ptrdiff_t undefined if <stddef.h> is included after <wchar.h> and <wctype.h> paolo dot carlini at oracle do

June 13, 2008
23:06 [Bug fortran/36534] Bogus: '__convert_s1_s4' at (1) is obsolescent in fortran 95 fxcoudert at gcc dot gnu dot o
22:49 [Bug fortran/36535] New: gfortran.dg/parameter_array_init_4.f90 doesn't work hjl dot tools at gmail dot com
22:20 [Bug target/36533] [4.3/4.4 Regression] Incorrectly assumed aligned_operand jakub at gcc dot gnu dot org
22:15 [Bug target/36533] [4.3/4.4 Regression] Incorrectly assumed aligned_operand bergner at gcc dot gnu dot org
22:00 [Bug libstdc++/35637] [4.3 Regression] tr1::function fails with const member function pointer mmitchel at gcc dot gnu dot or
21:58 [Bug rtl-optimization/36419] [4.1/4.3/4.4 Regression] Wrong unwind info with -Os -fasynchronous-unwind-tables jakub at gcc dot gnu dot org
21:55 [Bug bootstrap/35752] [4.3/4.4 Regression]: Combined gcc + binutils source tree doesn't bootstrap with --enable-shared mmitchel at gcc dot gnu dot or
21:54 [Bug target/36349] gcc-4.3.0 build fails with multiple definitions phorgan1 at gmail dot com
21:54 [Bug tree-optimization/36519] [4.3 Regression] time/memory hog for c++ source. mmitchel at gcc dot gnu dot or
21:53 [Bug other/36498] [4.3 Regression] time/memory hog for large c++ source. mmitchel at gcc dot gnu dot or
21:51 [Bug tree-optimization/36373] [4.2/4.3/4.4 Regression] Wrong code with struct return mmitchel at gcc dot gnu dot or
21:47 [Bug middle-end/36369] [4.3/4.4 Regression] may_alias broken with previous uses of non attributed type in some cases mmitchel at gcc dot gnu dot or
21:47 [Bug target/36533] [4.3/4.4 Regression] Incorrectly assumed aligned_operand pinskia at gcc dot gnu dot org
21:46 [Bug tree-optimization/36508] [4.3 Regression] ICE in compute_antic mmitchel at gcc dot gnu dot or
21:45 [Bug tree-optimization/36504] [4.3/4.4 regression] ICE when building xorg-server with -O3 -fprefetch-loop-arrays mmitchel at gcc dot gnu dot or
21:45 [Bug tree-optimization/36493] [4.3/4.4 Regression] vectorizer aliasing bug mmitchel at gcc dot gnu dot or
21:44 [Bug tree-optimization/36439] [4.3/4.4 Regression] infinite loop in PRE building gimp-plugin-registry mmitchel at gcc dot gnu dot or
21:44 [Bug rtl-optimization/36419] [4.1/4.3/4.4 Regression] Wrong unwind info with -Os -fasynchronous-unwind-tables mmitchel at gcc dot gnu dot or
21:43 [Bug rtl-optimization/36365] [4.3/4.4 Regression] Hang in df_analyze mmitchel at gcc dot gnu dot or
21:42 [Bug testsuite/36344] [4.3/4.4 Regression] gcc.dg/tree-ssa/loadpre8.c XFAILed mmitchel at gcc dot gnu dot or
21:42 [Bug tree-optimization/36218] [4.2/4.3/4.4 regression] VRP causes stack overflow while building libgcj mmitchel at gcc dot gnu dot or
21:41 [Bug bootstrap/35619] [4.3/4.4 Regression] fixed includes not being found if building in src dir mmitchel at gcc dot gnu dot or
21:39 [Bug c++/36364] [4.1/4.2/4.3/4.4 Regression] Problem with -frepo mmitchel at gcc dot gnu dot or
21:34 [Bug fortran/36534] New: Bogus: '__convert_s1_s4' at (1) is obsolescent in fortran 95 burnus at gcc dot gnu dot org
21:33 [Bug target/36533] [4.3/4.4 Regression] Incorrectly assumed aligned_operand jakub at gcc dot gnu dot org
21:32 [Bug target/36533] New: [4.3/4.4 Regression] Incorrectly assumed aligned_operand jakub at gcc dot gnu dot org
21:19 [Bug fortran/36342] [4.4 Regression] Missing file name in compilation diagnostics of preprocessed fortran source burnus at gcc dot gnu dot org
20:36 [Bug fortran/36492] incorrect error when compiling d at domob dot eu
20:36 [Bug libfortran/35863] [F2003] Implement ENCODING="UTF-8" jvdelisle at gcc dot gnu dot o
20:32 [Bug libfortran/35863] [F2003] Implement ENCODING="UTF-8" jvdelisle at gcc dot gnu dot o
20:29 [Bug libfortran/35863] [F2003] Implement ENCODING="UTF-8" jvdelisle at gcc dot gnu dot o
20:26 [Bug fortran/36492] incorrect error when compiling burnus at gcc dot gnu dot org
19:28 [Bug rtl-optimization/36529] -fsee causes ICE pinskia at gcc dot gnu dot org
18:52 [Bug middle-end/36532] ICE in simplify_subreg at simplify-rtx.c:4484 pinskia at gcc dot gnu dot org
18:48 [Bug fortran/36518] libgfortran: "warning: format '%d' expects type 'int', but" burnus at gcc dot gnu dot org
18:47 [Bug c/36532] New: ICE in simplify_subreg at simplify-rtx.c:4484 matti dot niemenmaa+gccbugs at
18:44 [Bug fortran/36518] libgfortran: "warning: format '%d' expects type 'int', but" burnus at gcc dot gnu dot org
18:30 [Bug libgomp/36469] bootstrap broken on HPUX PA andreast at gcc dot gnu dot or
18:11 [Bug fortran/36492] incorrect error when compiling burnus at gcc dot gnu dot org
17:54 [Bug fortran/36517] Type-spec in array constructor: Invalid error for -std=f2003/f2008 d at domob dot eu
17:53 [Bug fortran/36526] pointer in pure function burnus at gcc dot gnu dot org
17:21 [Bug c/36531] -Wno-packed appears to be disconnected/ignored jmorrison at printronix dot co
17:09 [Bug c/36531] New: -Wno-packed appears to be disconnected/ignored jmorrison at printronix dot co
17:04 [Bug fortran/36517] Type-spec in array constructor: Invalid error for -std=f2003/f2008 d at domob dot eu
16:55 [Bug fortran/36528] Cray pointer to function mishandled burnus at gcc dot gnu dot org
16:13 [Bug libstdc++/36530] New: ptrdiff_t undefined if <stddef.h> is included after <wchar.h> and <wctype.h> faridz at apache dot org
16:03 [Bug preprocessor/36479] Short buffer in libcpp tromey at gcc dot gnu dot org
15:36 [Bug c++/36529] -fsee causes ICE william dot l dot maynard at n
15:30 [Bug c++/36529] -fsee causes ICE william dot l dot maynard at n
15:24 [Bug c++/36529] New: -fsee causes ICE william dot l dot maynard at n
14:35 [Bug tree-optimization/31849] [4.3/4.4 Regression] Code size increased with PR 31360 (IV-opts not understanding autoincrement) pinskia at gcc dot gnu dot org
14:35 [Bug target/36135] GCC creates suboptimal ASM : suboptimal Adressing-Modes used pinskia at gcc dot gnu dot org
14:30 [Bug fortran/36528] New: Cray pointer to function mishandled burnus at gcc dot gnu dot org
13:38 [Bug tree-optimization/36524] regression: crash when compiling IdentifierTable.cpp edwintorok at gmail dot com
13:35 [Bug target/36135] GCC creates suboptimal ASM : suboptimal Adressing-Modes used gunnar at greyhound-data dot c
13:30 [Bug fortran/36517] Type-spec in array constructor: Invalid error for -std=f2003/f2008 burnus at gcc dot gnu dot org
13:30 [Bug c++/36523] OpenMP task construct fails to instantiate copy constructor jakub at gcc dot gnu dot org
13:15 [Bug fortran/36476] ICE: len=* CHARACTER array with separate PARAMETER statement burnus at gcc dot gnu dot org
13:05 [Bug fortran/36476] ICE: len=* CHARACTER array with separate PARAMETER statement burnus at gcc dot gnu dot org
13:02 [Bug target/36527] gcc 4.2.x generates wrong code for ARM target benny at ammitzboell-consult d
13:02 [Bug target/36527] gcc 4.2.x generates wrong code for ARM target benny at ammitzboell-consult d
13:01 [Bug target/36527] gcc 4.2.x generates wrong code for ARM target benny at ammitzboell-consult d
13:01 [Bug target/36527] gcc 4.2.x generates wrong code for ARM target benny at ammitzboell-consult d
13:00 [Bug target/36527] gcc 4.2.x generates wrong code for ARM target benny at ammitzboell-consult d
13:00 [Bug target/36527] gcc 4.2.x generates wrong code for ARM target benny at ammitzboell-consult d
12:59 [Bug target/36527] New: gcc 4.2.x generates wrong code for ARM target benny at ammitzboell-consult d
12:58 [Bug fortran/36526] New: pointer in pure function aradi at bccms dot uni-bremen
12:54 [Bug target/36525] New: prologue code may give invalid stack back chain amodra at bigpond dot net dot
12:02 [Bug tree-optimization/36524] regression: crash when compiling IdentifierTable.cpp edwintorok at gmail dot com
11:46 [Bug tree-optimization/36524] regression: crash when compiling IdentifierTable.cpp rguenth at gcc dot gnu dot org
11:35 [Bug tree-optimization/36524] regression: crash when compiling IdentifierTable.cpp edwintorok at gmail dot com
11:29 [Bug c/36521] Expression in for expression gets wrong value rguenth at gcc dot gnu dot org
11:24 [Bug tree-optimization/36524] regression: crash when compiling IdentifierTable.cpp rguenth at gcc dot gnu dot org
10:39 [Bug tree-optimization/36524] New: regression: crash when compiling IdentifierTable.cpp edwintorok at gmail dot com
10:24 [Bug middle-end/36520] [4.4 Regression] ICE in get_memory_rtx ebotcazou at gcc dot gnu dot o
10:22 [Bug middle-end/36520] [4.4 Regression] ICE in get_memory_rtx ebotcazou at gcc dot gnu dot o
10:08 [Bug c++/36523] New: OpenMP task construct fails to instantiate copy constructor singler at gcc dot gnu dot org
10:02 [Bug tree-optimization/36519] [4.3 Regression] time/memory hog for c++ source. rguenth at gcc dot gnu dot org
09:55 [Bug fortran/36517] Type-spec in array constructor: Invalid error for -std=f2003/f2008 burnus at gcc dot gnu dot org
09:54 [Bug c/36507] [4.3/4.4 Regression] ISO C99 inline semantics doesn't play together with nested functions jakub at gcc dot gnu dot org
09:42 [Bug c/36507] [4.3/4.4 Regression] ISO C99 inline semantics doesn't play together with nested functions jakub at gcc dot gnu dot org
09:40 [Bug c/36507] [4.3/4.4 Regression] ISO C99 inline semantics doesn't play together with nested functions jakub at gcc dot gnu dot org
09:37 [Bug fortran/36518] libgfortran: "warning: format '%d' expects type 'int', but" burnus at gcc dot gnu dot org
09:32 [Bug target/36135] GCC creates suboptimal ASM : suboptimal Adressing-Modes used gunnar at greyhound-data dot c
09:28 [Bug tree-optimization/36519] [4.3 Regression] time/memory hog for c++ source. rguenth at gcc dot gnu dot org
09:16 [Bug tree-optimization/36519] [4.3 Regression] time/memory hog for c++ source. rguenth at gcc dot gnu dot org
08:52 [Bug c/36521] Expression in for expression gets wrong value peter at xmos dot com
08:52 [Bug c/36521] New: Expression in for expression gets wrong value peter at xmos dot com
08:47 [Bug middle-end/36520] [4.4 Regression] ICE in get_memory_rtx ebotcazou at gcc dot gnu dot o
08:43 [Bug other/36498] [4.3 Regression] time/memory hog for large c++ source. rguenth at gcc dot gnu dot org
08:36 [Bug middle-end/36520] [4.4 Regression] ICE in get_memory_rtx rguenth at gcc dot gnu dot org
08:34 [Bug middle-end/36520] [4.4 Regression] ICE in get_memory_rtx rguenth at gcc dot gnu dot org
08:30 [Bug middle-end/36520] New: [4.4 Regression] ICE in get_memory_rtx rguenth at gcc dot gnu dot org
08:18 [Bug other/36519] [4.3 Regression] time/memory hog for c++ source. pluto at agmk dot net
08:16 [Bug other/36519] New: [4.3 Regression] time/memory hog for c++ source. pluto at agmk dot net
08:15 [Bug tree-optimization/36511] [4.4 Regression] ice for legal code with -O2 rguenth at gcc dot gnu dot org
07:43 [Bug fortran/36495] libgfortran should be build with FCFLAGS -fimplicit-none burnus at gcc dot gnu dot org
07:35 [Bug fortran/36518] New: libgfortran: "warning: format '%d' expects type 'int', but" burnus at gcc dot gnu dot org
07:11 [Bug fortran/36495] libgfortran should be build with FCFLAGS -fimplicit-none burnus at gcc dot gnu dot org
06:12 [Bug fortran/36517] New: Type-spec in array constructor ignored for PARAMETER burnus at gcc dot gnu dot org
05:32 [Bug fortran/36515] Integer read from stdin yields a value overflow for a valid integer. kargl at gcc dot gnu dot org
04:58 [Bug c++/14179] [4.1/4.2/4.3/4.4 Regression] out of memory while parsing array with many initializers pinskia at gcc dot gnu dot org
04:58 [Bug c/36516] Gcc fails on huge C source files. pinskia at gcc dot gnu dot org
04:38 [Bug fortran/36515] Integer read from stdin yields a value overflow for a valid integer. pinskia at gcc dot gnu dot org
04:31 [Bug c/36516] New: Gcc fails on huge C source files. alexey dot zaytsev at gmail do
04:21 [Bug fortran/36515] Integer read from stdin yields a value overflow for a valid integer. jvdelisle at gcc dot gnu dot o
04:20 [Bug fortran/36515] Integer read from stdin yields a value overflow for a valid integer. jvdelisle at gcc dot gnu dot o
03:31 [Bug fortran/36515] Integer read from stdin yields a value overflow for a valid integer. kargl at gcc dot gnu dot org
03:26 [Bug fortran/36515] Integer read from stdin yields a value overflow for a valid integer. kargl at gcc dot gnu dot org
03:09 [Bug fortran/36515] Integer read from stdin yields a value overflow for a valid integer. Walter dot Szeliga at Colorado
03:05 [Bug fortran/36515] Integer read from stdin yields a value overflow for a valid integer. jvdelisle at gcc dot gnu dot o
01:29 [Bug java/35923] gcj: error trying to exec 'ecj1': execvp: No such file or directory sebasmagri at gmail dot com

June 12, 2008
22:22 [Bug fortran/36515] Integer read from stdin yields a value overflow for a valid integer. Walter dot Szeliga at Colorado
22:15 [Bug fortran/36515] Integer read from stdin yields a value overflow for a valid integer. kargl at gcc dot gnu dot org
21:57 [Bug fortran/36515] New: Integer read from stdin yields a value overflow for a valid integer. szeliga at colorado dot edu
21:46 [Bug bootstrap/33781] [4.3/4.4 Regression] "Arg list too long" building libgcc.a Ralf dot Wildenhues at gmx dot
21:31 [Bug bootstrap/33781] [4.3/4.4 Regression] "Arg list too long" building libgcc.a roger at eyesopen dot com
21:22 [Bug inline-asm/23242] Invalid %sil register chosen when dereferenced pointer used in inline asm with -O0 pinskia at gcc dot gnu dot org
21:22 [Bug inline-asm/36514] inline assembly generates wrong code pinskia at gcc dot gnu dot org
21:18 [Bug inline-asm/36514] New: inline assembly generates wrong code codemasterhs at yahoo dot de
20:18 [Bug tree-optimization/36508] [4.3 Regression] ICE in compute_antic rguenther at suse dot de
19:27 [Bug fortran/36476] ICE: len=* CHARACTER array with separate PARAMETER statement burnus at gcc dot gnu dot org
19:09 [Bug c/36513] -Wlogical-op warns about strchr pinskia at gcc dot gnu dot org
19:01 [Bug c/36513] New: -Wlogical-op warns about strchr otte at gnome dot org
18:40 [Bug preprocessor/36479] Short buffer in libcpp hjl dot tools at gmail dot com
18:35 [Bug bootstrap/36512] relocation overflow pinskia at gcc dot gnu dot org
18:33 [Bug fortran/36476] ICE: len=* CHARACTER array with separate PARAMETER statement burnus at gcc dot gnu dot org
18:30 [Bug bootstrap/36512] New: [4.3.0/4.3.1 regression] relocation overflow kate01123 at gmail dot com
18:20 [Bug fortran/36341] MATMUL: Bounds check missing (run time & compile time) tkoenig at gcc dot gnu dot org
18:16 [Bug fortran/36495] libgfortran should be build with FCFLAGS -fimplicit-none tkoenig at gcc dot gnu dot org
17:05 [Bug preprocessor/36479] Short buffer in libcpp hjl at gcc dot gnu dot org
17:04 [Bug c++/36511] New: ice for legal code with -O2 dcb314 at hotmail dot com
16:49 [Bug target/36503] x86 can use x >> -y for x >> 32-y astrange at ithinksw dot com
16:18 [Bug fortran/36462] KIND argument in INDEX results in wrong code burnus at gcc dot gnu dot org
16:17 [Bug fortran/36462] KIND argument in INDEX results in wrong code burnus at gcc dot gnu dot org
15:52 [Bug target/36510] New: gcc.dg/vect/costmodel/ppc failures jsm28 at gcc dot gnu dot org
14:53 [Bug tree-optimization/36508] [4.3 Regression] ICE in compute_antic dberlin at gcc dot gnu dot org
14:51 [Bug tree-optimization/36508] [4.3 Regression] ICE in compute_antic dberlin at dberlin dot org
14:47 [Bug middle-end/36509] [4.4 Regression]: gcc.dg/Wstrict-aliasing-float-ptr-int-obj.c rguenth at gcc dot gnu dot org
14:46 [Bug middle-end/36509] [4.4 Regression]: gcc.dg/Wstrict-aliasing-float-ptr-int-obj.c rguenth at gcc dot gnu dot org
14:41 [Bug tree-optimization/36508] [4.3 Regression] ICE in compute_antic rguenth at gcc dot gnu dot org
14:40 [Bug tree-optimization/36508] [4.3 Regression] ICE in compute_antic rguenth at gcc dot gnu dot org
14:38 [Bug target/36135] GCC creates suboptimal ASM : suboptimal Adressing-Modes used pinskia at gcc dot gnu dot org
14:35 [Bug target/36135] GCC creates suboptimal ASM : suboptimal Adressing-Modes used gunnar at greyhound-data dot c
14:33 [Bug middle-end/36509] New: [4.4 Regression]: gcc.dg/Wstrict-aliasing-float-ptr-int-obj.c hjl dot tools at gmail dot com
14:27 [Bug target/36134] GCC creates suboptimal ASM : usage of ADDA.L where LEA could be used gunnar at greyhound-data dot c
14:27 [Bug target/36133] GCC creates suboptimal ASM : Code includes unneeded TST instructions gunnar at greyhound-data dot c
14:22 [Bug tree-optimization/36508] [4.3 Regression] ICE in compute_antic rguenth at gcc dot gnu dot org
14:21 [Bug tree-optimization/36508] [4.3 Regression] ICE in compute_antic pinskia at gcc dot gnu dot org
14:16 [Bug tree-optimization/36508] [4.3 Regression] ICE in compute_antic rguenth at gcc dot gnu dot org
14:16 [Bug c/36507] [4.3/4.4 Regression] ISO C99 inline semantics doesn't play together with nested functions jakub at gcc dot gnu dot org
14:15 [Bug rtl-optimization/323] optimized code gives strange floating point results pepalogik at seznam dot cz
14:05 [Bug tree-optimization/36508] [4.3 Regression] ICE in compute_antic rguenth at gcc dot gnu dot org
14:01 [Bug tree-optimization/36508] [4.3 Regression] ICE in compute_antic rguenth at gcc dot gnu dot org
13:59 [Bug tree-optimization/36508] [4.3 Regression] ICE in compute_attic jakub at gcc dot gnu dot org
13:58 [Bug tree-optimization/36508] [4.3 Regression] ICE in compute_attic jakub at gcc dot gnu dot org
13:58 [Bug tree-optimization/36508] New: [4.3 Regression] ICE in compute_attic jakub at gcc dot gnu dot org
13:55 [Bug middle-end/36506] [4.3/4.4 Regression] Broken #pragma omp sections reduction (+:x) jakub at gcc dot gnu dot org
13:55 [Bug c/36507] [4.3/4.4 Regression] ISO C99 inline semantics doesn't play together with nested functions joseph at codesourcery dot com
13:50 [Bug middle-end/36506] [4.3/4.4 Regression] Broken #pragma omp sections reduction (+:x) jakub at gcc dot gnu dot org
13:34 [Bug tree-optimization/36387] [4.2/4.3/4.4 Regression] points-to variables not transitively clobbered rguenth at gcc dot gnu dot org
13:32 [Bug tree-optimization/36400] [4.2/4.3/4.4 Regression] points-to results wrong rguenth at gcc dot gnu dot org
13:18 [Bug c/36507] [4.3/4.4 Regression] ISO C99 inline semantics doesn't play together with nested functions rguenth at gcc dot gnu dot org
13:11 [Bug fortran/36492] incorrect error when compiling clerman at fuse dot net
13:08 [Bug c/36507] [4.3/4.4 Regression] ISO C99 inline semantics doesn't play together with nested functions jakub at gcc dot gnu dot org
13:01 [Bug c/36507] [4.3/4.4 Regression] ISO C99 inline semantics doesn't play together with nested functions jakub at gcc dot gnu dot org
12:51 [Bug c/36507] [4.3/4.4 Regression] ISO C99 inline semantics doesn't play together with nested functions jakub at gcc dot gnu dot org
12:51 [Bug c/36507] New: [4.3/4.4 Regression] ISO C99 inline semantics doesn't play together with nested functions jakub at gcc dot gnu dot org
12:51 [Bug fortran/36495] libgfortran should be build with FCFLAGS -fimplicit-none linuxl4 at sohu dot com
12:48 [Bug middle-end/36506] [4.3/4.4 Regression] Broken #pragma omp sections reduction (+:x) jakub at gcc dot gnu dot org
12:35 Email Policy Violation mjadmin
12:34 [Bug testsuite/36443] [4.3/4.4 Regression]: HOSTCC doesn't work with installed gcc hjl dot tools at gmail dot com
11:41 [Bug testsuite/36443] [4.3/4.4 Regression]: HOSTCC doesn't work with installed gcc jakub at gcc dot gnu dot org
11:40 [Bug testsuite/36443] [4.3/4.4 Regression]: HOSTCC doesn't work with installed gcc jakub at gcc dot gnu dot org
11:18 [Bug testsuite/36443] [4.3/4.4 Regression]: HOSTCC doesn't work with installed gcc jakub at gcc dot gnu dot org
11:14 [Bug middle-end/36506] [4.3/4.4 Regression] Broken #pragma omp sections reduction (+:x) jakub at gcc dot gnu dot org
11:08 [Bug middle-end/36506] [4.3/4.4 Regression] Broken #pragma omp sections reduction (+:x) jakub at gcc dot gnu dot org
11:05 [Bug middle-end/36506] [4.3/4.4 Regression] Broken #pragma omp sections reduction (+:x) jakub at gcc dot gnu dot org
10:44 [Bug target/36503] x86 can use x >> -y for x >> 32-y ubizjak at gmail dot com
10:25 [Bug tree-optimization/36400] points-to results wrong rguenth at gcc dot gnu dot org
10:23 [Bug tree-optimization/36345] TBAA-pruning of points-to sets ineffective rguenth at gcc dot gnu dot org
10:23 [Bug tree-optimization/36345] TBAA-pruning of points-to sets ineffective rguenth at gcc dot gnu dot org
10:22 [Bug middle-end/36506] New: [4.3/4.4 Regression] Broken #pragma omp sections reduction (+:x) jakub at gcc dot gnu dot org
10:20 [Bug c++/36405] [4.3/4.4 regression] ICE with typeid of member function paolo dot carlini at oracle do
10:17 [Bug target/35860] [4.3/4.4 Regression] [avr] code bloat caused by -fsplit-wide-types jakub at gcc dot gnu dot org
10:16 [Bug rtl-optimization/35542] [4.3 Regression] fwprop only propagates one operand jakub at gcc dot gnu dot org
10:14 [Bug c++/36408] [4.3/4.4 regression] ICE with statement expression in template jakub at gcc dot gnu dot org
10:06 [Bug c++/36405] [4.3/4.4 regression] ICE with typeid of member function jakub at gcc dot gnu dot org
09:30 [Bug libstdc++/36505] C++ inludes do not work pontus dot astrom at csr dot c
09:30 [Bug tree-optimization/36504] [4.3/4.4 regression] ICE when building xorg-server with -O3 -fprefetch-loop-arrays rguenth at gcc dot gnu dot org
09:25 [Bug target/36503] x86 can use x >> -y for x >> 32-y rguenth at gcc dot gnu dot org
09:16 [Bug libstdc++/36505] C++ inludes do not work pontus dot astrom at csr dot c
09:13 [Bug target/36494] Char arrays gets corrupted in avr programs. martin at kfib dot org
09:12 [Bug libstdc++/36505] C++ inludes do not work pinskia at gcc dot gnu dot org
09:08 [Bug libstdc++/36505] New: C++ inludes do not work pontus dot astrom at csr dot c
06:59 [Bug fortran/36497] USE association, cray pointers and error checking burnus at gcc dot gnu dot org
00:13 [Bug preprocessor/36479] Short buffer in libcpp kris dot van dot hees at oracl
00:05 [Bug target/36503] x86 can use x >> -y for x >> 32-y pinskia at gcc dot gnu dot org

June 11, 2008
23:50 [Bug c++/359] [DR 45] g++ incorrectly grants access to private members to nested classes pinskia at gcc dot gnu dot org
23:50 [Bug c++/36499] non-compliant behaviour with nested classes pinskia at gcc dot gnu dot org
23:45 [Bug c++/11764] [DR147] g++ does not treat injected class name correctly. pinskia at gcc dot gnu dot org
23:45 [Bug c++/36501] GCC accepts invalid namespace qualified name when last namespace is repeated pinskia at gcc dot gnu dot org
23:43 [Bug target/36502] i386/darwin generates unnecessary stack ops in every function pinskia at gcc dot gnu dot org
23:38 [Bug target/36504] [4.3 regression] ICE when building xorg-server with -O3 -fprefetch-loop-arrays vapier at gentoo dot org
23:36 [Bug target/36504] New: [4.3 regression] ICE when building xorg-server with -O3 -fprefetch-loop-arrays vapier at gentoo dot org
22:53 [Bug target/36503] x86 can use x >> -y for x >> 32-y astrange at ithinksw dot com
22:53 [Bug target/36503] New: x86 can use x >> -y for x >> 32-y astrange at ithinksw dot com
22:18 [Bug target/36502] New: i386/darwin generates unnecessary stack ops in every function astrange at ithinksw dot com
22:06 [Bug target/36494] Char arrays gets corrupted in avr programs. hutchinsonandy at aim dot com
21:45 [Bug c/36500] gcc ICEs when being passed -mfpu=neon koen at openembedded dot org
21:18 [Bug other/36498] [4.3 Regression] time/memory hog for large c++ source. pluto at agmk dot net
21:14 [Bug target/36494] Char arrays gets corrupted in avr programs. martin at kfib dot org
21:05 [Bug other/36498] [4.3 Regression] time/memory hog for large c++ source. rguenth at gcc dot gnu dot org
20:50 [Bug other/36498] [4.3 Regression] time/memory hog for large c++ source. pluto at agmk dot net
20:42 [Bug other/36498] [4.3 Regression] time/memory hog for large c++ source. rguenth at gcc dot gnu dot org
20:30 [Bug c++/36242] OpenMP multi-threading crashes jakub at gcc dot gnu dot org
20:20 [Bug c++/36242] OpenMP multi-threading crashes steven at gcc dot gnu dot org
20:15 [Bug other/36498] [4.3 Regression] time/memory hog for large c++ source. pluto at agmk dot net
20:04 [Bug target/36425] Option -mno-isel not working jsm28 at gcc dot gnu dot org
19:54 [Bug c/36500] gcc ICEs when being passed -mfpu=neon jsm28 at gcc dot gnu dot org
19:48 [Bug c++/36501] New: GCC accepts invalid namespace qualified name when last namespace is repeated gp dot bolton at computer dot
19:36 [Bug other/36498] [4.3 Regression] time/memory hog for large c++ source. rguenth at gcc dot gnu dot org
19:28 [Bug other/36498] [4.3 Regression] time/memory hog for large c++ source. pluto at agmk dot net
18:53 [Bug c/36500] gcc ICEs when being passed -mfpu=neon koen at openembedded dot org
18:44 [Bug c/36500] New: gcc ICEs when being passed -mfpu=neon koen at openembedded dot org
18:13 [Bug target/36450] [4.4 Regression] ICE in insert_restore/insert_save with GET_MODE_ALIGNMENT mem aldot at gcc dot gnu dot org
18:07 gfortran-4.3.1 internal compiler error Jean-François Mertens
18:06 [Bug c++/4131] The C++ compiler don't place a const class object to ".rodata" section with non trivial constructor jyasskin at gmail dot com
16:59 [Bug c++/36405] [4.3/4.4 regression] ICE with typeid of member function paolo dot carlini at oracle do
15:40 [Bug tree-optimization/36245] [4.4 Regression] internal compiler error: in build2_stat, at tree.c:3116 dnovillo at gcc dot gnu dot or
15:21 [Bug other/36498] [4.3 Regression] time/memory hog for large c++ source. rguenth at gcc dot gnu dot org
14:56 [Bug other/36498] [4.3 Regression] time/memory hog for large c++ source. rguenth at gcc dot gnu dot org
14:47 [Bug other/36498] [4.3 Regression] time/memory hog for large c++ source. rguenth at gcc dot gnu dot org
14:42 [Bug bootstrap/33100] [4.3/4.4 regression] on bootstrap getting section .eh_frame: bad cie version 0: offset 0x0 hjl dot tools at gmail dot com
14:42 [Bug bootstrap/36496] [4.2.3/4.2.4 regression] bootstrap error - section .eh_frame: bad cie version hjl dot tools at gmail dot com
14:29 [Bug middle-end/36369] [4.3/4.4 Regression] may_alias broken with previous uses of non attributed type in some cases rguenth at gcc dot gnu dot org
14:28 [Bug c++/36405] [4.3/4.4 regression] ICE with typeid of member function jakub at gcc dot gnu dot org
14:18 [Bug middle-end/36369] [4.3/4.4 Regression] may_alias broken with previous uses of non attributed type in some cases rguenth at gcc dot gnu dot org
14:12 [Bug c++/36499] New: non-compliant behaviour with nested classes philippe dot dunski at ibelgiq
14:11 [Bug other/36498] [4.3 Regression] time/memory hog for large c++ source. pluto at agmk dot net
14:06 [Bug other/36498] [4.3 Regression] time/memory hog for large c++ source. pluto at agmk dot net
14:05 [Bug other/36498] New: [4.3 Regression] time/memory hog for large c++ source. pluto at agmk dot net
14:00 [Bug fortran/36497] New: USE association, cray pointers and error checking burnus at gcc dot gnu dot org
13:41 [Bug bootstrap/36496] New: [4.2.3/4.2.4 regression] bootstrap error - section .eh_frame: bad cie version kate01123 at gmail dot com
12:59 [Bug c++/36486] g++ accepts code with ambiguous overloading richard-gccbugzilla at metafoo
12:31 [Bug bootstrap/33396] add --enable-intermodule aldot at gcc dot gnu dot org
11:16 [Bug c++/35336] Broken diagnostic: 'bit_field_ref' not supported by dump_expr rguenth at gcc dot gnu dot org
11:16 [Bug tree-optimization/36449] Incorrect code generated for access to a large struct rguenth at gcc dot gnu dot org
11:16 [Bug tree-optimization/36493] [4.3/4.4 Regression] vectorizer aliasing bug jsm28 at gcc dot gnu dot org
11:15 [Bug fortran/36463] [4.4 Regression] ICE in expand_expr_real_1, at expr.c:7264 with rev.136554 jsm28 at gcc dot gnu dot org
11:15 [Bug testsuite/36458] [4.4 Regression] Invalid fortran-torture -msse2 tests on Athlon XP jsm28 at gcc dot gnu dot org
11:14 [Bug testsuite/36443] [4.3/4.4 Regression]: HOSTCC doesn't work with installed gcc jsm28 at gcc dot gnu dot org
11:14 [Bug testsuite/36440] [4.4 Regression] FAIL: g++.dg/cdce3.C on powerpc-apple-darwin8.5.0 jsm28 at gcc dot gnu dot org
11:13 [Bug fortran/36403] [4.4 Regression] Some fortran tests using eoshift fail on SH jsm28 at gcc dot gnu dot org
11:13 [Bug fortran/36342] [4.4 Regression] Missing file name in compilation diagnostics of preprocessed fortran source jsm28 at gcc dot gnu dot org
11:12 [Bug target/35860] [4.3/4.4 Regression] [avr] code bloat caused by -fsplit-wide-types jsm28 at gcc dot gnu dot org
11:11 [Bug c++/36407] [4.3/4.4 regression] ICE with conversion and -fpermissive rguenth at gcc dot gnu dot org
11:11 [Bug bootstrap/35752] [4.3/4.4 Regression]: Combined gcc + binutils source tree doesn't bootstrap with --enable-shared jsm28 at gcc dot gnu dot org
11:10 [Bug rtl-optimization/35542] [4.3 Regression] fwprop only propagates one operand jsm28 at gcc dot gnu dot org
11:10 [Bug middle-end/35412] [4.4 Regression] Correctness with -ftrapv depended on libcall notes jsm28 at gcc dot gnu dot org
10:50 [Bug tree-optimization/36218] [4.2/4.3/4.4 regression] VRP causes stack overflow while building libgcj aph at gcc dot gnu dot org
10:48 [Bug c++/36407] [4.3/4.4 regression] ICE with invalid conversion reichelt at gcc dot gnu dot or
10:35 [Bug target/36450] ICE in insert_restore/insert_save with GET_MODE_ALIGNMENT mem aldot at gcc dot gnu dot org
10:07 [Bug middle-end/32492] [4.3 Regression] attribute always_inline -> sorry, unimplemented: recursive inlining josep dot m dot perez at bsc d
09:18 [Bug tree-optimization/36474] [4.3 Regression] GCC takes forever to compile a certain file rguenth at gcc dot gnu dot org
09:17 [Bug tree-optimization/36474] [4.3 Regression] GCC takes forever to compile a certain file rguenth at gcc dot gnu dot org
08:37 [Bug tree-optimization/36493] [4.3/4.4 Regression] vectorizer aliasing bug rguenth at gcc dot gnu dot org
08:21 [Bug libgomp/36475] [gomp] register keyword in openmp handled for-loop fails jakub at gcc dot gnu dot org
08:08 [Bug tree-optimization/30052] [4.2 Regression] points-to analysis slow and memory hungry rguenther at suse dot de
08:01 [Bug tree-optimization/36493] [4.3/4.4 Regression] vectorizer aliasing bug irar at il dot ibm dot com
07:46 [Bug fortran/36495] New: libgfortran should be build with FCFLAGS -fimplicit-none burnus at gcc dot gnu dot org
07:13 [Bug libgomp/36471] omp_get_ancestor_thread_num_8 has no implicit type. jakub at gcc dot gnu dot org
07:08 [Bug libgomp/36471] omp_get_ancestor_thread_num_8 has no implicit type. jakub at gcc dot gnu dot org
06:54 [Bug libgomp/35644] omp_set_num_threads not working? jakub at gcc dot gnu dot org
06:49 [Bug libgomp/35881] OMP wrong results for omp_get_max_threads jakub at gcc dot gnu dot org
06:49 [Bug c++/36408] [4.3/4.4 regression] ICE with statement expression in template jakub at gcc dot gnu dot org
06:45 [Bug libgomp/36208] Boolean type discrepancy between gfortran and libgomp jakub at gcc dot gnu dot org
06:32 [Bug c++/36408] [4.3/4.4 regression] ICE with statement expression in template jakub at gcc dot gnu dot org
06:28 [Bug libgomp/36469] bootstrap broken on HPUX PA jakub at gcc dot gnu dot org
05:51 [Bug target/36494] Char arrays gets corrupted in avr programs. eric dot weddington at atmel d
05:37 [Bug fortran/36492] incorrect error when compiling burnus at gcc dot gnu dot org
03:48 [Bug middle-end/36166] Use of the 'nonnull' attribute breaks code pgut001 at cs dot auckland dot
02:35 [Bug target/36494] Char arrays gets corrupted in avr programs. hutchinsonandy at gcc dot gnu
02:18 [Bug c++/4131] The C++ compiler don't place a const class object to ".rodata" section with non trivial constructor pinskia at gcc dot gnu dot org
01:28 [Bug testsuite/36440] [4.4 Regression] FAIL: g++.dg/cdce3.C on powerpc-apple-darwin8.5.0 kkojima at gcc dot gnu dot org
00:08 [Bug c++/4131] The C++ compiler don't place a const class object to ".rodata" section with non trivial constructor jorg dot brown at gmail dot co

June 10, 2008
22:37 [Bug bootstrap/36481] gcc fails to build on Solaris x86 - it forgets the locations of libmpfr david dot kirkby at onetel dot
22:15 [Bug preprocessor/36453] PR36320 breaks boost mueller at gcc dot gnu dot org
22:06 [Bug target/36450] ICE in insert_restore/insert_save with GET_MODE_ALIGNMENT mem hjl dot tools at gmail dot com
21:48 [Bug target/36494] Char arrays gets corrupted in avr programs. pinskia at gcc dot gnu dot org
21:33 [Bug c++/36486] g++ accepts code with ambiguous overloading peterbindels at gmail dot com
21:23 [Bug c/36494] New: Char arrays gets corrupted in avr programs. martin at kfib dot org
20:46 [Bug driver/36491] Command line macro fails if definition contains spaces schulz at adi dot com
20:19 [Bug driver/36491] Command line macro fails if definition contains spaces pinskia at gcc dot gnu dot org
20:06 [Bug tree-optimization/36493] New: [4.3/4.4 Regression] vectorizer aliasing bug jsm28 at gcc dot gnu dot org
19:42 [Bug target/36028] [IRA] ICE in reload_cse_simplify_operands aldot at gcc dot gnu dot org
19:35 [Bug target/36450] ICE in insert_restore/insert_save with GET_MODE_ALIGNMENT mem aldot at gcc dot gnu dot org
19:03 [Bug target/36450] ICE in insert_restore/insert_save with GET_MODE_ALIGNMENT mem vmakarov at gcc dot gnu dot or
18:08 [Bug fortran/36492] New: incorrect error when compiling clerman at fuse dot net
17:46 [Bug c/36491] New: Command line macro fails if definition contains spaces schulz at adi dot com
17:27 [Bug tree-optimization/30052] [4.2 Regression] points-to analysis slow and memory hungry giovannibajo at libero dot it
16:44 [Bug c++/36490] New: Attempt to copy a temporary object during passing it to a function as a const reference dervih at interia dot pl
16:26 [Bug c/36489] New: Warning "initialized field overwritten" wrongly triggers with multidimensional arrays smeuuh at gmail dot com
16:02 [Bug target/25128] [m68k] Suboptimal comparisons against 65536 gunnar at greyhound-data dot c
15:52 [Bug c/36488] New: Generated 68K code bad for pipelining (case swap) gunnar at greyhound-data dot c
15:44 [Bug middle-end/36447] [4.4 Regression] simplify_subreg ICE with right shift more than length type AVR eric dot weddington at atmel d
15:43 [Bug testsuite/36285] gcc.dg/compat/struct-by-value-xxx improper test for AVR target eric dot weddington at atmel d
15:40 [Bug c/36487] New: Generated 68K code bad for pipelining gunnar at greyhound-data dot c
15:24 [Bug target/36134] GCC creates suboptimal ASM : usage of ADDA.L where LEA could be used gunnar at greyhound-data dot c
15:22 [Bug target/36484] g++ generates code with illegal instruction on Pentium D / x86_64 vincent at vinc17 dot org
14:52 [Bug target/36484] g++ generates code with illegal instruction on Pentium D / x86_64 vincent at vinc17 dot org
14:51 [Bug c++/36486] g++ accepts code with ambiguous overloading richard-gccbugzilla at metafoo
14:41 [Bug c++/36486] New: g++ accepts code with ambiguous overloading richard-gccbugzilla at metafoo
14:38 [Bug target/36484] g++ generates code with illegal instruction on Pentium D / x86_64 rguenth at gcc dot gnu dot org
14:03 [Bug target/36484] g++ generates code with illegal instruction on Pentium D / x86_64 vincent at vinc17 dot org
13:34 [Bug target/36484] g++ generates code with illegal instruction on Pentium D / x86_64 ubizjak at gmail dot com
12:38 [Bug target/36484] g++ generates code with illegal instruction on Pentium D / x86_64 vincent at vinc17 dot org
11:59 [Bug target/36484] g++ generates code with illegal instruction on Pentium D / x86_64 ubizjak at gmail dot com
11:54 [Bug middle-end/36166] Use of the 'nonnull' attribute breaks code joseph at codesourcery dot com
11:27 [Bug target/36484] g++ generates code with illegal instruction on Pentium D / x86_64 vincent at vinc17 dot org
11:23 [Bug driver/36485] New: gcc driver incorrectly assumes existence of $(prefix)/usr/lib pluto at agmk dot net
11:21 [Bug c/36359] [Regression] compile error in linux-kernel 2.6.26-rc4 with -O2 aldot at gcc dot gnu dot org
11:08 [Bug c/36359] [Regression] compile error in linux-kernel 2.6.26-rc4 with -O2 aldot at gcc dot gnu dot org
10:57 [Bug target/36079] [4.3/4.4 Regression] cld instruction is not emitted anymore. rguenther at suse dot de
10:30 [Bug target/36473] Generate bit test (bt) instructions uros at gcc dot gnu dot org
10:29 [Bug c/36359] [Regression] compile error in linux-kernel 2.6.26-rc4 with -O2 bunk at stusta dot de
10:12 [Bug c/36359] [Regression] compile error in linux-kernel 2.6.26-rc4 with -O2 bunk at stusta dot de
10:08 [Bug target/36079] [4.3/4.4 Regression] cld instruction is not emitted anymore. cnstar9988 at gmail dot com
09:57 [Bug middle-end/36166] Use of the 'nonnull' attribute breaks code rguenth at gcc dot gnu dot org
09:54 [Bug target/36484] g++ generates code with illegal instruction on Pentium D / x86_64 rguenth at gcc dot gnu dot org
09:52 [Bug c++/36483] Getting an address of a byte-aligned field declared as a bit-field should be allowed rguenth at gcc dot gnu dot org
09:51 [Bug c++/36478] [4.3/4.4 regression] warning not emitted when code expanded from macro rguenth at gcc dot gnu dot org
09:27 [Bug middle-end/36166] Use of the 'nonnull' attribute breaks code pgut001 at cs dot auckland dot
09:20 [Bug middle-end/36166] Use of the 'nonnull' attribute breaks code pinskia at gcc dot gnu dot org
09:16 [Bug middle-end/36166] Use of the 'nonnull' attribute breaks code pgut001 at cs dot auckland dot
09:10 [Bug target/36484] g++ generates code with illegal instruction on Pentium D / x86_64 vincent at vinc17 dot org
09:08 [Bug middle-end/36166] Use of the 'nonnull' attribute breaks code pinskia at gcc dot gnu dot org
09:03 [Bug middle-end/36166] Use of the 'nonnull' attribute breaks code pgut001 at cs dot auckland dot
08:54 [Bug target/36484] g++ generates code with illegal instruction on Pentium D / x86_64 pinskia at gcc dot gnu dot org
08:53 [Bug bootstrap/36481] gcc fails to build on Solaris x86 - it forgets the locations of libmpfr pinskia at gcc dot gnu dot org
08:49 [Bug target/36484] New: g++ generates code with illegal instruction on Pentium D / x86_64 vincent at vinc17 dot org
08:27 [Bug target/36482] cris gcc 4.2.3 -Os causes internal compiler error (-O0 works) pinskia at gcc dot gnu dot org
08:26 [Bug c++/36483] Getting an address of a byte-aligned field declared as a bit-field should be allowed pinskia at gcc dot gnu dot org
08:25 [Bug middle-end/36166] Use of the 'nonnull' attribute breaks code pinskia at gcc dot gnu dot org
08:19 [Bug target/36450] ICE in insert_restore/insert_save with GET_MODE_ALIGNMENT mem aldot at gcc dot gnu dot org
08:12 [Bug fortran/36476] ICE: len=* CHARACTER array with separate PARAMETER statement walter dot zimmer at dlr dot d
08:01 [Bug c++/36483] New: Getting an address of a byte-aligned field declared as a bit-field should be allowed yuri at tsoft dot com
07:49 [Bug c/36166] Use of the 'nonnull' attribute breaks code pgut001 at cs dot auckland dot
07:32 [Bug c/36482] cris gcc 4.2.3 -Os causes internal compiler error (-O0 works) hinko dot kocevar at cetrtapot
07:31 [Bug c/36482] New: cris gcc 4.2.3 -Os causes internal compiler error (-O0 works) hinko dot kocevar at cetrtapot
06:37 Bug while compiling source code using gtk and openmoko atul raut
05:50 [Bug testsuite/36443] [4.3/4.4 Regression]: HOSTCC doesn't work with installed gcc hjl dot tools at gmail dot com
05:03 [Bug testsuite/36443] [4.3/4.4 Regression]: HOSTCC doesn't work with installed gcc mark at codesourcery dot com
03:22 [Bug c/36470] sizeof UTF-32 is 2 on AVR hutchinsonandy at gcc dot gnu
01:46 [Bug testsuite/36443] [4.3/4.4 Regression]: HOSTCC doesn't work with installed gcc hjl dot tools at gmail dot com
00:39 [Bug testsuite/36443] [4.3/4.4 Regression]: HOSTCC doesn't work with installed gcc mark at codesourcery dot com

June 09, 2008
23:58 [Bug testsuite/36443] [4.3/4.4 Regression]: HOSTCC doesn't work with installed gcc hjl dot tools at gmail dot com
23:28 [Bug c/36481] New: gcc fails to build on Solaris x86 - it forgets the locations of libmpfr david dot kirkby at onetel dot
22:50 [Bug testsuite/36285] gcc.dg/compat/struct-by-value-xxx improper test for AVR target hutchinsonandy at gcc dot gnu
22:40 [Bug middle-end/36447] [4.4 Regression] simplify_subreg ICE with right shift more than length type AVR hutchinsonandy at gcc dot gnu
22:38 [Bug target/36480] New: stack-protector causes bad ARM PIC code generated dougkwan at google dot com
21:17 [Bug testsuite/36443] [4.3/4.4 Regression]: HOSTCC doesn't work with installed gcc mark at codesourcery dot com
21:12 [Bug preprocessor/36479] Short buffer in libcpp hjl dot tools at gmail dot com
20:21 [Bug preprocessor/36479] Short buffer in libcpp hjl dot tools at gmail dot com
20:10 [Bug preprocessor/36479] Short buffer in libcpp dfranke at gcc dot gnu dot org
20:03 [Bug preprocessor/36479] Short buffer in libcpp hjl dot tools at gmail dot com
20:01 [Bug preprocessor/36479] Short buffer in libcpp hjl dot tools at gmail dot com
20:01 [Bug fortran/36379] preprocessing preprocessed output: invalid reads hjl dot tools at gmail dot com
18:42 [Bug bootstrap/33781] [4.3/4.4 Regression] "Arg list too long" building libgcc.a Ralf dot Wildenhues at gmx dot
17:23 [Bug target/36450] [IRA] ICE in insert_restore with GET_MODE_ALIGNMENT mem vmakarov at redhat dot com
17:12 [Bug preprocessor/36479] Short buffer in libcpp hjl dot tools at gmail dot com
17:08 [Bug target/36450] [IRA] ICE in insert_restore with GET_MODE_ALIGNMENT mem aldot at gcc dot gnu dot org
17:03 [Bug preprocessor/36479] New: Short buffer in libcpp hjl dot tools at gmail dot com
16:41 [Bug fortran/36476] ICE: len=* CHARACTER array with separate PARAMETER statement burnus at gcc dot gnu dot org
16:34 [Bug c++/36478] New: [4.3/4.4 regression] warning not emitted when code expanded from macro tromey at gcc dot gnu dot org
16:24 [Bug bootstrap/33100] [4.3/4.4 regression] on bootstrap getting section .eh_frame: bad cie version 0: offset 0x0 bugzilla-gcc at thewrittenword
16:10 [Bug c/36468] [LTO] ICE in force_decl_die, at dwarf2out.c:13976 aldot at gcc dot gnu dot org
14:16 [Bug testsuite/36443] [4.3/4.4 Regression]: HOSTCC doesn't work with unstalled gcc hjl dot tools at gmail dot com
14:07 [Bug c++/33255] A warning for "unused" typedefs? gdr at cs dot tamu dot edu
14:05 [Bug fortran/36476] New: Fortran CHARACTER array triggers ICE walter dot zimmer at dlr dot d
13:49 [Bug libgomp/36475] New: [gomp] register keyword in openmp handled for-loop fails Klaas dot Vantournhout at UGen
13:37 [Bug c++/33255] A warning for "unused" typedefs? paolo dot carlini at oracle do
13:33 [Bug rtl-optimization/36365] [4.3/4.4 Regression] Hang in df_analyze jakub at gcc dot gnu dot org
13:26 [Bug c/36470] sizeof UTF-32 is 2 on AVR kris dot van dot hees at oracl
13:21 [Bug tree-optimization/36474] [4.3 Regression] GCC takes forever to compile a certain file rguenth at gcc dot gnu dot org
13:02 [Bug c++/36474] GCC takes forever to compile a certain file rguenth at gcc dot gnu dot org
13:02 [Bug c++/36474] GCC takes forever to compile a certain file rguenth at gcc dot gnu dot org
12:58 [Bug c++/36474] GCC takes forever to compile a certain file rguenth at gcc dot gnu dot org
12:23 [Bug c++/36474] gcc takes forever to compile a certain file rguenth at gcc dot gnu dot org
12:04 [Bug c/36455] gcc 3.4.6 evaluates wrong size for dynamic size arrays (hence binaries compiled with it can yield wrong results or even segfault) rguenth at gcc dot gnu dot org
11:41 [Bug target/36473] Generate bit test (bt) instructions ubizjak at gmail dot com
11:40 [Bug target/36473] Generate bit test (bt) instructions ubizjak at gmail dot com
11:03 [Bug bootstrap/32272] make exit because build/genmodes.exe doesn't exist Ralf dot Wildenhues at gmx dot
10:15 [Bug c++/36474] gcc takes forever to compile a certain file fm3 at os dot inf dot tu-dresd
10:11 [Bug c++/36474] New: gcc takes forever to compile a certain file fm3 at os dot inf dot tu-dresd
09:54 [Bug target/36473] New: Generate bit test (bt) instructions ubizjak at gmail dot com
09:09 [Bug fortran/36463] [4.4 Regression] ICE in expand_expr_real_1, at expr.c:7264 with rev.136554 dominiq at lps dot ens dot fr
09:08 [Bug fortran/36463] [4.4 Regression] ICE in expand_expr_real_1, at expr.c:7264 with rev.136554 dominiq at lps dot ens dot fr
09:01 [Bug bootstrap/36472] Small config.gcc buglet to check for enable_cld Keller at hlrs dot de
08:58 [Bug bootstrap/36472] New: Small config.gcc buglet to check for enable_cld Keller at hlrs dot de
08:34 [Bug bootstrap/33781] [4.3/4.4 Regression] "Arg list too long" building libgcc.a Ralf dot Wildenhues at gmx dot
06:59 [Bug testsuite/36443] [4.3/4.4 Regression]: HOSTCC doesn't work with unstalled gcc jakub at gcc dot gnu dot org
04:15 [Bug libgomp/36471] New: omp_get_ancestor_thread_num_8 has no implicit type. linuxl4 at sohu dot com
03:31 [Bug c/36470] New: sizeof UTF-32 is 2 on AVR hutchinsonandy at gcc dot gnu
02:29 [Bug testsuite/36443] [4.3/4.4 Regression]: HOSTCC doesn't work with unstalled gcc hjl dot tools at gmail dot com
00:06 [Bug testsuite/36443] [4.3/4.4 Regression]: HOSTCC doesn't work with unstalled gcc mark at codesourcery dot com

June 08, 2008
22:55 [Bug testsuite/36443] [4.3/4.4 Regression]: HOSTCC doesn't work with unstalled gcc hjl dot tools at gmail dot com
21:28 [Bug c++/35242] [4.3 regression] ICE with invalid specialization of variadic template paolo dot carlini at oracle do
21:27 [Bug c++/35242] [4.3/4.4 regression] ICE with invalid specialization of variadic template paolo at gcc dot gnu dot org
21:13 [Bug testsuite/36443] [4.3/4.4 Regression]: HOSTCC doesn't work with unstalled gcc mark at codesourcery dot com
20:46 [Bug testsuite/36443] [4.3/4.4 Regression]: HOSTCC doesn't work with unstalled gcc hjl dot tools at gmail dot com
20:24 [Bug testsuite/36443] [4.3/4.4 Regression]: HOSTCC doesn't work with unstalled gcc mark at codesourcery dot com
20:02 [Bug target/30047] Corrupt return value in specific context gcc at david dot osborn dot na
20:01 [Bug c/36468] [LTO] ICE in force_decl_die, at dwarf2out.c:13976 aldot at gcc dot gnu dot org
19:56 [Bug target/30047] Corrupt return value in specific context gcc at david dot osborn dot na
19:26 [Bug libgomp/36469] bootstrap broken on HPUX PA andreast at gcc dot gnu dot or
19:24 [Bug libgomp/36469] New: bootstrap broken on HPUX PA andreast at gcc dot gnu dot or
18:51 [Bug c/36468] New: [LTO] ICE in force_decl_die, at dwarf2out.c:13976 aldot at gcc dot gnu dot org
18:21 [Bug target/36467] [avr] Missed optimization with pointer arithmetic and mul* hutchinsonandy at gcc dot gnu
18:09 [Bug target/36467] [avr] Missed optimization with pointer arithmetic and mul* eric dot weddington at atmel d
17:59 [Bug target/36467] [avr] Missed optimization with pointer arithmetic and mul* eric dot weddington at atmel d
17:58 [Bug target/36467] [avr] Missed optimization with pointer arithmetic and mul* eric dot weddington at atmel d
17:57 [Bug target/36467] New: [avr] Missed optimization with pointer arithmetic and mul* eric dot weddington at atmel d
17:33 [Bug target/36424] avr-gcc use don't saved registers in ISR with -O3 ('-frename-registers' ) optimization eric dot weddington at atmel d
17:33 [Bug c/35701] Quieten -Wconversion warnings manu at gcc dot gnu dot org
17:31 [Bug c/34389] -Wconversion produces wrong warning manu at gcc dot gnu dot org
17:25 [Bug c/35701] Quieten -Wconversion warnings manu at gcc dot gnu dot org
17:20 [Bug c++/36461] [c++0x] Exception throws don't use rvalue reference constructors s_gccbugzilla at nedprod dot c
17:19 [Bug c++/36461] [c++0x] Exception throws don't use rvalue reference constructors s_gccbugzilla at nedprod dot c
17:08 [Bug c++/36461] [c++0x] Exception throws don't use rvalue reference constructors s_gccbugzilla at nedprod dot c
16:51 [Bug c/35635] -Wconversion problematic with bitfields manu at gcc dot gnu dot org
16:45 [Bug c/35635] -Wconversion problematic with bitfields manu at gcc dot gnu dot org
16:38 [Bug tree-optimization/36218] [4.2/4.3/4.4 regression] VRP causes stack overflow while building libgcj jsm28 at gcc dot gnu dot org
16:15 [Bug tree-optimization/36218] [4.2/4.3/4.4 regression] VRP causes stack overflow while building libgcj jsm28 at gcc dot gnu dot org
16:09 [Bug target/36424] avr-gcc use don't saved registers in ISR with -O3 ('-frename-registers' ) optimization aesok at gcc dot gnu dot org
15:45 [Bug libstdc++/28811] --with-pic vs static libraries and libstdc++ hjl dot tools at gmail dot com
15:37 [Bug c++/35602] Bogus warning with -Wsign-conversion manu at gcc dot gnu dot org
15:37 [Bug c++/35602] Bogus warning with -Wsign-conversion manu at gcc dot gnu dot org
14:32 [Bug target/36466] internal compiler error: in choose_reload_regs, at reload1.c:6190 aurelien at aurel32 dot net
14:31 [Bug target/36466] New: internal compiler error: in choose_reload_regs, at reload1.c:6190 aurelien at aurel32 dot net
14:13 [Bug middle-end/36465] Compilation crashes and asks me to submit a bug report pinskia at gcc dot gnu dot org
14:13 [Bug tree-optimization/29212] ICE with -fipa-pta pinskia at gcc dot gnu dot org
14:11 [Bug middle-end/36465] Compilation crashes and asks me to submit a bug report pattakosn at yahoo dot com
14:07 [Bug middle-end/36465] Compilation crashes and asks me to submit a bug report pattakosn at yahoo dot com
13:50 [Bug middle-end/36465] Compilation crashes and asks me to submit a bug report pattakosn at yahoo dot com
13:11 [Bug middle-end/36465] Compilation crashes and asks me to submit a bug report pinskia at gcc dot gnu dot org
12:17 [Bug fortran/36459] Wrong interface use for PROCEDURE janus at gcc dot gnu dot org
12:05 [Bug fortran/36465] Compilation crashes and asks me to submit a bug report pattakosn at yahoo dot com
12:02 [Bug fortran/36463] [4.4 Regression] ICE in expand_expr_real_1, at expr.c:7264 with rev.136554 dominiq at lps dot ens dot fr
11:57 [Bug fortran/36459] Wrong interface use for PROCEDURE(<abstr.interface_name) janus at gcc dot gnu dot org
11:53 [Bug fortran/36465] New: Compilation crashes and asks me to submit a bug report pattakosn at yahoo dot com
11:30 [Bug c++/36464] Segfault when using precompiled headers mycae at yahoo dot com
11:28 [Bug c++/36464] New: Segfault when using precompiled headers mycae at yahoo dot com
11:21 [Bug fortran/36462] KIND argument in INDEX results in wrong code burnus at gcc dot gnu dot org
09:55 [Bug fortran/36463] New: [4.4 Regression] ICE in expand_expr_real_1, at expr.c:7264 with rev.136554 dominiq at lps dot ens dot fr
07:50 [Bug fortran/35830] ICE with PROCEDURE(<interface>) containing array formal arguments burnus at gcc dot gnu dot org
07:50 [Bug fortran/35830] ICE with PROCEDURE(<interface>) containing array formal arguments burnus at gcc dot gnu dot org
05:55 [Bug rtl-optimization/36111] [4.3/4.4 Regression] GCC 4.4.0-20080501 failed to compile openmpi's malloc.c file. ubizjak at gmail dot com
05:54 [Bug rtl-optimization/36111] [4.3/4.4 Regression] GCC 4.4.0-20080501 failed to compile openmpi's malloc.c file. ubizjak at gmail dot com
01:41 [Bug c++/27941] offsetof produces possibly erroneous warnings tristan_schmelcher at alumni d
01:23 [Bug fortran/36462] KIND argument in INDEX results in wrong code fxcoudert at gcc dot gnu dot o
01:22 [Bug fortran/36462] New: KIND argument in INDEX results in wrong code fxcoudert at gcc dot gnu dot o
00:34 [Bug c/36359] [Regression] compile error in linux-kernel 2.6.26-rc4 with -O2 pinskia at gmail dot com
00:33 Re: [Bug c/36359] [Regression] compile error in linux-kernel 2.6.26-rc4 with -O2 Andrew Pinski
00:32 [Bug fortran/36422] Misleading error message for (a0) edit descriptor jvdelisle at gcc dot gnu dot o
00:31 [Bug fortran/36421] Gw.d edit descriptor for integer numbers: Wrong output jvdelisle at gcc dot gnu dot o
00:30 [Bug fortran/36420] Fortran 2008: g0 edit descriptor jvdelisle at gcc dot gnu dot o
00:18 [Bug c/36359] [Regression] compile error in linux-kernel 2.6.26-rc4 with -O2 mt-ml at gmx dot de
00:10 [Bug fortran/36422] Misleading error message for (a0) edit descriptor jvdelisle at gcc dot gnu dot o
00:10 [Bug fortran/36420] Fortran 2008: g0 edit descriptor jvdelisle at gcc dot gnu dot o
00:10 [Bug fortran/36421] Gw.d edit descriptor for integer numbers: Wrong output jvdelisle at gcc dot gnu dot o
00:01 [Bug fortran/36422] Misleading error message for (a0) edit descriptor jvdelisle at gcc dot gnu dot o
00:01 [Bug fortran/36420] Fortran 2008: g0 edit descriptor jvdelisle at gcc dot gnu dot o
00:01 [Bug fortran/36421] Gw.d edit descriptor for integer numbers: Wrong output jvdelisle at gcc dot gnu dot o

June 07, 2008
23:57 [Bug fortran/36420] Fortran 2008: g0 edit descriptor jvdelisle at gcc dot gnu dot o
22:59 [Bug tree-optimization/34976] verify_ssa ICE with -ftree-loop-linear spop at gcc dot gnu dot org
22:59 [Bug tree-optimization/34976] verify_ssa ICE with -ftree-loop-linear spop at gcc dot gnu dot org
21:16 [Bug fortran/36459] Wrong interface use for PROCEDURE(<abstr.interface_name) burnus at gcc dot gnu dot org
21:14 [Bug rtl-optimization/36111] [4.4 Regression] GCC 4.4.0-20080501 failed to compile openmpi's malloc.c file. uros at gcc dot gnu dot org
21:02 [Bug fortran/36459] Wrong interface use for PROCEDURE(<abstr.interface_name) janus at gcc dot gnu dot org
20:22 [Bug c++/36460] No space between >'s not always handled in C++0x pinskia at gcc dot gnu dot org
20:19 [Bug c++/36461] New: [C++-0X] Exception throws don't use rvalue reference constructors s_gccbugzilla at nedprod dot c
20:19 [Bug libfortran/35863] [F2003] Implement ENCODING="UTF-8" jvdelisle at gcc dot gnu dot o
20:17 [Bug c++/36460] New: No space between >'s not always handled in C++0x peterbindels at gmail dot com
20:15 [Bug fortran/36459] Wrong interface use for PROCEDURE(<abstr.interface_name) janus at gcc dot gnu dot org
19:25 [Bug testsuite/36458] [4.4 Regression] Invalid fortran-torture -msse2 tests on Athlon XP tkoenig at gcc dot gnu dot org
18:58 [Bug fortran/36437] Simplify argument to [c_]sizeof burnus at gcc dot gnu dot org
18:54 [Bug fortran/36437] F2008: Support c_sizeof // Simplify argument to [c_]sizeof burnus at gcc dot gnu dot org
18:44 [Bug testsuite/36458] [4.4 Regression] Invalid fortran-torture -msse2 tests on Athlon XP ubizjak at gmail dot com
18:25 [Bug fortran/36459] New: Wrong interface use for PROCEDURE(<abstr.interface_name) burnus at gcc dot gnu dot org
17:44 [Bug fortran/35830] ICE with PROCEDURE(<interface>) containing array formal arguments burnus at gcc dot gnu dot org
17:31 [Bug fortran/35830] ICE with PROCEDURE(<interface>) containing array formal arguments burnus at gcc dot gnu dot org
17:30 [Bug testsuite/36458] New: [4.4 Regression] Invalid fortran-torture -msse2 tests on Athlon XP tkoenig at gcc dot gnu dot org
17:04 [Bug fortran/35830] ICE with PROCEDURE(<interface>) containing array formal arguments burnus at gcc dot gnu dot org
16:51 [Bug fortran/36379] preprocessing preprocessed output: invalid reads dfranke at gcc dot gnu dot org
16:48 [Bug fortran/36426] Endless loop in gfc_apply_interface_mapping_to_expr burnus at gcc dot gnu dot org
16:17 [Bug fortran/36371] [4.3/4.4 Regression] Wrong locus for errors in DATA statement pault at gcc dot gnu dot org
16:06 [Bug fortran/36379] preprocessing preprocessed output: invalid reads dfranke at gcc dot gnu dot org
15:49 [Bug target/30243] [4.1/4.2/4.3/4.4 Regression][avr] signbit() causes an internal compiler error hutchinsonandy at gcc dot gnu
15:49 [Bug target/34932] [avr] ICE in reload hutchinsonandy at gcc dot gnu
15:49 [Bug target/27386] AVR: wrong code generated when passing three uint64_t arguments to function hutchinsonandy at gcc dot gnu
15:45 [Bug fortran/36457] New: preprocessing: option -idirafter undefined for fortran dfranke at gcc dot gnu dot org
14:40 [Bug tree-optimization/36439] [4.3/4.4 Regression] infinite loop in PRE building gimp-plugin-registry dirtyepic at gentoo dot org
13:36 [Bug libstdc++/36456] can't build gcc 4.3.1 paolo dot carlini at oracle do
13:35 [Bug libstdc++/36456] can't build gcc 4.3.1 paolo dot carlini at oracle do
13:35 [Bug libstdc++/30915] [4.3 regression] bootstrap fails while building libstdc++-v3 on x86_64-pc-linux-gnu paolo dot carlini at oracle do
13:33 [Bug libstdc++/36456] can't build gcc 4.3.1 wbrana at gmail dot com
12:57 [Bug fortran/36379] preprocessing preprocessed output: invalid reads dfranke at gcc dot gnu dot org
12:02 [Bug libstdc++/36456] can't build gcc 4.3.1 paolo dot carlini at oracle do
11:59 [Bug c++/35242] [4.3/4.4 regression] ICE with invalid specialization of variadic template paolo dot carlini at oracle do
11:17 [Bug libstdc++/36456] New: can't build gcc 4.3.1 wbrana at gmail dot com
09:06 [Bug fortran/36366] [4.3/4.4 Regression] ICE in gfc_conv_component_ref pault at gcc dot gnu dot org
08:31 [Bug fortran/36376] -cpp -save-temps passes unknown options to f951 dfranke at gcc dot gnu dot org
08:09 [Bug c++/35327] [4.3 regression] ICE with invalid constructor paolo dot carlini at oracle do
08:08 [Bug c++/35327] [4.3/4.4 regression] ICE with invalid constructor paolo at gcc dot gnu dot org
06:19 [Bug fortran/36454] too cautionous alias checking with renamed variables/types from modules (Error: ACCESS specification already specified) burnus at gcc dot gnu dot org
04:05 [Bug bootstrap/36330] i386-pc-solaris2.10 configure: error: C compiler cannot create executables cnstar9988 at gmail dot com
04:03 [Bug target/30652] SSE expansion is missing for isinf() and other fpclassify functions ghazi at gcc dot gnu dot org
01:56 [Bug c/36455] gcc 3.4.6 evaluates wrong size for dynamic size arrays (hence binaries compiled with it can yield wrong results or even segfault) pinskia at gcc dot gnu dot org
01:44 [Bug c/36455] New: gcc 3.4.6 evaluates wrong size for dynamic size arrays (hence binaries compiled with it can yield wrong results or even segfault) sandr8+gcc at gmail dot com
01:07 [Bug testsuite/36443] [4.3/4.4 Regression]: HOSTCC doesn't work with unstalled gcc hjl dot tools at gmail dot com
00:46 [Bug target/35921] Con/de-structor definition fails to override dllimport declaration dannysmith at users dot source
00:41 [Bug target/35921] Con/de-structor definition fails to override dllimport declaration dannysmith at gcc dot gnu dot

June 06, 2008
23:00 [Bug testsuite/36443] [4.3/4.4 Regression]: HOSTCC doesn't work with unstalled gcc mmitchel at gcc dot gnu dot or
21:46 [Bug fortran/36454] too cautionous alias checking with renamed variables/types from modules (Error: ACCESS specification already specified) thomas dot orgis at awi dot de
21:43 [Bug fortran/36454] New: too cautionous alias checking with renamed variables/types from modules (Error: ACCESS specification already specified) thomas dot orgis at awi dot de
21:36 Fontos Hubert Károly
21:33 [Bug middle-end/36149] -O2 optimization generates wrong code rguenth at gcc dot gnu dot org
21:13 [Bug middle-end/36149] -O2 optimization generates wrong code dino at concisoft dot com
21:10 [Bug testsuite/36443] [4.3/4.4 Regression]: HOSTCC doesn't work with unstalled gcc hjl dot tools at gmail dot com
21:08 [Bug bootstrap/36452] [4.4 Regression] Broken bootstrap while building libgomp. andreast at gcc dot gnu dot or
21:07 [Bug bootstrap/36452] [4.4 Regression] Broken bootstrap while building libgomp. andreast at gcc dot gnu dot or
21:03 [Bug testsuite/36443] [4.3/4.4 Regression]: HOSTCC doesn't work with unstalled gcc hjl dot tools at gmail dot com
20:40 [Bug target/20243] static initialization .data redundantly copied to ram prior to use. eric dot weddington at atmel d
20:32 [Bug bootstrap/36452] [4.4 Regression] Broken bootstrap while building libgomp. andreast at gcc dot gnu dot or
20:31 [Bug c++/36410] [4.1/4.2/4.3/4.4 regression] ICE with transparent union rguenth at gcc dot gnu dot org
20:30 [Bug c++/36408] [4.3/4.4 regression] ICE with statement expression in template rguenth at gcc dot gnu dot org
20:30 [Bug c++/36406] [4.1/4.2/4.3/4.4 regression] ICE with template delete operator rguenth at gcc dot gnu dot org
20:29 [Bug c++/36405] [4.3/4.4 regression] ICE with typeid of member function rguenth at gcc dot gnu dot org
20:29 [Bug c++/36404] [4.2/4.3 regression] ICE with invalid enum rguenth at gcc dot gnu dot org
20:27 [Bug tree-optimization/36291] [4.3/4.4 Regression] GCC is slow and memory-hungry building sipQtGuipart.cpp rguenth at gcc dot gnu dot org
20:24 [Bug preprocessor/36453] PR36320 breaks boost tromey at gcc dot gnu dot org
20:22 [Bug tree-optimization/33237] [4.3/4.4 Regression] Tree memory partitioning is spending 430 seconds of a 490 second compile. rguenth at gcc dot gnu dot org
20:19 [Bug target/36336] ICE push_reload - psuedo reg_equiv_constant hutchinsonandy at aim dot com
20:13 [Bug tree-optimization/36291] GCC is slow and memory-hungry building sipQtGuipart.cpp rguenth at gcc dot gnu dot org
20:08 [Bug tree-optimization/34244] [4.3 Regression] VRP/SCEV miscompiles Firefox rguenth at gcc dot gnu dot org
20:08 [Bug middle-end/36262] [4.3 Regression] Extreme memory usage of VRP compared to older versions rguenth at gcc dot gnu dot org
20:07 [Bug middle-end/36262] [4.3 Regression] Extreme memory usage of VRP compared to older versions rguenth at gcc dot gnu dot org
20:04 [Bug preprocessor/36453] PR36320 breaks boost rguenth at gcc dot gnu dot org
19:49 [Bug target/36336] ICE push_reload - psuedo reg_equiv_constant eric dot weddington at atmel d
19:43 [Bug target/36336] ICE push_reload - psuedo reg_equiv_constant hutchinsonandy at aim dot com
19:42 [Bug target/36362] [4.1/4.2/4.3/4.4 Regression] ICE in simplify_subreg jakub at gcc dot gnu dot org
19:31 [Bug rtl-optimization/36419] [4.1/4.3/4.4 Regression] Wrong unwind info with -Os -fasynchronous-unwind-tables jakub at gcc dot gnu dot org
19:28 [Bug target/36362] [4.1/4.2/4.3/4.4 Regression] ICE in simplify_subreg jakub at gcc dot gnu dot org
19:25 [Bug target/36336] ICE push_reload - psuedo reg_equiv_constant eric dot weddington at atmel d
18:18 [Bug testsuite/36440] [4.4 Regression] FAIL: g++.dg/cdce3.C on powerpc-apple-darwin8.5.0 dominiq at lps dot ens dot fr
18:01 [Bug testsuite/36440] [4.4 Regression] FAIL: g++.dg/cdce3.C on powerpc-apple-darwin8.5.0 davidxl at google dot com
17:54 [Bug preprocessor/36453] New: PR36320 breaks boost mueller at gcc dot gnu dot org
16:08 [Bug rtl-optimization/11820] Unoptimized complementary conditional instructions derek dot white at sun dot com
15:24 [Bug bootstrap/36452] New: [4.4 Regression] Broken bootstrap while building libgomp. dominiq at lps dot ens dot fr
15:16 [Bug libstdc++/36451] New: Broken links in libstdc++ online documentation mjb at cs dot bath dot ac dot
15:09 [Bug rtl-optimization/36438] gcc ICE compiling code with mmx builtin ubizjak at gmail dot com
15:07 [Bug rtl-optimization/36438] gcc ICE compiling code with mmx builtin uros at gcc dot gnu dot org
15:05 [Bug tree-optimization/36439] [4.3/4.4 Regression] infinite loop in PRE building gimp-plugin-registry rguenth at gcc dot gnu dot org
15:05 [Bug rtl-optimization/36419] [4.1/4.3/4.4 Regression] Wrong unwind info with -Os -fasynchronous-unwind-tables rguenth at gcc dot gnu dot org
15:05 [Bug c++/36407] [4.3/4.4 regression] ICE with invalid conversion rguenth at gcc dot gnu dot org
15:05 [Bug c++/36405] [4.3/4.4 regression] ICE with typeid of member function rguenth at gcc dot gnu dot org
15:05 [Bug c++/36408] [4.3/4.4 regression] ICE with statement expression in template rguenth at gcc dot gnu dot org
15:05 [Bug middle-end/36369] [4.3/4.4 Regression] may_alias broken with previous uses of non attributed type in some cases rguenth at gcc dot gnu dot org
15:05 [Bug rtl-optimization/36365] [4.3/4.4 Regression] Hang in df_analyze rguenth at gcc dot gnu dot org
15:04 [Bug c++/36364] [4.1/4.2/4.3/4.4 Regression] Problem with -frepo rguenth at gcc dot gnu dot org
15:04 [Bug target/36362] [4.1/4.2/4.3/4.4 Regression] ICE in simplify_subreg rguenth at gcc dot gnu dot org
15:04 [Bug testsuite/36344] [4.3/4.4 Regression] gcc.dg/tree-ssa/loadpre8.c XFAILed rguenth at gcc dot gnu dot org
15:04 [Bug tree-optimization/36343] [4.3 Regression] Wrong code due to bad TBAA pruning of points-to-sets and use in call clobbering rguenth at gcc dot gnu dot org
15:04 [Bug rtl-optimization/36350] [4.3/4.4 Regression] GCC ICE with -frename-registers rguenth at gcc dot gnu dot org
15:04 [Bug fortran/36276] [4.3/4.4 Regression] possible issue with opening fortran files? rguenth at gcc dot gnu dot org
15:04 [Bug middle-end/36262] [4.3 Regression] Extreme memory usage of VRP compared to older versions rguenth at gcc dot gnu dot org
15:04 [Bug middle-end/36227] [4.3/4.4 Regression] POINTER_PLUS folding introduces undefined overflow rguenth at gcc dot gnu dot org
15:04 [Bug tree-optimization/36218] [4.2/4.3/4.4 regression] VRP causes stack overflow while building libgcj rguenth at gcc dot gnu dot org
15:04 [Bug middle-end/35854] [4.3/4.4 Regression] life passes dump option still documented rguenth at gcc dot gnu dot org
15:04 [Bug c++/35813] [4.3 regression] ICE with partial specialization of variadic templates rguenth at gcc dot gnu dot org
15:03 [Bug c++/35758] vector_size attribute lost in function arguments for templates rguenth at gcc dot gnu dot org
15:03 [Bug c/35746] [4.3/4.4 regression] ICE with undefined variables rguenth at gcc dot gnu dot org
15:03 [Bug target/35659] [4.3/4.4 Regression] Miscompiled code with -O2 (but not with -O2 -funroll-loops) on ia64 rguenth at gcc dot gnu dot org
15:03 [Bug fortran/35680] [4.3/4.4 regression] ICE on invalid transfer in variable declaration rguenth at gcc dot gnu dot org
15:03 [Bug tree-optimization/35639] [4.3/4.4 Regression] -fprofile-generate + PRE = big compile-time rguenth at gcc dot gnu dot org
15:03 [Bug bootstrap/35619] [4.3/4.4 Regression] fixed includes not being found if building in src dir rguenth at gcc dot gnu dot org
15:03 [Bug libstdc++/35637] [4.3 Regression] tr1::function fails with const member function pointer rguenth at gcc dot gnu dot org
15:03 [Bug target/35658] [4.3/4.4 regression] Bad interaction on ia64 between -funroll-loops -fno-automatic -O2 and common block variable rguenth at gcc dot gnu dot org
15:03 [Bug tree-optimization/35618] [4.3 regression] ICE in cgraph_estimate_size_after_inlining, at ipa-inline.c:188 rguenth at gcc dot gnu dot org
15:03 [Bug tree-optimization/35428] [4.3 regression] ICE with "-ftrapv" rguenth at gcc dot gnu dot org
15:02 [Bug c/35448] [4.3/4.4 regression] ICE with fixed-point constants rguenth at gcc dot gnu dot org
15:02 [Bug target/35419] [4.3/4.4 Regression] bfin libgcc build error rguenth at gcc dot gnu dot org
15:02 [Bug preprocessor/35322] [4.2/4.3 regression] ICE with incomplete macro rguenth at gcc dot gnu dot org
15:02 [Bug target/35318] [4.3/4.4 regression] ICE with inline asm in reload rguenth at gcc dot gnu dot org
15:02 [Bug c++/35331] [4.3 regression] ICE with invalid specialization of variadic template rguenth at gcc dot gnu dot org
15:02 [Bug c++/35327] [4.3/4.4 regression] ICE with invalid constructor rguenth at gcc dot gnu dot org
15:02 [Bug c++/35319] [4.3/4.4 regression] ICE throwing fixed-point types rguenth at gcc dot gnu dot org
15:02 [Bug rtl-optimization/35281] [4.3 Regression] multiply with 0 generated for 64*32->64 rguenth at gcc dot gnu dot org
15:02 [Bug c++/35243] [4.3 regression] ICE with invalid initializer list in variadic template rguenth at gcc dot gnu dot org
15:02 [Bug c++/35242] [4.3/4.4 regression] ICE with invalid specialization of variadic template rguenth at gcc dot gnu dot org
15:02 [Bug c++/35241] [4.3/4.4 regression] ICE with sizeof in variadic template rguenth at gcc dot gnu dot org
15:01 [Bug rtl-optimization/35232] [4.3 Regression] ICE in fp-int-convert-double.c at -O2 rguenth at gcc dot gnu dot org
15:01 [Bug middle-end/35193] [4.3/4.4 Regression] can't find a register in class 'R1_REGS' while reloading 'asm' rguenth at gcc dot gnu dot org
15:01 [Bug inline-asm/35160] local-alloc introduces sharing of the same pseudo/hard reg between different output regs in inline asm rguenth at gcc dot gnu dot org
15:01 [Bug target/35090] [4.3/4.4 regression] libjava testsuite failures on hppa-linux rguenth at gcc dot gnu dot org
15:01 [Bug tree-optimization/35011] [4.3/4.4 regression] ICE with -fcheck-data-deps rguenth at gcc dot gnu dot org
15:01 [Bug c++/35025] [4.3 regression] ICE with invalid specialization of variadic template rguenth at gcc dot gnu dot org
15:01 [Bug c++/35022] [4.3/4.4 regression] ICE with parameter pack in template constant parameter rguenth at gcc dot gnu dot org
15:01 [Bug c++/34892] [4.3/4.4 regression] ICE with ellipsis in default template argument rguenth at gcc dot gnu dot org
15:01 [Bug c++/34756] [4.3/4.4 regression] ICE with broken specialization of variadic template rguenth at gcc dot gnu dot org
15:00 [Bug c++/34963] [4.3/4.4 regression] ICE completely broken destructor rguenth at gcc dot gnu dot org
15:00 [Bug target/34571] [4.3/4.4 Regression] Segfault in alpha_expand_mov at -O3 rguenth at gcc dot gnu dot org
15:00 [Bug middle-end/34226] [4.3/4.4 Regression][frv] ICE in default_secondary_reload, at targhooks.c:612 rguenth at gcc dot gnu dot org
15:00 [Bug c++/34274] [4.3/4.4 regression] Broken diagnostic: 'template_template_parm' not supported by dump_decl rguenth at gcc dot gnu dot org
15:00 [Bug bootstrap/33781] [4.3/4.4 Regression] "Arg list too long" building libgcc.a rguenth at gcc dot gnu dot org
15:00 [Bug tree-optimization/33928] [4.3/4.4 Regression] 22% performance slowdown from 4.2.2 to 4.3/4.4.0 in floating-point code rguenth at gcc dot gnu dot org
15:00 [Bug libgcj/33263] [4.3/4.4 regression] libjava testsuite failures on alpha-linux rguenth at gcc dot gnu dot org
15:00 [Bug target/33604] [4.3/4.4 Regression] Revision 119502 causes significantly slower results with 4.3/4.4 compared to 4.2 rguenth at gcc dot gnu dot org
14:59 [Bug libgcj/32967] [4.3/4.4 regression] gcjavac throws java exceptions on startup rguenth at gcc dot gnu dot org
14:59 [Bug tree-optimization/33237] [4.3/4.4 Regression] Tree memory partitioning is spending 430 seconds of a 490 second compile. rguenth at gcc dot gnu dot org
14:59 [Bug middle-end/32964] [4.3/4.4 Regression] union cause inefficient code inside loops rguenth at gcc dot gnu dot org
14:59 [Bug bootstrap/33100] [4.3/4.4 regression] on bootstrap getting section .eh_frame: bad cie version 0: offset 0x0 rguenth at gcc dot gnu dot org
14:59 [Bug tree-optimization/32921] [4.3/4.4 Regression] Revision 126326 causes 12% slowdown rguenth at gcc dot gnu dot org
14:58 [Bug target/32431] [4.3/4.4 Regression][m68hc11] ICE in df_refs_verify, at df-scan.c:4066 rguenth at gcc dot gnu dot org
14:58 [Bug c/32643] [4.2/4.3/4.4 Regression] Wrong error message with unsigned char a = uchar&512 rguenth at gcc dot gnu dot org
14:58 [Bug target/32424] [4.3/4.4 Regression] gcc.c-torture/compile/20050303-1.c FAILs rguenth at gcc dot gnu dot org
14:58 [Bug libmudflap/32276] [4.3/4.4 Regression]: libmudflap.c++/pass41-frag.cxx rguenth at gcc dot gnu dot org
14:58 [Bug middle-end/32044] [4.3/4.4 regression] udivdi3 counterproductive, unwarranted use rguenth at gcc dot gnu dot org
14:58 [Bug objc++/32052] [4.3/4.4 Regression] encode-2.mm, encode-3.mm fail on at least powerpc-darwin rguenth at gcc dot gnu dot org
14:58 [Bug fortran/31610] ICE with transfer, merge in gfc_conv_expr_descriptor rguenth at gcc dot gnu dot org
14:58 [Bug tree-optimization/31849] [4.3/4.4 Regression] Code size increased with PR 31360 (IV-opts not understanding autoincrement) rguenth at gcc dot gnu dot org
14:58 [Bug target/31897] [4.3/4.4 Regression] 30% speed regression with -m32 on Opteron with rnflow rguenth at gcc dot gnu dot org
14:58 [Bug objc++/31032] [4.3/4.4 Regression] expected tree that contains 'decl with RTL' structure, have 'field_decl' in assemble_external_real, at varasm.c:2225 rguenth at gcc dot gnu dot org
14:58 [Bug tree-optimization/30930] [4.3/4.4 Regression] vector can cause to create an extra variable, DECL_GIMPLE_REG_P not recomputed rguenth at gcc dot gnu dot org
14:58 [Bug target/27855] [4.3/4.4 regression] reassociation causes the RA to be confused rguenth at gcc dot gnu dot org
14:58 [Bug middle-end/20548] ACATS c52103x c52104x c52104y segfault rguenth at gcc dot gnu dot org
14:45 [Bug target/36028] [IRA] ICE in reload_cse_simplify_operands aldot at gcc dot gnu dot org
14:41 [Bug target/36450] [IRA] ICE in insert_restore with GET_MODE_ALIGNMENT mem aldot at gcc dot gnu dot org
14:30 [Bug target/36450] New: ICE in insert_restore with GET_MODE_ALIGNMENT mem aldot at gcc dot gnu dot org
13:49 [Bug tree-optimization/36449] Incorrect code generated for access to a large struct rguenth at gcc dot gnu dot org
13:46 [Bug tree-optimization/36449] Incorrect code generated for access to a large struct rguenth at gcc dot gnu dot org
13:29 [Bug c++/36449] Incorrect code generated for access to a large struct jjk at acm dot org
13:28 [Bug c++/36449] New: Incorrect code generated for access to a large struct jjk at acm dot org
13:27 [Bug libstdc++/28811] --with-pic vs static libraries and libstdc++ hjl dot tools at gmail dot com
13:26 [Bug rtl-optimization/36419] [4.1/4.3/4.4 Regression] Wrong unwind info with -Os -fasynchronous-unwind-tables jakub at gcc dot gnu dot org
13:24 [Bug target/36362] [4.1/4.2/4.3/4.4 Regression] ICE in simplify_subreg jakub at gcc dot gnu dot org
13:16 [Bug ada/35576] Ada HW Interrupt Task Enhancement joel at gcc dot gnu dot org
13:13 [Bug ada/35576] Ada HW Interrupt Task Enhancement joel at gcc dot gnu dot org
13:00 [Bug testsuite/36440] [4.4 Regression] FAIL: g++.dg/cdce3.C on powerpc-apple-darwin8.5.0 dominiq at lps dot ens dot fr
12:15 [Bug libstdc++/28811] --with-pic vs static libraries and libstdc++ jakub at gcc dot gnu dot org
12:02 [Bug libstdc++/28811] --with-pic vs static libraries and libstdc++ paolo dot carlini at oracle do
11:57 [Bug libstdc++/28811] --with-pic vs static libraries and libstdc++ paolo dot carlini at oracle do
11:56 [Bug middle-end/36447] simplify_subreg ICE with right shift more than length type AVR hutchinsonandy at aim dot com
11:15 [Bug c++/35327] [4.3/4.4 regression] ICE with invalid constructor paolo dot carlini at oracle do
10:42 [Bug fortran/36342] [4.4 Regression] Missing file name in compilation diagnostics of preprocessed fortran source dfranke at gcc dot gnu dot org
09:51 [Bug c/30006] Compound literal in structure initializer causes missing initializer warning to happen he at uninett dot no
08:30 [Bug middle-end/36342] [4.4 Regression] Missing file name in compilation diagnostics of preprocessed fortran source P dot Schaffnit at access dot
08:27 [Bug middle-end/36342] [4.4 Regression] Missing file name in compilation diagnostics of preprocessed fortran source dfranke at gcc dot gnu dot org
08:03 [Bug rtl-optimization/36419] [4.1/4.3/4.4 Regression] Wrong unwind info with -Os -fasynchronous-unwind-tables jakub at gcc dot gnu dot org
07:08 [Bug libstdc++/36333] stable_sort calling merge; problems when _GLIBCXX_DEBUG is switched on dominik dot strasser at onespi
05:05 [Bug middle-end/36447] simplify_subreg ICE with right shift more than length type AVR bonzini at gnu dot org
04:31 [Bug fortran/36421] Gw.d edit descriptor for integer numbers: Wrong output jvdelisle at gcc dot gnu dot o
03:09 [Bug middle-end/36447] simplify_subreg ICE with right shift more than length type AVR hutchinsonandy at aim dot com
02:39 [Bug c/36447] New: simplify_subreg ICE with right shift more than length type AVR hutchinsonandy at aim dot com

June 05, 2008
23:34 [Bug ada/35576] Ada HW Interrupt Task Enhancement joel at gcc dot gnu dot org
23:33 [Bug ada/35576] Ada HW Interrupt Task Enhancement joel at gcc dot gnu dot org
23:13 [Bug middle-end/36444] [4.4 Regression] ICE in gen_lowpart_general with -O1 with vector registers pinskia at gcc dot gnu dot org
23:07 [Bug c++/21917] Missing warning when trying to explicitly construct a virtual base r_q_einstein-gccgnuorg at yaho
23:02 [Bug target/35658] [4.3/4.4 regression] Bad interaction on ia64 between -funroll-loops -fno-automatic -O2 and common block variable sje at cup dot hp dot com
22:57 [Bug middle-end/36444] [4.4 Regression] ICE in gen_lowpart_general with -O1 with vector registers pinskia at gcc dot gnu dot org
22:02 [Bug c/36446] unexplained warning in struct initialization pinskia at gcc dot gnu dot org
22:00 [Bug c/36446] unexplained warning in struct initialization pinskia at gcc dot gnu dot org
21:59 [Bug c/36446] New: unexplained warning in struct initialization geoffrey dot levand at am dot
21:58 [Bug testsuite/36443] [4.3/4.4 Regression]: HOST_CC doesn't work with --disable-bootstrap hjl dot tools at gmail dot com
21:42 [Bug testsuite/36443] HOST_CC doesn't work with --disable-bootstrap pinskia at gmail dot com
21:42 Re: [Bug testsuite/36443] HOST_CC doesn't work with --disable-bootstrap Andrew Pinski
21:41 [Bug middle-end/36445] [4.4 Regression] ICE in expand_expr_real_1 with -O1 with vector registers pinskia at gcc dot gnu dot org
21:41 [Bug middle-end/36445] New: [4.4 Regression] ICE in expand_expr_real_1 with -O1 with vector registers pinskia at gcc dot gnu dot org
21:37 [Bug middle-end/36444] [4.4 Regression] ICE in gen_lowpart_general with -O1 with vector registers pinskia at gcc dot gnu dot org
21:35 [Bug testsuite/36443] HOST_CC doesn't work with --disable-bootstrap hjl dot tools at gmail dot com
21:34 [Bug middle-end/36444] New: [4.4 Regression] ICE in gen_lowpart_general with -O1 with vector registers pinskia at gcc dot gnu dot org
21:33 [Bug testsuite/36443] HOST_CC doesn't work with --disable-bootstrap pinskia at gcc dot gnu dot org
21:31 [Bug testsuite/36443] New: HOST_CC doesn't work with --disable-bootstrap hjl dot tools at gmail dot com
20:14 [Bug libgomp/36442] New: libgomp fails when using --with-build-sysroot psmith at gnu dot org
19:46 [Bug fortran/36366] [4.3/4.4 Regression] ICE in gfc_conv_component_ref pault at gcc dot gnu dot org
17:38 [Bug rtl-optimization/36438] gcc ICE compiling code with mmx builtin davidxl at gcc dot gnu dot org
17:06 [Bug rtl-optimization/36438] gcc ICE compiling code with mmx builtin ubizjak at gmail dot com
14:49 [Bug fortran/36441] gfortran looks for .mod files in default locations before -I directories David at ham dot dropbear dot
14:41 [Bug tree-optimization/36291] GCC is slow and memory-hungry building sipQtGuipart.cpp rguenth at gcc dot gnu dot org
14:36 [Bug c++/36391] Compilation never ends ivan at cvut dot cz
14:28 [Bug fortran/36441] New: gfortran looks for .mod files in default locations before -I directories David at ham dot dropbear dot
14:01 [Bug rtl-optimization/36419] [4.1/4.3/4.4 Regression] Wrong unwind info with -Os -fasynchronous-unwind-tables ebotcazou at gcc dot gnu dot o
13:57 [Bug testsuite/36440] New: [4.4 Regression] FAIL: g++.dg/cdce3.C on powerpc-apple-darwin8.5.0 dominiq at lps dot ens dot fr
12:55 [Bug tree-optimization/36439] [4.3/4.4 Regression] infinite loop in PRE building gimp-plugin-registry pinskia at gcc dot gnu dot org
12:51 [Bug rtl-optimization/36438] gcc ICE compiling code with mmx builtin ubizjak at gmail dot com
12:25 [Bug libstdc++/36428] std::tr1 Header Location pinskia at gcc dot gnu dot org
12:08 [Bug target/36133] GCC creates suboptimal ASM : Code includes unneeded TST instructions gunnar at greyhound-data dot c
11:54 [Bug rtl-optimization/36438] gcc ICE compiling code with mmx builtin ubizjak at gmail dot com
11:38 [Bug c++/36439] [4.3/4.4 Regression] infinite loop in PRE building gimp-plugin-registry rguenth at gcc dot gnu dot org
11:38 [Bug c++/36439] [4.3/4.4 Regression] infinite loop in PRE building gimp-plugin-registry rguenth at gcc dot gnu dot org
11:24 [Bug c++/36439] [4.3/4.4 Regression] infinite loop in PRE building gimp-plugin-registry rguenth at gcc dot gnu dot org
11:22 [Bug rtl-optimization/36438] gcc ICE compiling code with mmx builtin ubizjak at gmail dot com
11:00 [Bug c++/36439] New: [4.3 regression] infinite loop building gimp-plugin-registry debian-gcc at lists dot debian
08:32 [Bug other/28322] GCC new warnings and compatibility pmaydell at chiark dot greenen
08:21 [Bug libstdc++/36428] std::tr1 Header Location christopher dot kormanyos at a
06:42 [Bug rtl-optimization/36438] gcc ICE compiling code with mmx builtin davidxl at gcc dot gnu dot org
06:37 [Bug rtl-optimization/36438] New: gcc ICE compiling code with mmx builtin davidxl at gcc dot gnu dot org
06:24 [Bug driver/35916] problem running GCC under Vista with relocated directory dannysmith at users dot source
05:43 [Bug fortran/36421] Gw.d edit descriptor for integer numbers: Wrong output jvdelisle at gcc dot gnu dot o
03:47 [Bug driver/35916] problem running GCC under Vista with relocated directory dannysmith at gcc dot gnu dot
01:20 [Bug fortran/36421] Gw.d edit descriptor for integer numbers: Wrong output jvdelisle at gcc dot gnu dot o

June 04, 2008
23:37 [Bug fortran/36322] ICE with PROCEDURE using a complicated interface janus at gcc dot gnu dot org
22:56 [Bug target/36424] avr-gcc use don't saved registers in ISR with -O3 ('-frename-registers' ) optimization eric dot weddington at atmel d
22:56 [Bug target/36423] avr-gcc use don't saved registers in ISR with -O3 ('-frename-registers' ) optimization eric dot weddington at atmel d
22:47 [Bug fortran/36322] ICE with PROCEDURE using a complicated interface burnus at gcc dot gnu dot org
22:45 [Bug fortran/36322] ICE with PROCEDURE using a complicated interface burnus at gcc dot gnu dot org
22:41 [Bug middle-end/36414] g++ causes segmentation violation on template test program kemal dot ebcioglu at acm dot
22:07 [Bug target/27386] AVR: wrong code generated when passing three uint64_t arguments to function hutchinsonandy at gcc dot gnu
22:06 [Bug target/30243] [4.1/4.2/4.3/4.4 Regression][avr] signbit() causes an internal compiler error hutchinsonandy at gcc dot gnu
22:04 [Bug target/27386] AVR: wrong code generated when passing three uint64_t arguments to function hutchinsonandy at gcc dot gnu
22:01 [Bug target/30243] [4.1/4.2/4.3/4.4 Regression][avr] signbit() causes an internal compiler error hutchinsonandy at gcc dot gnu
21:18 [Bug fortran/36322] ICE with PROCEDURE using a complicated interface janus at gcc dot gnu dot org
21:16 [Bug fortran/36366] [4.3/4.4 Regression] ICE in gfc_conv_component_ref pault at gcc dot gnu dot org
21:11 [Bug fortran/36275] Binding label can be any scalar char initialisation expression janus at gcc dot gnu dot org
21:06 [Bug fortran/36322] ICE with PROCEDURE using a complicated interface janus at gcc dot gnu dot org
21:06 [Bug fortran/36275] Binding label can be any scalar char initialisation expression janus at gcc dot gnu dot org
20:22 [Bug fortran/36437] F2008: Support c_sizeof // Simplify argument to [c_]sizeof burnus at gcc dot gnu dot org
20:20 [Bug fortran/36437] F2008: Support c_sizeof // Simplify argument to [c_]sizeof burnus at gcc dot gnu dot org
20:16 [Bug fortran/36437] New: F2008: Support c_sizeof // Simplify argument to [c_]sizeof burnus at gcc dot gnu dot org
19:37 [Bug tree-optimization/36436] -ftree-vrp -O1 -msse5 -ftree-vectorize leads to segfault during garbage collection gnu at the-meissners dot org
19:35 [Bug tree-optimization/36436] New: -ftree-vrp -O1 -msse5 -ftree-vectorize leads to segfault during garbage collection gnu at the-meissners dot org
19:06 [Bug fortran/36313] [F2003] {MIN,MAX}{LOC,VAL} should accept character arguments tkoenig at gcc dot gnu dot org
19:06 [Bug fortran/29600] MINLOC, MAXLOC and SHAPE take an optional KIND argument tkoenig at gcc dot gnu dot org
17:35 [Bug c++/23383] builtin array operator new is not marked with malloc attribute davidxl at gcc dot gnu dot org
17:04 [Bug c++/23383] builtin array operator new is not marked with malloc attribute rguenth at gcc dot gnu dot org
16:48 [Bug c++/23383] builtin array operator new is not marked with malloc attribute davidxl at gcc dot gnu dot org
16:29 [Bug c++/36435] New: Partial ordering of explicit specialization should include return type jhs at edg dot com
15:44 [Bug target/36433] mregeparm not supported on 68k / Coldfire pinskia at gcc dot gnu dot org
13:07 [Bug target/16563] The compiler doesnt the necessary push/restore of r18/r19 eric dot weddington at atmel d
10:46 [Bug c/36432] incompatible pointer type with pointer to array as a struct member jsm28 at gcc dot gnu dot org
09:55 [Bug c/36433] mregeparm not supported on 68k / Coldfire gunnar at greyhound-data dot c
09:48 [Bug c/36433] New: mregeparm gunnar at greyhound-data dot c
09:30 [Bug target/36133] GCC creates suboptimal ASM : Code includes unneeded TST instructions gunnar at greyhound-data dot c
09:00 [Bug target/35659] [4.3/4.4 Regression] Miscompiled code with -O2 (but not with -O2 -funroll-loops) on ia64 rguenth at gcc dot gnu dot org
08:23 [Bug driver/35916] problem running GCC under Vista with relocated directory dannysmith at users dot source
07:58 [Bug c++/23383] builtin array operator new is not marked with malloc attribute rguenth at gcc dot gnu dot org
07:57 [Bug c++/36429] structure/array member reference/pointer as template argument firda at seznam dot cz
07:51 [Bug c++/36429] structure/array member reference/pointer as template argument firda at seznam dot cz
06:31 [Bug c++/36429] structure/array member reference/pointer as template argument firda at seznam dot cz
05:35 [Bug c++/23383] builtin array operator new is not marked with malloc attribute sabre at nondot dot org
05:24 [Bug c++/23383] builtin array operator new is not marked with malloc attribute xinliangli at gmail dot com
04:48 [Bug c++/23383] builtin array operator new is not marked with malloc attribute sabre at nondot dot org
04:47 [Bug c++/23383] builtin array operator new is not marked with malloc attribute xinliangli at gmail dot com
04:33 [Bug c++/23383] builtin array operator new is not marked with malloc attribute sabre at nondot dot org
04:33 [Bug c++/23383] builtin array operator new is not marked with malloc attribute sabre at nondot dot org
04:16 [Bug c++/23383] builtin array operator new is not marked with malloc attribute xinliangli at gmail dot com
03:22 [Bug c++/23383] builtin array operator new is not marked with malloc attribute sabre at nondot dot org
02:57 [Bug c/36432] New: incompatible pointer type with pointer to array as a struct member anders at kaseorg dot com
01:57 [Bug testsuite/34889] gcc.c-torture/execute/builtins/pr23484-chk.c fails on 16 bit integer platforms hutchinsonandy at gcc dot gnu
00:50 [Bug fortran/36420] Fortran 2008: g0 edit descriptor jvdelisle at gcc dot gnu dot o
00:20 [Bug c++/36431] The C++ front-end produces some NOP_EXPR for vector types pinskia at gcc dot gnu dot org
00:20 [Bug c++/36431] The C++ front-end produces some NOP_EXPR for vector types pinskia at gcc dot gnu dot org
00:19 [Bug c++/36431] New: The C++ front-end produces some NOP_EXPR for vector types pinskia at gcc dot gnu dot org

June 03, 2008
23:52 [Bug testsuite/34880] gcc.c-torture/execute/float-floor.c fails for targets with no 64-bit double type hutchinsonandy at gcc dot gnu
19:58 [Bug ada/36207] [4.4 regression] Ada bootstrap fails in uintp.adb:1595 ebotcazou at gcc dot gnu dot o
19:33 [Bug ada/36207] [4.4 regression] Ada bootstrap fails in uintp.adb:1595 aaronavay62 at aaronwl dot com
19:31 [Bug bootstrap/36216] [meta-bug] Bootstrap problems on mingw32 aaronavay62 at aaronwl dot com
19:17 [Bug libstdc++/11108] <iostream> causes transform() to not compile with tolower() sebor at roguewave dot com
18:39 [Bug c++/36430] New: Cannot convert a temporary to a non-const reference even with conversion operator gbrammer at gmx dot de
18:34 [Bug fortran/36421] Gw.d edit descriptor for integer numbers: Wrong output jvdelisle at gcc dot gnu dot o
18:31 [Bug fortran/36422] Misleading error message for (a0) edit descriptor jvdelisle at gcc dot gnu dot o
18:20 [Bug c++/13682] Compile error with cstdio: fgetpos not declared on AIX patrick133t at yahoo dot com
18:00 [Bug target/35659] [4.3/4.4 Regression] Miscompiled code with -O2 (but not with -O2 -funroll-loops) on ia64 sje at cup dot hp dot com
16:27 [Bug libstdc++/11108] <iostream> causes transform() to not compile with tolower() phil at phord dot com
15:22 [Bug c++/36429] structure/array member reference/pointer as template argument rguenth at gcc dot gnu dot org
14:19 [Bug c++/36429] New: structure/array member reference/pointer as template argument firda at seznam dot cz
12:27 [Bug rtl-optimization/36419] [4.1/4.3/4.4 Regression] Wrong unwind info with -Os -fasynchronous-unwind-tables rguenth at gcc dot gnu dot org
10:58 Dream to be a real hero gcc1
10:04 [Bug libstdc++/25191] exception_defines.h #defines try/catch paolo dot carlini at oracle do
10:01 [Bug libstdc++/25191] exception_defines.h #defines try/catch rguenther at suse dot de
09:53 [Bug libstdc++/25191] exception_defines.h #defines try/catch paolo dot carlini at oracle do
09:18 [Bug libstdc++/36428] std::tr1 Header Location paolo dot carlini at oracle do
09:14 [Bug rtl-optimization/36419] [4.3/4.4 Regression] Wrong unwind info with -Os -fasynchronous-unwind-tables jakub at gcc dot gnu dot org
09:09 [Bug libstdc++/36427] std::ios_base::open_mode is defined but useless paolo dot carlini at oracle do
08:18 [Bug c++/36428] New: std::tr1 Header Location christopher dot kormanyos at a
08:04 [Bug libstdc++/36427] New: std::ios_base::open_mode is defined but useless justinb at math dot berkeley d
05:35 [Bug fortran/36420] Fortran 2008: g0 edit descriptor burnus at gcc dot gnu dot org
05:29 [Bug fortran/36421] Gw.d edit descriptor for integer numbers: Wrong output burnus at gcc dot gnu dot org
04:33 [Bug driver/35916] problem running GCC under Vista with relocated directory pinskia at gcc dot gnu dot org
04:32 [Bug driver/35916] problem running GCC under Vista with relocated directory pinskia at gcc dot gnu dot org
04:30 [Bug driver/35916] problem running GCC under Vista with relocated directory pinskia at gcc dot gnu dot org
04:30 [Bug driver/36417] On Vista, driver can't find collect2 pinskia at gcc dot gnu dot org
04:09 [Bug fortran/36420] Fortran 2008: g0 edit descriptor jvdelisle at gcc dot gnu dot o
03:51 [Bug middle-end/36416] internal compiler error: in simplify_subreg_concatn, at lower-subreg.c:398 permezel at mac dot com
03:18 [Bug driver/36417] On Vista, driver can't find collect2 dannysmith at users dot source
02:16 [Bug fortran/36421] Gw.d edit descriptor for integer numbers: Wrong output jvdelisle at gcc dot gnu dot o
00:38 [Bug target/36399] FSF GCC ABI bug on darwin/x86-32 echristo at apple dot com
00:08 [Bug libstdc++/25191] exception_defines.h #defines try/catch sebor at roguewave dot com

June 02, 2008
23:49 [Bug target/34879] __builtin_setjmp / __builtin_longjmp fails stack frame address with O2, O3 and Os eric dot weddington at atmel d
23:38 [Bug middle-end/36416] internal compiler error: in simplify_subreg_concatn, at lower-subreg.c:398 permezel at mac dot com
23:12 [Bug target/36223] IV-opt is not optimal for mips hp at gcc dot gnu dot org
23:09 [Bug libstdc++/25191] exception_defines.h #defines try/catch sebor at roguewave dot com
22:48 [Bug middle-end/36416] internal compiler error: in simplify_subreg_concatn, at lower-subreg.c:398 pinskia at gcc dot gnu dot org
22:37 [Bug target/36134] GCC creates suboptimal ASM : usage of ADDA.L where LEA could be used schwab at suse dot de
22:28 [Bug libstdc++/25191] exception_defines.h #defines try/catch bkoz at gcc dot gnu dot org
22:09 [Bug target/34879] __builtin_setjmp / __builtin_longjmp fails stack frame address with O2, O3 and Os hutchinsonandy at gcc dot gnu
21:54 [Bug fortran/36361] attribute declaration outside of INTERFACE body janus at gcc dot gnu dot org
21:51 [Bug fortran/36361] attribute declaration outside of INTERFACE body janus at gcc dot gnu dot org
21:47 [Bug target/36425] Option -mno-isel not working edmar at freescale dot com
21:35 [Bug target/36425] Option -mno-isel not working joseph at codesourcery dot com
21:29 [Bug c++/36404] [4.2/4.3 regression] ICE with invalid enum paolo dot carlini at oracle do
21:29 [Bug c++/36404] [4.2/4.3/4.4 regression] ICE with invalid enum paolo at gcc dot gnu dot org
21:20 [Bug target/35788] MIPS stack overflow caused by addui instruction derrick_chi at msn dot com
21:19 [Bug target/36425] Option -mno-isel not working edmar at freescale dot com
21:00 [Bug libstdc++/25191] exception_defines.h #defines try/catch paolo dot carlini at oracle do
20:52 [Bug fortran/36426] New: Compiling tiny prog: Stack overflow; uses PROCEDURE burnus at gcc dot gnu dot org
20:21 [Bug libstdc++/25191] exception_defines.h #defines try/catch bkoz at gcc dot gnu dot org
20:16 [Bug rtl-optimization/36419] [4.3 Regression] Wrong unwind info with -Os -fasynchronous-unwind-tables jakub at gcc dot gnu dot org
19:36 [Bug target/36425] Option -mno-isel not working joseph at codesourcery dot com
19:16 [Bug ada/34898] Excessive memory consumption during compilation oliver dot kellogg at eads dot
19:03 [Bug target/34932] [avr] ICE in reload eric dot weddington at atmel d
18:56 [Bug middle-end/36342] [4.4 Regression] Missing file name in compilation diagnostics of preprocessed fortran source dfranke at gcc dot gnu dot org
18:23 [Bug target/36425] Option -mno-isel not working edmar at freescale dot com
18:21 [Bug tree-optimization/36389] [tuples] gimplify_cond_expr should be smarter jakub at gcc dot gnu dot org
18:20 [Bug target/36425] New: Option -mno-isel not working edmar at freescale dot com
18:06 [Bug target/36424] avr-gcc use don't saved registers in ISR with -O3 ('-frename-registers' ) optimization aesok at gcc dot gnu dot org
17:56 [Bug target/36424] New: avr-gcc use don't saved registers in ISR with -O3 ('-frename-registers' ) optimization aesok at gcc dot gnu dot org
17:54 [Bug target/36423] New: avr-gcc use don't saved registers in ISR with -O3 ('-frename-registers' ) optimization aesok at gcc dot gnu dot org
17:24 [Bug rtl-optimization/36419] [4.3 Regression] Wrong unwind info with -Os -fasynchronous-unwind-tables jakub at gcc dot gnu dot org
17:19 [Bug target/35788] MIPS stack overflow caused by addui instruction rsandifo at gcc dot gnu dot or
17:11 [Bug middle-end/36212] Vector alignment overides Target alignment eric dot weddington at atmel d
17:05 [Bug middle-end/36184] gimple-tuples-branch fails bootstrap on x86 Darwin dnovillo at gcc dot gnu dot or
16:44 [Bug fortran/36377] newline missing at end of preprocessed output dfranke at gcc dot gnu dot org
16:43 [Bug fortran/36375] ICE on -fpreprocessed dfranke at gcc dot gnu dot org
16:42 [Bug fortran/36375] ICE on -fpreprocessed dfranke at gcc dot gnu dot org
16:42 [Bug fortran/36377] newline missing at end of preprocessed output dfranke at gcc dot gnu dot org
16:07 [Bug fortran/35031] ELEMENTAL procedure with BIND(C) burnus at gcc dot gnu dot org
16:02 Re: (.eh_frame); no .eh_frame_hdr table will be created Grigoriy Shcherbyak
15:33 [Bug fortran/32580] iso_c_binding c_f_procpointer / procedure pointers burnus at gcc dot gnu dot org
14:44 [Bug fortran/36421] Gw.d edit descriptor for integer numbers: Wrong output burnus at gcc dot gnu dot org
14:17 [Bug fortran/36422] Misleading error message for (a0) edit descriptor burnus at gcc dot gnu dot org
14:16 [Bug fortran/36422] New: Misleading error message for (a0) edit descriptor burnus at gcc dot gnu dot org
14:13 [Bug fortran/36421] New: Gw.d edit descriptor for integer numbers: Wrong output burnus at gcc dot gnu dot org
14:09 [Bug rtl-optimization/36419] [4.3 Regression] Wrong unwind info with -Os -fasynchronous-unwind-tables jakub at gcc dot gnu dot org
14:08 [Bug fortran/36420] New: Fortran 2008: g0 edit descriptor burnus at gcc dot gnu dot org
13:50 [Bug rtl-optimization/36419] [4.3 Regression] Wrong unwind info with -Os -fasynchronous-unwind-tables jakub at gcc dot gnu dot org
13:49 [Bug rtl-optimization/36419] New: [4.3 Regression] Wrong unwind info with -Os -fasynchronous-unwind-tables jakub at gcc dot gnu dot org
12:06 [Bug libstdc++/25191] exception_defines.h #defines try/catch paolo dot carlini at oracle do
11:49 [Bug libstdc++/25191] exception_defines.h #defines try/catch rguenth at gcc dot gnu dot org
11:40 [Bug c++/36404] [4.2/4.3/4.4 regression] ICE with invalid enum paolo dot carlini at oracle do
11:30 [Bug fortran/36403] [4.4 Regression] Some fortran tests using eoshift fail on SH fxcoudert at gcc dot gnu dot o
08:56 [Bug tree-optimization/36401] [4.4 Regression] 164.gzip miscompares rguenth at gcc dot gnu dot org
08:51 [Bug middle-end/36414] g++ causes segmentation violation on template test program rguenth at gcc dot gnu dot org
08:45 [Bug fortran/35830] ICE with PROCEDURE(<interface>) containing array formal arguments burnus at gcc dot gnu dot org
07:50 [Bug driver/36418] On Vista, driver can't find collect2 fxcoudert at gcc dot gnu dot o
07:50 [Bug driver/36417] On Vista, driver can't find collect2 fxcoudert at gcc dot gnu dot o
07:49 [Bug driver/36418] New: On Vista, driver can't find collect2 fxcoudert at gcc dot gnu dot o
07:46 [Bug driver/36417] New: On Vista, driver can't find collect2 fxcoudert at gcc dot gnu dot o
06:58 [Bug c/36416] New: internal compiler error: in simplify_subreg_concatn, at lower-subreg.c:398 permezel at mac dot com
06:18 (.eh_frame); no .eh_frame_hdr table will be created Dima Rusyy
06:01 GNU profiling - profil() raja . saleru
05:47 [Bug middle-end/36414] g++ causes segmentation violation on template test program steven at gcc dot gnu dot org
05:10 [Bug target/36415] internal compiler error: in extract_insn, at recog.c:1990 aurelien at aurel32 dot net
05:09 [Bug target/36415] New: internal compiler error: in extract_insn, at recog.c:1990 aurelien at aurel32 dot net

June 01, 2008
23:59 [Bug middle-end/35854] [4.3/4.4 Regression] life passes dump option still documented pinskia at gcc dot gnu dot org
22:31 [Bug libmudflap/36397] [4.4 regression] ICE with pointer cast and -fmudflap pinskia at gcc dot gnu dot org
21:55 [Bug middle-end/30789] complex folding inexact steven at gcc dot gnu dot org
21:49 [Bug middle-end/36414] g++ causes segmentation violation on template test program pinskia at gcc dot gnu dot org
21:37 [Bug c++/36414] g++ causes segmentation violation on template test program kemal dot ebcioglu at acm dot
21:31 [Bug c++/36414] New: g++ causes segmentation violation on template test program kemal dot ebcioglu at acm dot
21:18 [Bug c++/36407] [4.3/4.4 regression] ICE with invalid conversion rguenth at gcc dot gnu dot org
21:17 [Bug c++/36407] [4.3/4.4 regression] ICE with invalid conversion rguenth at gcc dot gnu dot org
20:44 [Bug c++/36413] Bug with variadic templates (-std=c++0x) fred at tigen dot org
20:05 [Bug c++/36413] New: Bug with variadic templates (-std=c++0x) fred at tigen dot org
18:57 [Bug ada/34898] Excessive memory consumption during compilation rguenth at gcc dot gnu dot org
18:29 [Bug ada/34898] Excessive memory consumption during compilation oliver dot kellogg at eads dot
18:11 [Bug ada/34898] Excessive memory consumption during compilation oliver dot kellogg at eads dot
15:22 [Bug target/27386] AVR: wrong code generated when passing three uint64_t arguments to function hutchinsonandy at aim dot com
14:00 [Bug c/36402] -0x80000000 (INT_MIN, -2147483648) treated as unsigned gcczilla at achurch dot org
12:28 [Bug gcov-profile/36412] New: gcov -l -p exceeds maximum file name length peter dot klotz at aon dot at
12:28 [Bug c++/36411] [4.4 regression] ICE with invalid template template parameter reichelt at gcc dot gnu dot or
12:22 [Bug c/36402] -0x80000000 (INT_MIN) erroneously treated as unsigned joseph at codesourcery dot com
11:39 [Bug tree-optimization/36401] [4.4 Regression] 164.gzip miscompares rguenth at gcc dot gnu dot org
11:14 [Bug c++/36411] [4.4 regression] ICE with invalid template template parameter reichelt at gcc dot gnu dot or
11:14 [Bug c++/36411] New: [4.4 regression] ICE with invalid template template parameter reichelt at gcc dot gnu dot or
11:05 [Bug c++/36410] [4.1/4.2/4.3/4.4 regression] ICE with transparent union reichelt at gcc dot gnu dot or
11:04 [Bug c++/36410] New: [4.1/4.2/4.3/4.4 regression] ICE with transparent union reichelt at gcc dot gnu dot or
10:47 [Bug rtl-optimization/36409] New: Additional instructions in prologue and epilogue. ramana at icerasemi dot com
10:47 [Bug c++/36408] [4.3/4.4 regression] ICE with statement expression in template reichelt at gcc dot gnu dot or
10:46 [Bug c++/36408] New: [4.3/4.4 regression] ICE with statement expression in template reichelt at gcc dot gnu dot or
10:40 [Bug c++/36407] [4.3/4.4 regression] ICE with invalid conversion reichelt at gcc dot gnu dot or
10:40 [Bug c++/36407] New: [4.3/4.4 regression] ICE with invalid conversion reichelt at gcc dot gnu dot or
10:32 [Bug c++/36406] [4.1/4.2/4.3/4.4 regression] ICE with template delete operator reichelt at gcc dot gnu dot or
10:32 [Bug c++/36406] New: [4.1/4.2/4.3/4.4 regression] ICE with template delete operator reichelt at gcc dot gnu dot or
10:24 [Bug c++/36405] [4.3/4.4 regression] ICE with typeid of member function reichelt at gcc dot gnu dot or
10:24 [Bug c++/36405] New: [4.3/4.4 regression] ICE with typeid of member function reichelt at gcc dot gnu dot or
10:18 [Bug c++/36404] [4.2/4.3/4.4 regression] ICE with invalid enum reichelt at gcc dot gnu dot or
10:17 [Bug c++/36404] New: [4.2/4.3/4.4 regression] ICE with invalid enum reichelt at gcc dot gnu dot or
09:42 [Bug tree-optimization/24028] CCP is broken steven at gcc dot gnu dot org
07:26 [Bug c/36402] -0x80000000 (INT_MIN) erroneously treated as unsigned ebotcazou at gcc dot gnu dot o
04:17 [Bug c/36402] -0x80000000 (INT_MIN) erroneously treated as unsigned gcczilla at achurch dot org
02:41 [Bug target/27386] AVR: wrong code generated when passing three uint64_t arguments to function hutchinsonandy at aim dot com
01:03 [Bug testsuite/36285] gcc.dg/compat/struct-by-value-xxx improper test for AVR target hutchinsonandy at aim dot com


Indexes: [Date Index] [Subject Index] [Author Index] [Thread Index]
Site Nav: [Browse other archives for this mailing list]
[Browse other mailing lists at this site]
Search: Limit to:

Mail converted by MHonArc 2.6.3