gcc-bugs archive
subject index for November, 2005

This is the mail archive of the gcc-bugs@gcc.gnu.org mailing list for the GCC project.

Indexes: [Date Index] [Subject Index] [Author Index] [Thread Index]
Site Nav: [Browse other archives for this mailing list]
[Browse other mailing lists at this site]
Search: Limit to:

32bit Email Broadcaster Sample Subject

[Bug ada/15604] Ambiguous aggregate -- Accepts invalid

[Bug ada/15919] Compiler enters infinite loop on illegal program

[Bug ada/18434] [4.0/4.1 Regression] Ada: cannot build gnattools on Tru64 UNIX V5.1B

[Bug ada/18659] [4.1 Regression] ACATS failures c32001e c64105b c95086b

[Bug ada/18659] [4.1/4.2 Regression] ACATS failures c32001e c64105b c95086b

[Bug ada/18819] [4.1/4.2 Regression] ACATS cdd2a02 fails at runtime

[Bug ada/20548] [4.1 Regression] ACATS c52103x c52104x c52104y segfault at runtime on x86_64

[Bug ada/20753] ACATS ce3810b segfaults at runtime

[Bug ada/21317] ACATS c954025 c954026 c99004a failures

[Bug ada/21317] ACATS c954025 c954026 failures

[Bug ada/21629] [doc] gnat version requirements in install.texi

[Bug ada/21717] [4.1 regression] Endless stream of exceptions ( c95085a, c95085b and c95086a)

[Bug ada/21952] Many attribute directive ignored warnings during Tru64 UNIX Ada bootstrap

[Bug ada/22333] [4.1 Regression] ACATS FAIL c34007p c34007r c45282b spurious discriminant CONSTRAINT_ERROR

[Bug ada/22533] [4.1 regression] Ada ICE during bootstrap on many platforms

[Bug ada/22533] [4.1 regression] ICE in get_base_var

[Bug ada/22533] [4.1/4.2 regression] Ada ICE during bootstrap on many platforms

[Bug ada/22561] [4.1 Regression] ACATS ca11c01 wrong code

[Bug ada/23427] latent bug with array type size check

[Bug ada/23717] [Ada] Wrong ICE diagnostic formatting

[Bug ada/23732] [ada] Library_Version still at 4.0 ?

[Bug ada/23995] [4.0 regression] ICE on misaligned rep clause

[Bug ada/24413] ACATS FAIL 21 tasking tests on ia64-linux with unexpected exceptions

[Bug ada/24468] link failure for several acats tests

[Bug ada/24564] Bug box in Ada compiler: in create_tmp_var, at gimplify.c:368

[Bug ada/24725] New: Gigi abort, Code=508

[Bug ada/24725] Gigi abort, Code=508

[Bug ada/24726] New: Gigi abort, Code=508

[Bug ada/24726] Gigi abort, Code=508

[Bug ada/24822] New: make[2]: *** [ada/einfo.h] Error 1

[Bug ada/24855] New: Missing stdarg.h in ada/raise.c for arm-rtems

[Bug ada/24855] Missing stdarg.h in ada/raise.c for arm-rtems

[Bug ada/24857] New: ada/s-auxdec.ads alignment issue for arm-rtems

[Bug ada/24857] ada/s-auxdec.ads alignment issue for arm-rtems

[Bug ada/24880] New: (Ada) Conversion of user-defined integer type with Size fixed causes crashes

[Bug ada/24880] [4.0/4.1 regression] (Ada) Conversion of user-defined integer type with Size fixed causes crashes

[Bug ada/24896] New: ICE in generate_element_copy

[Bug ada/24896] ICE in generate_element_copy

[Bug ada/24897] New: Ada testsuite failure c954026

[Bug ada/24897] Ada testsuite failure c954026

[Bug ada/24898] New: CONSTRAINT_ERROR : discriminant check failed

[Bug ada/24898] CONSTRAINT_ERROR : discriminant check failed

[Bug ada/24946] [4.1/4.2 Regression] make[7]: rc: Command not found

[Bug ada/24992] New: gcc aborts compiling record whose component definition refers to 'Size of current type

[Bug ada/24992] gcc aborts compiling record whose component definition refers to 'Size of current type

[Bug ada/24994] New: raised STORAGE_ERROR : stack overflow or erroneous memory access

[Bug ada/24994] raised STORAGE_ERROR : stack overflow or erroneous memory access

[Bug ada/25117] New: GNAT Bug Box, GCC error, TYPES.UNRECOVERABLE_ERROR

[Bug ada/25117] GNAT Bug Box, GCC error, TYPES.UNRECOVERABLE_ERROR

[Bug ada/25117] GNAT Bug Box, GCC error, verify_ssa failed

[Bug awt/20630] GTK 2.8 peer Image and Graphics API reorganization

[Bug bootstrap/16787] NAN constant "(0.0/0.0)" cannot be compiled by Tru64 cc

[Bug bootstrap/17269] make install doesn't work after --enable-bootstrap enabled bootstrap

[Bug bootstrap/19289] ice during gcc4-20050102 profiledboostrap.

[Bug bootstrap/22330] Building a cross linux->win32 incorrectly sets HAVE_GAS_SHF_MERGE true

[Bug bootstrap/22408] make install fails after --enable-bootstrap=lean enabled bootstrap

[Bug bootstrap/23101] Make Bootstrap fails on AIX 5.2 ML6

[Bug bootstrap/24631] New: SIGBUS during bootstrap

[Bug bootstrap/24631] SIGBUS during bootstrap

[Bug bootstrap/24688] New: sco_math fixincl breaks math.h

[Bug bootstrap/24688] [3.4 Regression] sco_math fixincl breaks math.h

[Bug bootstrap/24688] sco_math fixincl breaks math.h

[Bug bootstrap/24695] New: [csl-arm-branch] Bootstrap failure with current csl-arm-branch

[Bug bootstrap/24695] [csl-arm-branch] Bootstrap failure with current csl-arm-branch

[Bug bootstrap/24710] gfortran - fails to build on Mac OSX -10.4.3

[Bug bootstrap/24778] New: Assembler errors during bootstrap

[Bug bootstrap/24821] New: [4.1 regression] [alpha-linux] ada bootstrap error in stage3

[Bug bootstrap/24821] [4.1 regression] [alpha-linux] ada bootstrap error in stage3

[Bug bootstrap/24859] New: Unrecognized opcode bootstrapping gcc on AIX 5/POWER

[Bug bootstrap/24859] SEVERE ERROR bootstrapping gcc on AIX 5/POWER

[Bug bootstrap/24859] Unrecognized opcode bootstrapping gcc on AIX 5/POWER

[Bug bootstrap/24873] New: gcc 4.0.2 bootstrap report compare fail

[Bug bootstrap/24873] gcc 4.0.2 bootstrap report compare fail

[Bug bootstrap/24946] New: make[7]: rc: Command not found

[Bug bootstrap/24984] New: Use of old "tail" parameters in Makefile*

[Bug bootstrap/24984] Use of old "tail" parameters in Makefile*

[Bug bootstrap/24998] New: Build failure on sparc-sun-solaris2.9: undefined symbol __floatunsitf

[Bug bootstrap/24998] Build failure on sparc-sun-solaris2.9/arm: undefined symbol __floatunsitf

[Bug bootstrap/24998] Build failure on sparc-sun-solaris2.9: undefined symbol __floatunsitf

[Bug bootstrap/25002] New: build breaks if no `NAN'

[Bug bootstrap/25002] build breaks if no `NAN'

[Bug bootstrap/25009] New: Bootstrap: Failure to build doc/gcc.info

[Bug bootstrap/25009] Bootstrap: Failure to build doc/gcc.info

[Bug bootstrap/25119] New: bootstrap failure on AIX 5.3

[Bug bootstrap/25119] bootstrap failure on AIX 5.3

[Bug bootstrap/25127] New: internal compiler error: in rs6000_emit_prologue, at config/rs6000/rs6000.c:14039

[Bug bootstrap/8765] -msoft-float does not work for mipsel-linux, and probably others

[Bug c++/12272] wrong error message using declaration shadows namespace

[Bug c++/12277] Warn on dynamic casts with known NULL results.

[Bug c++/12333] [DR 272] Explicit call to MyClass::~MyClass() not allowed

[Bug c++/13384] error: non-lvalue in assignment - message a little misleading for C++

[Bug c++/13657] Error message incorrectly describes return type as argument type

[Bug c++/13668] thread local storage: static class member does not work

[Bug c++/13967] A warning could be emitted if a template parameter of a member template is begin shadowed by another member of the class

[Bug c++/14024] g++ isn't reporting aliasing warnings

[Bug c++/14172] g++ should not emit effc++ warnings in system headers

[Bug c++/14329] [tree-ssa] badly formatted warnings for SRA replacements

[Bug c++/14404] static const integral member cannot be passed as const reference

[Bug c++/15938] ICE with anonymous unions

[Bug c++/16021] Tests for container swap specialisations FAIL in debug mode

[Bug c++/16625] Discarded Linkonce sections in .rodata

[Bug c++/17166] Improve diagnostic for empty overload set listing the rejected overloads

[Bug c++/17256] [3.4/4.0 Regression] undefined but used static or inline functions should be diagnosed

[Bug c++/17256] [3.4/4.0/4.1 Regression] undefined but used static or inline functions should be diagnosed

[Bug c++/17964] [4.0/4.1 Regression] cpp error messages contain wrong line in C++

[Bug c++/17972] [3.4 Regression] const/pure functions result in bad asm

[Bug c++/18462] [3.4 Regression] Segfault on declaration of large array member

[Bug c++/18635] use of uninitialised reference accepted in C++ front end

[Bug c++/19092] g++ accepts code that violates 14.6.4.2

[Bug c++/19253] [3.4/4.0/4.1 regression] bad error message / ICE for invalid template parameter

[Bug c++/19450] __thread static class members

[Bug c++/19476] Missed null checking elimination with new

[Bug c++/19756] -Wparentheses doesn't warn on ambiguous if in C++

[Bug c++/19989] [4.0/4.1 regression] Inconsistency with zero-sized arrays

[Bug c++/20021] warning behavior depends on textual format of literal constant

[Bug c++/20164] [3.4 Regression] Wrong line number in diagnostic

[Bug c++/20201] requesting -Wfatal-errors=n

[Bug c++/20207] null constructor not needed in multiple inheritance

[Bug c++/20293] [3.4/4.0 regression] Wrong diagnostic for ambiguous access

[Bug c++/20293] [3.4/4.0/4.1 regression] Wrong diagnostic for ambiguous access

[Bug c++/20308] parser thinks something is a start of a template-id when it is just less than

[Bug c++/20416] Incorrect lifetime for temporary with static const reference

[Bug c++/20423] Warning -Woverloaded-virtual triggers to often

[Bug c++/21123] [4.0 regression] ICE in cp_expr_size, at cp/cp-objcp-common.c:101

[Bug c++/21123] [4.0/4.1 regression] ICE in cp_expr_size, at cp/cp-objcp-common.c:101

[Bug c++/21166] g++ gives error on reference to packed structure elements

[Bug c++/21251] Placement into shared memory

[Bug c++/21308] [3.4/4.0 Regression] Very high compile time

[Bug c++/21308] [3.4/4.0/4.1 Regression] Very high compile time

[Bug c++/21627] [3.4/4.0/4.1 Regression] invalid inline warning with ctor and dtor

[Bug c++/21667] misleading warning about array subscription

[Bug c++/21755] Warning from function template in system header

[Bug c++/21764] visibility attributes on namespace scope

[Bug c++/21917] Missing warning?

[Bug c++/21983] [3.4/4.0 Regression] multiple diagnostics

[Bug c++/22136] [4.1 regression] Rejects old-style using declaration

[Bug c++/22154] [DR 382] qualified names should allow typename keyword in front of it (even in non-templates)

[Bug c++/22172] [3.4 Regression] Internal compiler error, seg fault.

[Bug c++/22238] [4.0/4.1 regression] '#'obj_type_ref' not supported by dump_expr

[Bug c++/22238] [4.0/4.1/4.2 regression] '#'obj_type_ref' not supported by dump_expr

[Bug c++/22238] [4.0/4.1/4.2] '#'obj_type_ref' not supported by dump_expr

[Bug c++/22252] [4.0 Regression] pragma interface/implementation still break synthesized methods

[Bug c++/22434] [3.4/4.0/4.1 regression] ICE in simplify_{,gen_}subreg

[Bug c++/22487] C++ front-end produces mis-match types in EQ_EXPR (array constructor)

[Bug c++/22489] [4.0/4.1 Regression] ICE in dwarf2out_finish with using namespace in a local class and compiler built constructors

[Bug c++/22573] typedef in class scope not reported by error message

[Bug c++/22575] immutable object placed in .bss section.

[Bug c++/23046] [4.1 Regression] ICE in set_value_range, at tree-vrp.c:191

[Bug c++/23162] [3.4 only] internal compiler error: in c_expand_expr, at c-common.c:4138

[Bug c++/23171] [4.1 Regression] ICE on pointer initialization with C99 initializer

[Bug c++/23278] SJLJ-exceptions broken

[Bug c++/23457] [3.4/4.0/4.1 Regression] compiler crash on huge object size with virtual base

[Bug c++/23594] namespace typedef and global typedef name the same type, using kills global

[Bug c++/23797] [3.4 Regression] ICE on typename outside template

[Bug c++/23823] Is this right?

[Bug c++/24009] [4.0/4.1 regression] C++ fails to print #include stack

[Bug c++/24009] [4.0/4.1/4.2 regression] C++ fails to print #include stack

[Bug c++/24050] [3.4 Regression] Fails a template instantiation.

[Bug c++/24138] [4.1 regression] ICE with the code in PR 20407

[Bug c++/24173] [4.0/4.1/4.2 regression] ICE with garbage collection

[Bug c++/24189] crash at exit after dlclose with -fuse-cxa-atexit

[Bug c++/24199] [3.4 Regression] Segfault with -frepo -g

[Bug c++/24199] Segfault with -frepo -g

[Bug c++/24278] [3.4/4.0/4.1 regression] ICE while trying to print out error

[Bug c++/24310] ipa-inline dump reads from freed memory resulting in a corrupt dump file

[Bug c++/24326] bad diagnostic

[Bug c++/24368] [3.4 Regression] -Wshadow gets confused by built-ins

[Bug c++/24397] [3.4 regression] ICE in gen_subprogram_die, at dwarf2out.c

[Bug c++/24439] ICE with invert conditional containing throw

[Bug c++/24449] Unable to declare friend main() from class template

[Bug c++/24470] [3.4 Regression] segmentation fault in cc1plus when compiling with -O

[Bug c++/24560] [3.4/4.0/4.1 Regression] "insufficient contextual information to determine type" is not a helpful error message

[Bug c++/24569] [4.0/4.1 regression] ICE in add_AT_specification, at dwarf2out.c:4966

[Bug c++/24580] [3.4/4.0/4.1 Regression] virtual base class cause exception not to be caught

[Bug c++/24582] [4.0/4.1 regression] ICE in decl_jump_unsafe

[Bug c++/24602] g++: Internal error: Illegal instruction (program cc1plus)

[Bug c++/24604] New: namespace std aliasing

[Bug c++/24604] namespace std aliasing

[Bug c++/24605] New: internal compiler error: Segmentation fault while compiling c++ file

[Bug c++/24605] [4.0/4.1 Regression] internal compiler error: Segmentation fault while compiling c++ file

[Bug c++/24605] [4.1 Regression] internal compiler error: Segmentation fault while compiling c++ file

[Bug c++/24605] internal compiler error: Segmentation fault while compiling c++ file

[Bug c++/24606] New: ICE on template function which gets an template agrument as a function with a default argument

[Bug c++/24606] ICE on template function which gets an template agrument as a function with a default argument

[Bug c++/24607] New: poor diagnostic

[Bug c++/24607] poor diagnostic

[Bug c++/24613] New: [gomp] ICE on unexpected #pragma omp section

[Bug c++/24613] [gomp] ICE on unexpected #pragma omp section

[Bug c++/24628] New: const-over-non-const identification fails

[Bug c++/24628] const-over-non-const identification fails

[Bug c++/24629] New: Can't use template argument as friend

[Bug c++/24629] Can't use template argument as friend

[Bug c++/24630] New: friend injection fails

[Bug c++/24630] friend injection fails

[Bug c++/24648] New: a template parse error

[Bug c++/24648] a template parse error

[Bug c++/24649] New: Hello world c++ prog core dumps when configured with /usr/ccs/bin/as

[Bug c++/24649] Hello world c++ prog core dumps when configured with /usr/ccs/bin/as

[Bug c++/24654] New: friend class using plain scope resolution operator

[Bug c++/24654] friend class using plain scope resolution operator

[Bug c++/24657] New: bizarre diagnostic on valid (?) constructor

[Bug c++/24657] [3.4/4.0/4.1 Regression] bizarre diagnostic on valid (?) constructor

[Bug c++/24657] [3.4/4.0/4.1 Regression] bizarre diagnostic when a member variable and a template parameter have the same name

[Bug c++/24657] bizarre diagnostic on valid (?) constructor

[Bug c++/24658] New: overloaded function lookup in base class fails

[Bug c++/24658] overloaded function lookup in base class fails

[Bug c++/24663] New: Template instantiation generating a zero-sized array doesn't fail

[Bug c++/24663] Template instantiation generating a zero-sized array doesn't fail

[Bug c++/24664] New: Template instantiation generating an array of voids doesn't fail

[Bug c++/24664] Template instantiation generating an array of voids doesn't fail

[Bug c++/24666] New: [meta-bug] arrays decay to pointers too early

[Bug c++/24666] [meta-bug] arrays decay to pointers too early

[Bug c++/24667] New: -Wcast-qual fails to reject offending cast

[Bug c++/24667] -Wcast-qual fails to reject offending cast

[Bug c++/24667] [4.0/4.1 Regression] -Wcast-qual fails to reject offending cast for a old style cast

[Bug c++/24667] [4.0/4.1 Regression] -Wcast-qual fails to warn about offending cast for a old style cast

[Bug c++/24668] New: visibility attributes on namespaces

[Bug c++/24668] visibility attributes on namespaces

[Bug c++/24671] New: [4.0/4.1 regression] ICE with zero-sized arrays

[Bug c++/24671] [4.0/4.1 regression] ICE with zero-sized arrays

[Bug c++/24680] New: [accept invalid] Invalid template code accepted

[Bug c++/24680] Invalid template code accepted

[Bug c++/24686] New: ICE when building a variation of NMSTL

[Bug c++/24686] [4.0 Regression] ICE when building a variation of NMSTL

[Bug c++/24686] [4.0/4.1 Regression] ICE when building a variation of NMSTL

[Bug c++/24686] ICE when building a variation of NMSTL

[Bug c++/24687] New: [4.1 Regression] ICE after error

[Bug c++/24687] [4.1 Regression] ICE after error

[Bug c++/24690] New: error using TinyVector temporary as default constructor value

[Bug c++/24690] error using TinyVector temporary as default constructor value

[Bug c++/24702] New: Koenig found functoid ref, but "cannot be used as a function"

[Bug c++/24702] Koenig found functoid ref, but "cannot be used as a function"

[Bug c++/24707] New: tradcpp0: output filename specified twice

[Bug c++/24711] New: Misleading names for template parameters in diagnostics

[Bug c++/24711] Misleading names for template parameters in diagnostics

[Bug c++/24717] New: spurious error

[Bug c++/24717] spurious error

[Bug c++/24720] New: poorly named include guard in stl_tree.h

[Bug c++/24734] New: [gomp] "#pragma omp master" doesn't work in templates

[Bug c++/24734] [gomp] "#pragma omp master" doesn't work in templates

[Bug c++/24735] New: [gomp] "#pragma omp barrier" doesn't work in templates

[Bug c++/24735] [gomp] "#pragma omp barrier" doesn't work in templates

[Bug c++/24737] New: const bool& optimization error

[Bug c++/24745] New: unpleasant warning for "if (NULL)"

[Bug c++/24745] unpleasant warning for "if (NULL)"

[Bug c++/24746] New: unpleasant warning for "if (NULL)"

[Bug c++/24746] unpleasant warning for "if (NULL)"

[Bug c++/24758] New: Non ambiguous typedefs

[Bug c++/24758] Non ambiguous typedefs

[Bug c++/24761] [4.0/4.1 Regression] Missing register load before inline asm in templated function causes SIGSEGV

[Bug c++/24761] [4.0/4.1 Regression] templates and inline-asm and "+"

[Bug c++/24770] New: Incorrect "unreachable code" warning from 3.4.3 under specific conditions

[Bug c++/24780] New: ICE set_mem_attributes_minus_bitpos

[Bug c++/24780] [4.0/4.1 Regression] ICE set_mem_attributes_minus_bitpos

[Bug c++/24782] New: wrongly accepted nested private typedef

[Bug c++/24782] [3.4/4.0/4.1 Regression] wrongly accepted nested private typedef

[Bug c++/24786] New: Missing warning on questionable use of parameter to initialize static

[Bug c++/24786] Missing warning on questionable use of parameter to initialize static

[Bug c++/24791] New: ICE on invalid instantiation of template's static member

[Bug c++/24791] ICE on invalid instantiation of template's static member

[Bug c++/24795] New: [4.1 Regression] Error in dependent name-lookup

[Bug c++/24795] [4.1 Regression] Error in dependent name-lookup

[Bug c++/24795] Error in dependent name-lookup

[Bug c++/24804] New: Produces wrong code

[Bug c++/24804] Produces wrong code

[Bug c++/24811] New: Wrong compile template class with itetrator inside this class.See example.

[Bug c++/24811] Wrong compile template class with itetrator inside this class.See example.

[Bug c++/24816] New: Crash on template specialization

[Bug c++/24816] Crash on template specialization

[Bug c++/24817] New: g++ accepts multiple function template declarations even if exception-specification doesn't match.

[Bug c++/24817] [3.4/4.0 Regression] g++ accepts multiple function template declarations even if exception-specification doesn't match.

[Bug c++/24817] [3.4/4.0/4.1 Regression] g++ accepts multiple function template declarations even if exception-specification doesn't match.

[Bug c++/24824] New: ICE: in build_abbrev_table, at dwarf2out.c:6427 with -feliminate-dwarf2-dups

[Bug c++/24824] ICE: in build_abbrev_table, at dwarf2out.c:6427 with -feliminate-dwarf2-dups

[Bug c++/24847] New: Instantiates un-called copy constructor

[Bug c++/24847] Instantiates un-called copy constructor

[Bug c++/24848] New: g++ issues parse error on constructor template specialization.

[Bug c++/24848] g++ issues parse error on constructor template specialization.

[Bug c++/24849] New: [gomp] ICE in expand_expr_real_1

[Bug c++/24849] [gomp] ICE in expand_expr_real_1

[Bug c++/24852] New: [4.0 regression] Segmentation fault (infinite recursion in cgraph_clone_inlined_nodes)

[Bug c++/24852] [4.0 regression] Segmentation fault (infinite recursion in cgraph_clone_inlined_nodes)

[Bug c++/24874] New: ICE: in add_AT_specification, at dwarf2out.c:4903

[Bug c++/24874] ICE: in add_AT_specification, at dwarf2out.c:4903

[Bug c++/24889] New: ICE

[Bug c++/24889] ICE

[Bug c++/24893] New: inherited polymorphic template class

[Bug c++/24893] inherited polymorphic template class

[Bug c++/24906] New: ICE When using -fmudflap on a simple C++ source file

[Bug c++/24906] ICE When using -fmudflap on a simple C++ source file

[Bug c++/24907] New: Invalid Code Accepted

[Bug c++/24907] [3.4/4.0/4.1 Regression] "int x, ;" accepted

[Bug c++/24907] [3.4/4.0/4.1 Regression] Invalid Code Accepted

[Bug c++/24907] [3.4/4.0/4.1/4.2 Regression] "int x, ;" accepted

[Bug c++/24915] New: Overload errors generated without template instantiations for class member templates

[Bug c++/24915] [3.4/4.0/4.1 Regression] Overload errors generated without template instantiations for class member templates

[Bug c++/24915] [3.4/4.0/4.1/4.2 Regression] Overload errors generated without template instantiations for class member templates

[Bug c++/24924] New: front end and preprocessor pedantic_errors settings should agree

[Bug c++/24924] front end and preprocessor pedantic_errors settings should agree

[Bug c++/24926] New: gcc ignores access level violation: struct variables in anonymous union accessible as public

[Bug c++/24926] gcc ignores access level violation for anonymous structs

[Bug c++/24928] New: Trivial static const objects should go to .rodata

[Bug c++/24928] static const objects should go to .rodata

[Bug c++/24928] Trivial static const objects should go to .rodata

[Bug c++/24933] New: Function template friend declaration is misinterpreted.

[Bug c++/24933] Function template friend declaration is misinterpreted.

[Bug c++/24935] New: crash with -ftree-vectorize

[Bug c++/24939] New: operator< in middle of expression is parsed as template

[Bug c++/24939] operator< in middle of expression is parsed as template

[Bug c++/24947] New: -Os should maximize inlining --param values.

[Bug c++/24947] -Os should maximize inlining --param values.

[Bug c++/24948] New: lookup chooses the wrong overload

[Bug c++/24948] lookup chooses the wrong overload

[Bug c++/24960] New: reference to member var in templated base class won't compile

[Bug c++/24960] reference to member var in templated base class won't compile

[Bug c++/24967] New: ICE with misplaced typename

[Bug c++/24967] ICE with misplaced typename

[Bug c++/24970] New: Error in header file: ctime:69: error: ::tm has not been declared

[Bug c++/24970] Error in header file: ctime:69: error: ::tm has not been declared

[Bug c++/24977] New: Dependent lookup considers static functions

[Bug c++/24977] Dependent lookup considers static functions

[Bug c++/24979] New: DECL_MAIN_P is declared twice in cp-tree.h

[Bug c++/24979] DECL_MAIN_P is declared twice in cp-tree.h

[Bug c++/24983] New: Needs a warning?

[Bug c++/24983] Needs a warning?

[Bug c++/24985] New: Line info in diagnostics is very unfriendly

[Bug c++/24985] Line info in diagnostics is very unfriendly

[Bug c++/24986] New: g++ is confused when function is defined inside and outside some namespace and called with '::' prefix

[Bug c++/24986] g++ is confused when function is defined inside and outside some namespace and called with '::' prefix

[Bug c++/24996] New: ICE on throw code

[Bug c++/24996] [4.0/4.1/4.2 Regression] ICE on throw code

[Bug c++/25006] New: failure "using" a name contained in a class

[Bug c++/25006] failure "using" a name contained in a class

[Bug c++/25010] New: [4.1/4.2 regression] Segmentation fault (infinite recursion in cgraph_clone_inlined_nodes)

[Bug c++/25010] [4.1/4.2 regression] Segmentation fault (infinite recursion in cgraph_clone_inlined_nodes)

[Bug c++/25011] New: gcc exits with core

[Bug c++/25011] gcc exits with core

[Bug c++/25014] New: seems to be a bug in optimization on sparc systems.

[Bug c++/25014] seems to be a bug in optimization on sparc systems.

[Bug c++/25015] New: [gomp] Function names cannot be demangled due to ".omp_fn" suffix

[Bug c++/25015] [gomp] Function names cannot be demangled due to ".omp_fn" suffix

[Bug c++/25107] New: undefined reference even though the template is instantiated

[Bug c++/25107] undefined reference even though the template is instantiated

[Bug c++/25108] New: gcc doesn't work for templates with `static const` members.

[Bug c++/25108] gcc doesn't work for templates with `static const` members.

[Bug c++/25110] New: "expected primary-expression before ')' token" error when compiling templated method of templated class

[Bug c++/25110] "expected primary-expression before ')' token" error when compiling templated method of templated class

[Bug c++/25137] New: Warning "missing braces around initializer" causing problems with tr1::array

[Bug c++/25137] Warning "missing braces around initializer" causing problems with tr1::array

[Bug c++/25152] New: -fstrict-aliasing generates wrong code, but no warning from -Wstrict-aliasing

[Bug c++/25152] -fstrict-aliasing generates wrong code, but no warning from -Wstrict-aliasing

[Bug c++/25152] [4.0/4.1 only] -fstrict-aliasing generates wrong code, but no warning from -Wstrict-aliasing

[Bug c++/25153] New: Bug in name lookup in template -- 4.0 regression against 3.4

[Bug c++/25153] [4.0 Regression] Bug in name lookup in template -- 4.0 regression against 3.4

[Bug c++/25156] New: wrong error message (int instead of bool)

[Bug c++/25156] [3.4/4.0/4.1 Regression] wrong error message (int instead of bool)

[Bug c++/25163] New: [3.4 Regression] g++.dg/abi/vtt1.C failure with "-funit-at-a-time"

[Bug c++/25163] [3.4 Regression] g++.dg/abi/vtt1.C failure with "-funit-at-a-time"

[Bug c++/25181] New: wrong "will never be executed" warning in switch - case block

[Bug c++/25181] [3.4 Regression] wrong "will never be executed" warning in switch - case block

[Bug c++/25181] wrong "will never be executed" warning in switch - case block

[Bug c++/25185] New: deep typedef substitution in error message

[Bug c++/25185] deep typedef substitution in error message

[Bug c++/25191] New: exception_defines.h #defines try/catch

[Bug c++/2] ICE on template with aggregates

[Bug c++/3187] gcc lays down two copies of constructors

[Bug c++/4131] Why the C++ compiler don't place a const class object to ".rodata" section?

[Bug c++/5310] Weird warnings about using (int)NULL

[Bug c++/5314] compilation error

[Bug c++/57] [DR 325] GCC can't parse a non-parenthesized comma in a template-id within a default argument

[Bug c++/6259] Explicit instantiation of template constructor not allowed

[Bug c++/6555] Copy constructor is called before the object (being copied) is initialized

[Bug c++/7906] Templated class with nested non-templated class having an operator() fails to compile

[Bug c++/7935] floating point test of ">" fails on -O0, not on -O{1,2,3} for certain values double precision float accessed by operator[] in wrapper class (on ix86)

[Bug c++/8355] befriending a template specialization in another namespace

[Bug c++/9278] Illegal use of typedef to "void"

[Bug c++/9436] [ABI] passing a class template followed by a template value of this class

[Bug c++/9726] namespace typedef hides global when interacting with using directive

[Bug c++/9925] ostrstream (buf, size) << "..." does not work properly

[Bug c++/99] Bug in template type in error message.

[Bug c/10719] invalid code generated (x86, "int $5") with __builtin_va_arg(va, char);

[Bug c/11751] wrong evaluation order of an expression

[Bug c/1570] gcc 2.8.1 has autoincrement bug

[Bug c/17534] gcc fails to diagnose suspect expressions that have incompatible bit masks

[Bug c/18382] define __pic__ and/or __PIC__ in c-cppbuiltins.c instead of scattershot in target config

[Bug c/18624] GCC does not detect local variable set but never used

[Bug c/20303] [4.0 only] Can't push more than 16 nested visibility

[Bug c/20318] RFE: add attribute to specify that a function never returns NULL

[Bug c/20562] no unused warning for static const arrays

[Bug c/21668] gratuitous warning about "extern const" with initializer

[Bug c/21920] alias violating

[Bug c/22052] [4.0 Regression] redefinition of inline function succeeds

[Bug c/23397] Compilation Ghostscript gs_init.c file failed on mipsel-linux machine

[Bug c/24016] Missing warning for unspecified evaluation order

[Bug c/24101] [3.4/4.0/4.1 Regression] Segfault with preprocessed source

[Bug c/24329] [4.0 regression] segfault with -Wall and long integer literal

[Bug c/24329] [4.0/4.1 regression] segfault with -Wall and long integer literal

[Bug c/24363] [3.4 Regression] Missing Errormessage

[Bug c/24542] potential integer overflow should be warned on assignment to wider variable

[Bug c/24599] [4.0 regression] Overflow for true value

[Bug c/24599] [4.0/4.1 regression] Overflow for true value

[Bug c/24611] New: -Wunused-value Extension

[Bug c/24611] -Wunused-value Extension

[Bug c/24634] New: DW_AT_high_pc and DW_AT_low_pc zero in DWARF-2 debug info in object file in 64bit world

[Bug c/24635] New: Wrong statement reordering

[Bug c/24635] Wrong statement reordering

[Bug c/24644] New: gcc-4.1 compiled ppc64 kernels do not boot

[Bug c/24644] [4.1 Regression] gcc-4.1 compiled ppc64 kernels do not boot

[Bug c/24656] New: Multiple static inline functions accepted

[Bug c/24656] Multiple static inline functions accepted

[Bug c/24661] New: unable to find a register to spill in class NO_REGS on ia64

[Bug c/24661] unable to find a register to spill in class NO_REGS on ia64

[Bug c/24675] New: Stack corruption in ARM arch. if 64bit variable is passed to a function of which the low 32 use the register and the up 32 use the stack

[Bug c/24691] New: attribute aligned is silently ignored or program is miscompiled

[Bug c/24703] [GOMP] Unable to compile OpenMP program with omp parallel for schedule(dynamic) directive

[Bug c/24716] New: Wrong code generated when optimising

[Bug c/24724] New: _Unwind_Backtrace() calls malloc

[Bug c/24727] New: type "const void *" produces a warning when promoting to "void *"

[Bug c/24727] type "const void *" produces a warning when promoting to "void *"

[Bug c/24728] New: Constant array index past end does not generate compile-time error

[Bug c/24728] Constant array index past end does not generate compile-time error

[Bug c/24743] New: NaN or correct result after divrp with 3 FPU registers

[Bug c/24753] New: FreeBSD make buildworld failure

[Bug c/24753] FreeBSD make buildworld failure

[Bug c/24756] New: pointer arithmetic on ia32 uses signed divide

[Bug c/24756] pointer arithmetic on ia32 uses signed divide

[Bug c/24788] New: getting complier error:Internal compiler error in ix86_attr_length_immediate_default

[Bug c/24788] getting complier error:Internal compiler error in ix86_attr_length_immediate_default

[Bug c/24830] New: Duplicate constructors with -fmudflap

[Bug c/24830] Duplicate constructors with -fmudflap

[Bug c/24836] New: gcc/configure doesn't handle all possible SH architectures

[Bug c/24839] New: Mudflap not registering unreferenced globals

[Bug c/24839] Mudflap not registering unreferenced globals

[Bug c/24840] New: ICE process_assert_insertions_for, at tree-vrp.c:2807

[Bug c/24856] New: call to setlocale doesn't return expected value

[Bug c/24856] call to setlocale doesn't return expected value

[Bug c/24861] New: internal compiler error when building gcc with --with-cpu=ep9312 --with-fpu=maverick

[Bug c/24863] New: New __attribute__((alias("target"))) requirement break aliasing assembler functions

[Bug c/24863] New __attribute__((alias("target"))) requirement break aliasing assembler functions

[Bug c/24891] New: Problem with unintitalized global variables.

[Bug c/24891] Problem with unintitalized global variables.

[Bug c/24894] New: ICE building newlib/libc/misc/init.c

[Bug c/24900] New: new "value computed is not used" warning in gcc 4.1

[Bug c/24900] [4.1 Regression] new "value computed is not used" warning in gcc 4.1

[Bug c/24900] new "value computed is not used" warning in gcc 4.1

[Bug c/24914] New: gcc fails when built with --with-cpu=ep9312 --with-fpu=maverick

[Bug c/24914] gcc fails when built with --with-cpu=ep9312 --with-fpu=maverick

[Bug c/24916] option -O undocumented in cpp docs

[Bug c/24931] New: uninitialized structure member after assignment

[Bug c/24944] New: Size of type not multiple of its alignment.

[Bug c/24968] New: wrong "will never be executed" warning

[Bug c/24969] New: [4.1/4.2 Regression] tmpdir-gcc.dg-struct-layout-1/t026 fails execution

[Bug c/24969] [4.1/4.2 Regression] tmpdir-gcc.dg-struct-layout-1/t026 fails execution

[Bug c/24969] tmpdir-gcc.dg-struct-layout-1/t026 fails execution

[Bug c/24971] New: missing prototype causes strange effect at a distance with float.

[Bug c/24971] missing prototype causes strange effect at a distance with float.

[Bug c/24972] New: missing prototype causes strange effect at a distance with float.

[Bug c/24972] missing prototype causes strange effect at a distance with float.

[Bug c/24973] New: missing prototype causes strange effect at a distance with float.

[Bug c/24973] missing prototype causes strange effect at a distance with float.

[Bug c/24976] New: simple hexadecimal number parsed as C99 hex float

[Bug c/25019] New: Promoting long to long long generates no warning and/or incorrect result.

[Bug c/25019] Promoting long to long long generates no warning and/or incorrect result.

[Bug c/25043] New: [m68k] ICE in instantiate_virtual_regs_lossage

[Bug c/25044] New: problems caused by unresolved symbols in libgcc

[Bug c/25125] New: [4.1/4.2 Regression] (short) ((int)(unsigned short) + (int)) is done in the wrong type

[Bug c/25125] [4.1/4.2 Regression] (short) ((int)(unsigned short) + (int)) is done in the wrong type

[Bug c/25129] New: asm volatile optimizes to invalid operands

[Bug c/25129] asm volatile optimizes to invalid operands

[Bug c/25150] New: internal error with __thread and memcpy()

[Bug c/25151] New: GCC issues warnings to a syntactically correct expression.

[Bug c/25151] GCC issues warnings to a syntactically correct expression.

[Bug c/25155] New: Base type of expressions involving short operands is shown as int

[Bug c/25155] Base type of expressions involving short operands is shown as int

[Bug c/25161] New: Internal compiler error (segfault) instead of error message

[Bug c/25161] [4.0/4.1/4.2 Regression] Internal compiler error (segfault) instead of error message

[Bug c/25169] New: [4.0 regression] tree checking failures in gcc.dg/20040203-1.c, cast-1.c, cast-2.c, cast-3.c

[Bug c/25169] [4.0 regression] tree checking failures in gcc.dg/20040203-1.c, cast-1.c, cast-2.c, cast-3.c

[Bug c/25170] New: Erroneous error message for simple macro

[Bug c/25170] Erroneous error message for simple macro

[Bug c/25173] New: gcc outputs unnecessary warnings

[Bug c/25173] gcc outputs unnecessary warnings

[Bug c/25175] New: Meaningless pre-processor lineno comments inserted

[Bug c/25175] Meaningless pre-processor lineno comments inserted

[Bug c/25179] New: precedence of -fpie over -fpic

[Bug c/25182] New: internal compiler error triggered by overflow in constant expression

[Bug c/25182] internal compiler error triggered by overflow in constant expression

[Bug c/25183] New: internal compiler error triggered by overflow in constant expression

[Bug c/25183] [4.0/4.1/4.2 Regression] internal compiler error triggered by overflow in constant expression

[Bug c/25183] internal compiler error triggered by overflow in constant expression

[Bug c/2574] sprintf(..) can not correctly handle "%%"

[Bug c/3498] gcc3.0.1 ICE

[Bug c/4830] rand( ) of gcc-3.0.2 does not generate proper random number

[Bug c/5051] May I ask a C Language problem?

[Bug c/6765] gcc - incrementation - ternary operator

[Bug c/6917] optimization problem in gcc 3.1

[Bug c/762] can not calculate x *=x++ correctly on GNU 2.8.1 in sparc-sun-solaris2.6 environment

[Bug c/8083] GCC does not warn for aliasing violations

[Bug c/8268] no compile time array index checking

[Bug classpath/23183] SimpleDateFormat fails to render '' as single quotes

[Bug classpath/24642] Failure to produce random values.

[Bug debug/18273] [3.4 Regression] Fail to generate debug info for member function.

[Bug debug/20268] With optimization, generating incomplete debug information

[Bug debug/21391] [3.4/4.0/4.1 Regression] referencing a type via a cast does not emit it for debug (feliminate-unused-debug-types)

[Bug debug/21932] [3.4 Regression] -O3 -fno-unit-at-a-time causes ICE

[Bug debug/22313] [4.1 Regression] gcc HEAD as of 2005/07/05 fails to profiledbootstrap

[Bug debug/22313] [4.1 Regression] gcc HEAD as of 2005/07/05 fails to profiledbootstrap without -g

[Bug debug/23336] [3.4/4.0/4.1 Regression] enum constants not visible to gdb because of -feliminate-unused-debug-types

[Bug debug/24444] [4.1 regression] invalid register in debug info

[Bug debug/24490] [4.1 Regression] gcc / gdb backtrace problem

[Bug debug/24634] DW_AT_high_pc and DW_AT_low_pc zero in DWARF-2 debug info in object file in 64bit world

[Bug debug/24801] New: -d option changes debug information

[Bug debug/24801] -d option changes debug information

[Bug debug/24824] [4.1 Regression] ICE: in build_abbrev_table, at dwarf2out.c:6427 with -feliminate-dwarf2-dups

[Bug debug/24908] New: ICE in dwarf2out for cpu2000 with -funroll-loops -fno-tree-copyrename

[Bug debug/24908] [4.0/4.1 Regression] ICE in dwarf2out for cpu2000 with -funroll-loops -fno-tree-copyrename

[Bug debug/24908] ICE in dwarf2out for cpu2000 with -funroll-loops -fno-tree-copyrename

[Bug debug/24943] New: [hppa64] Bad dwarf output using non-preserved base register

[Bug debug/24943] [hppa64] Bad dwarf output using non-preserved base register

[Bug debug/25023] [4.1/4.2 Regression] ICE in def_cfa_1, at dwarf2out.c:792

[Bug debug/7030] Incorrect DWARF

[Bug driver/20425] -print-search-dirs doesn't honor mutil-os/multilib settings

[Bug driver/24684] New: No flag documentation for gomp (openmp)

[Bug driver/24684] No flag documentation for gomp (openmp)

[Bug driver/24707] tradcpp0: output filename specified twice

[Bug driver/24718] New: Shared libgcc not used for linking by default

[Bug fortran/14943] read/write code generation is not thread safe

[Bug fortran/14994] Secnds Intrinsic not support (or any VMS intrinsics)

[Bug fortran/15326] [4.0 only] ICE with assumed length character strings

[Bug fortran/15382] frontend too lenient when checking variable declarations

[Bug fortran/15502] [meta-bug] bugs needed for SPEC CPU 2K and 2K5/6 and 95

[Bug fortran/15809] ICE Using Pointer Functions

[Bug fortran/15976] ICE: assertion failure in trans-array.c

[Bug fortran/16206] Internal error on initialization expression

[Bug fortran/16861] [4.0 only] segfault with doubly used module

[Bug fortran/17737] ICE when variable appears in two data statements

[Bug fortran/18111] spurious warnings with -W -Wunused

[Bug fortran/18157] ice-on-valid code, pointer to user-defined type, fold-struct.c

[Bug fortran/18197] bus error on returning from a function

[Bug fortran/18271] ICE with computed array declaration

[Bug fortran/18428] No preprocessing option -cpp for gfortran

[Bug fortran/18452] Fortran options induces warning for fortran that needs preprocessing

[Bug fortran/18496] Build fails with "libgmp.so.6 not found" error

[Bug fortran/18584] --std=f would be nice

[Bug fortran/18737] ICE on invalid use of external keyword

[Bug fortran/18883] ICE in gfc_finish_var_decl

[Bug fortran/19292] [meta-bug] g77 features lacking in gfortran

[Bug fortran/19669] [gfortran] ICE (segfault) on legal code

[Bug fortran/19766] wrong results or crash from PURE function

[Bug fortran/19925] Implied do-loop in an initialization expression is broken

[Bug fortran/20244] internal compiler error: in fold_convert, at fold-const.c:2003

[Bug fortran/20811] gfortran include problem (regression from g77)

[Bug fortran/20838] ICE in gfc_conv_expr_descriptor, at fortran/trans-array.c:3606

[Bug fortran/20839] do-loop with do-construct-name needs needs end do

[Bug fortran/20840] accepts vector subscript on internal file

[Bug fortran/20867] statement function args not given implicit type early enough

[Bug fortran/21253] Bounds Check

[Bug fortran/21302] Max line length in free form mode

[Bug fortran/21565] namelist in block data is illegal

[Bug fortran/21647] INQUIRE errors when using -fdefault-integer-8

[Bug fortran/22048] Problem with sub-string operator and implicitly typed character variables

[Bug fortran/22146] ICE when calling ELEMENTAL subroutines

[Bug fortran/22495] Different ideas about .true. and .false.

[Bug fortran/22519] Memory and binary disk layout disagree for real*10

[Bug fortran/22607] Elemental character functions don't work

[Bug fortran/23124] gfc_trans_deferred_array internal compiler error

[Bug fortran/23151] print (buf, format), expression should be invalid

[Bug fortran/23201] [4.1 Regression] internal compiler error: verify_ssa failed

[Bug fortran/23202] [4.1 Regression] internal compiler error: tree check: expected ssa_name, have var_decl in verify_ssa, at tree-ssa.c:746

[Bug fortran/23420] ICE on invalid print statement

[Bug fortran/23460] [3.4 Regression] g77 unable to locate fortran INCLUDE files when preprocessed

[Bug fortran/23538] gfortran hangs on old cray fortran 66 program

[Bug fortran/23815] Add -byteswapio flag

[Bug fortran/23912] MOD function requires same kind arguments

[Bug fortran/24008] gfortran too permissive about ENTRY syntax

[Bug fortran/24096] huge() returns infinity for long doubles

[Bug fortran/24158] ICE in f951 with nested, recursive derived types

[Bug fortran/24223] Gfortran crashes in two places

[Bug fortran/24245] -fdump-parse-tree gives ICE for CONTAINED functions

[Bug fortran/24268] gfortran rejects valid format statement

[Bug fortran/24285] format(1000(a,$))

[Bug fortran/24357] whither ratfor?

[Bug fortran/24384] SPREAD does not handle scalar sources.

[Bug fortran/24398] invalid module file gives weird error

[Bug fortran/24404] Poor Error Description, bad error order

[Bug fortran/24406] EQUIVALENCE broken in 32-bit code with optimization -O2

[Bug fortran/24409] ICE on module name vs dummy argument name

[Bug fortran/24524] Fortran dependency checking should reverse loops

[Bug fortran/24534] [4.0/4.1 Regression] PUBLIC derived types with private components

[Bug fortran/24546] [meta-bug] gfortran debugging problems

[Bug fortran/24549] ICE with invalid pseudo-declaration statement

[Bug fortran/24633] New: MODULE attribute conflicts with PROCEDURE attribute

[Bug fortran/24633] MODULE attribute conflicts with PROCEDURE attribute

[Bug fortran/24636] New: gfortran: STOP without stop-code too noisy, regression w.r.t. g77

[Bug fortran/24636] gfortran: STOP without stop-code too noisy, regression w.r.t. g77

[Bug fortran/24640] New: ice with invalid label

[Bug fortran/24640] ice with invalid label

[Bug fortran/24641] New: rejecting valid code

[Bug fortran/24641] rejecting valid code

[Bug fortran/24643] New: Unclassifiable statement on character substring concatenation

[Bug fortran/24643] Unclassifiable statement on character substring concatenation

[Bug fortran/24643] Unclassifiable statement on implicitly typed character substring

[Bug fortran/24646] New: accepting invalid label

[Bug fortran/24646] accepting invalid label

[Bug fortran/24655] New: bug compiling following few lines code with gfortran

[Bug fortran/24655] bug compiling following few lines code with gfortran

[Bug fortran/24655] ICE with statement function

[Bug fortran/24673] New: internal compiler error in fold_convert, at fold-const.c:2028

[Bug fortran/24673] internal compiler error in fold_convert, at fold-const.c:2028

[Bug fortran/24679] New: internal compiler error: Segmentation fault

[Bug fortran/24679] internal compiler error: Segmentation fault

[Bug fortran/24682] [GOMP] Sample program at OpenMP web site fails with ICE

[Bug fortran/24705] New: ICE on asterisk char-len-param-value on result

[Bug fortran/24705] ICE on assumed length character result

[Bug fortran/24705] ICE on assumed length charactor result

[Bug fortran/24706] New: Accepts non-constant length arrays in derived types

[Bug fortran/24706] Accepts non-constant length arrays in derived types

[Bug fortran/24710] New: gfortran - fails to build on Mac OSX -10.4.3

[Bug fortran/24719] New: Summary: [4.1 Regression] Nonadvancing read does not read more than 1 line

[Bug fortran/24748] New: substring of implicitly typed variable not rejected

[Bug fortran/24748] substring of implicitly typed variable not rejected

[Bug fortran/24755] New: internal compiler error with statement function

[Bug fortran/24755] [4.0/4.1 Regression] internal compiler error with statement function

[Bug fortran/24755] internal compiler error with statement function

[Bug fortran/24759] New: Unclear error message

[Bug fortran/24759] Unclear error message for a syntax error

[Bug fortran/24767] New: gfortran: -Wno-unused-label does not work properly

[Bug fortran/24767] gfortran: -Wno-unused-label does not work properly

[Bug fortran/24774] New: [gomp-branch] wrong results for INQUIRE statement

[Bug fortran/24774] [gomp-branch] wrong results for INQUIRE statement

[Bug fortran/24783] New: Implicit none in module overwrite explicit in procedure

[Bug fortran/24783] Implicit none in module overwrite explicit in procedure

[Bug fortran/24784] New: Warning about unused routine argument should not read "unused variable"

[Bug fortran/24784] Warning about unused routine argument should not read "unused variable"

[Bug fortran/24789] New: [gfortran] ICE when assigning to array of strings

[Bug fortran/24789] [gfortran] ICE when assigning to array of strings

[Bug fortran/24790] New: arguments are displayed as reference or pointer to normal type in GDB

[Bug fortran/24790] arguments are displayed as reference or pointer to normal type in GDB

[Bug fortran/24793] [4.1 Regression] ICE: expected ssa_name, have var_decl in verify_ssa, at tree-ssa.c:746

[Bug fortran/24806] New: accepts invalid DO construct code

[Bug fortran/24806] accepts invalid DO construct code

[Bug fortran/24807] New: Fortran supports real*16, but not complex*32

[Bug fortran/24807] Fortran supports real*16, but not complex*32

[Bug fortran/24813] New: internal compiler error in gfortran

[Bug fortran/24813] internal compiler error in gfortran

[Bug fortran/24828] New: Z and negative integers

[Bug fortran/24828] Z and negative integers

[Bug fortran/24862] New: Internal Error: Derived type I/O should have been handled via the frontend.

[Bug fortran/24862] [4.1 Regression] Internal Error: Derived type I/O should have been handled via the frontend.

[Bug fortran/24865] New: compiling 64-bit gfortran

[Bug fortran/24866] New: internal compiler error

[Bug fortran/24866] internal compiler error

[Bug fortran/24875] New: [gfortran] Arithmetic overflow during compilation

[Bug fortran/24875] [gfortran, 4.1.0 regression] Arithmetic overflow during compilation

[Bug fortran/24878] New: subroutine getting called illegally as a function

[Bug fortran/24878] subroutine getting called illegally as a function

[Bug fortran/24884] New: compiles invalid-code

[Bug fortran/24884] compiles invalid-code

[Bug fortran/24885] New: fails to report runtime error

[Bug fortran/24885] fails to report runtime error

[Bug fortran/24886] New: another runtime error goes undetected

[Bug fortran/24886] another runtime error goes undetected

[Bug fortran/24887] New: ICE in fold-const.c

[Bug fortran/24887] ICE in fold-const.c

[Bug fortran/24917] New: Handling of hexadecimal constants in gfortran

[Bug fortran/24917] Handling of hexadecimal constants in gfortran

[Bug fortran/24921] New: iostat on read

[Bug fortran/24921] iostat on read

[Bug fortran/24923] New: iostat on read

[Bug fortran/24923] iostat on read

[Bug fortran/24936] New: Internal error

[Bug fortran/24936] [4.1 Regression] Internal error

[Bug fortran/24945] New: calling two open statements (same unit) without close fails

[Bug fortran/24958] New: ice-on-invalid

[Bug fortran/24958] ice-on-invalid

[Bug fortran/24964] New: Does not optimise abs(x)**2 to x**2

[Bug fortran/24965] New: Wrong file name in error message

[Bug fortran/24965] Wrong file name in error message

[Bug fortran/24966] New: Internal compiler error: Bus error

[Bug fortran/24966] Internal compiler error: Bus error

[Bug fortran/24978] ICE in gfc_assign_data_value_range

[Bug fortran/24988] New: gfortran build fails with - Undefined symbols

[Bug fortran/24993] New: LAPACK builds but dies in the testsuite

[Bug fortran/24993] LAPACK builds but dies in the testsuite

[Bug fortran/25003] New: Non-standard-conforming behaviour on pointer association special case.

[Bug fortran/25003] Non-standard-conforming behaviour on pointer association special case.

[Bug fortran/25012] New: internal compiler error in compiling

[Bug fortran/25012] internal compiler error in compiling

[Bug fortran/25013] New: internal compiler error

[Bug fortran/25013] internal compiler error

[Bug fortran/25018] New: Segfault with simple expression

[Bug fortran/25018] Segfault with simple expression

[Bug fortran/25020] New: NAG extension: module F90_UNIX providing access to UNIX functions (abort ...)

[Bug fortran/25020] NAG extension: module F90_UNIX providing access to UNIX functions (abort ...)

[Bug fortran/25024] New: ICE with external declaration inside same procedure

[Bug fortran/25024] ICE with external declaration inside same procedure

[Bug fortran/25029] New: Assumed size array can be associated with array pointer without upper bound of last dimension

[Bug fortran/25029] Assumed size array can be associated with array pointer without upper bound of last dimension

[Bug fortran/25030] New: Character pointer can associated with not the same length character variable.

[Bug fortran/25030] Character pointer can associated with not the same length character variable.

[Bug fortran/25031] New: Allocatable array can be reallocated.

[Bug fortran/25031] Allocatable array can be reallocated.

[Bug fortran/25034] New: allows passing of contained subprograms as actual argument

[Bug fortran/25034] allows passing of contained subprograms as actual argument

[Bug fortran/25036] New: Reopening a file with STATUS='UNKNOWN' should work

[Bug fortran/25036] Reopening a file with STATUS='UNKNOWN' should work

[Bug fortran/25041] New: gfortran internal compiler error: Segmentation fault when compiling 'rksuite_90'

[Bug fortran/25041] gfortran internal compiler error: Segmentation fault when compiling 'rksuite_90'

[Bug fortran/25045] New: better diagnostic needed

[Bug fortran/25045] DIM argument of PRODUCT is not optional

[Bug fortran/25046] New: better diagnostic needed

[Bug fortran/25046] MASK and ARRAY arguments of PRODUCT must have conformant shapes

[Bug fortran/25047] New: better diagnostic needed

[Bug fortran/25047] insert_bbt(): Duplicate key found!

[Bug fortran/25048] New: better diagnostic needed

[Bug fortran/25048] dummy argument with POINTER attribute

[Bug fortran/25049] New: better diagnostic needed

[Bug fortran/25049] TRANSPOSE not allowed in initialisation expression

[Bug fortran/25050] New: better diagnostic needed

[Bug fortran/25050] CSHIFT not allowed in initialization expression

[Bug fortran/25051] New: better diagnostic needed

[Bug fortran/25051] ranks do not match in pointer assignment

[Bug fortran/25052] New: better diagnostic needed

[Bug fortran/25052] intrinsic name cannot be a common block name

[Bug fortran/25053] New: better diagnostic needed

[Bug fortran/25053] FORMAT and NML keywords conflict

[Bug fortran/25054] New: better diagnostic needed

[Bug fortran/25054] nonconstant bounds array cannot appear in a namelist

[Bug fortran/25055] New: better diagnostic needed

[Bug fortran/25055] numeric STOP code should be limited to five digits

[Bug fortran/25056] New: better diagnostic needed

[Bug fortran/25056] non-PURE function should not be a valid argument

[Bug fortran/25057] New: better diagnostic needed

[Bug fortran/25057] default initialization and DATA statement conflict

[Bug fortran/25058] New: better diagnostic needed

[Bug fortran/25058] missing diagnostic about ENTRY dummy argument

[Bug fortran/25059] New: better diagnostic needed

[Bug fortran/25059] ICE after error message

[Bug fortran/25060] New: better diagnostic needed

[Bug fortran/25060] assignment of assumed size array not allowed

[Bug fortran/25061] New: better diagnostic needed

[Bug fortran/25061] procedure name conflict

[Bug fortran/25062] New: better diagnostic needed

[Bug fortran/25062] same name for parameter and common block

[Bug fortran/25063] New: better diagnostic needed

[Bug fortran/25063] EOR cannot appear in WRITE statement

[Bug fortran/25064] New: better diagnostic needed

[Bug fortran/25064] namelist I/O statement shouldn't have an I/O list

[Bug fortran/25065] New: better diagnostic needed

[Bug fortran/25065] better diagnostic needed

[Bug fortran/25066] New: better diagnostic needed

[Bug fortran/25066] SIZE tag not allowed in WRITE statement

[Bug fortran/25067] New: better diagnostic needed

[Bug fortran/25067] better diagnostic needed

[Bug fortran/25068] New: better diagnostic needed

[Bug fortran/25068] better diagnostic needed

[Bug fortran/25068] IOSTAT should be default integer when -std=f95

[Bug fortran/25069] New: better diagnostic needed

[Bug fortran/25069] namelist group name already used

[Bug fortran/25070] New: better diagnostic needed

[Bug fortran/25070] rank mismatch in subroutine call

[Bug fortran/25071] New: better diagnostic needed

[Bug fortran/25071] dummy argument larger than actual argument

[Bug fortran/25072] New: better diagnostic needed

[Bug fortran/25072] better diagnostic needed

[Bug fortran/25073] New: better diagnostic needed

[Bug fortran/25073] CASEs overlap

[Bug fortran/25074] New: better diagnostic needed

[Bug fortran/25074] Component of PARAMETER variable allowed as INTENT(INOUT) argument

[Bug fortran/25075] New: better diagnostic needed

[Bug fortran/25075] array size mismatch in DOT_PRODUCT

[Bug fortran/25076] New: better diagnostic needed

[Bug fortran/25076] FORALL triplet subscript must not reference any index-name

[Bug fortran/25077] New: better diagnostic needed

[Bug fortran/25077] No error on attempt to redefine intrinsic assigments

[Bug fortran/25078] New: better diagnostic needed

[Bug fortran/25078] EQUILALENCE requires two or more objects

[Bug fortran/25079] New: better diagnostic needed

[Bug fortran/25080] New: better diagnostic needed

[Bug fortran/25080] ICE/missing error on different ranks for dummy and actual arguments

[Bug fortran/25081] New: better diagnostic needed

[Bug fortran/25081] [4.1] Assumed length character function allowed

[Bug fortran/25082] New: better diagnostic needed

[Bug fortran/25083] New: better diagnostic needed

[Bug fortran/25083] better diagnostic needed

[Bug fortran/25084] New: better diagnostic needed

[Bug fortran/25084] Interface for assumed length character function allowed

[Bug fortran/25085] New: better diagnostic needed

[Bug fortran/25085] Array valued assumed length character function allowed

[Bug fortran/25086] New: better diagnostic needed

[Bug fortran/25086] Pointer valued assumed length character function allowed

[Bug fortran/25087] New: better diagnostic needed

[Bug fortran/25087] better diagnostic needed

[Bug fortran/25087] Error for missing explicit interface needed.

[Bug fortran/25088] New: better diagnostic needed

[Bug fortran/25088] Subroutine call to typed object allowed

[Bug fortran/25089] New: better diagnostic needed

[Bug fortran/25090] New: better diagnostic needed

[Bug fortran/25091] New: better diagnostic needed

[Bug fortran/25092] New: better diagnostic needed

[Bug fortran/25093] New: better diagnostic needed

[Bug fortran/25093] PUBLIC function of PRIVATE type

[Bug fortran/25094] New: better diagnostic needed

[Bug fortran/25094] Procedure with public generic identifier allowed to have argument of private type

[Bug fortran/25095] New: better diagnostic needed

[Bug fortran/25096] New: better diagnostic needed

[Bug fortran/25097] New: better diagnostic needed

[Bug fortran/25097] Component of optional argument allowed as arg. to PRESENT

[Bug fortran/25098] New: better diagnostic needed

[Bug fortran/25098] Variable as actual argument for procedure dummy argument allowed

[Bug fortran/25099] New: better diagnostic needed

[Bug fortran/25099] Conformance of arguments to ELEMENTAL subroutines

[Bug fortran/25100] New: better diagnostic needed

[Bug fortran/25100] better diagnostic needed

[Bug fortran/25101] New: better diagnostic needed

[Bug fortran/25101] better diagnostic needed

[Bug fortran/25101] Zero stride allowed in FORALL:s

[Bug fortran/25102] New: better diagnostic needed

[Bug fortran/25102] better diagnostic needed

[Bug fortran/25103] New: better diagnostic needed

[Bug fortran/25103] better diagnostic needed

[Bug fortran/25104] New: better diagnostic needed

[Bug fortran/25104] better diagnostic needed

[Bug fortran/25104] Non-initialization expr. as case-selector

[Bug fortran/25105] New: better diagnostic needed

[Bug fortran/25105] better diagnostic needed

[Bug fortran/25106] New: better diagnostic needed

[Bug fortran/25106] statement label is zero

[Bug fortran/25109] New: formatted reads with embedded blanks in input fields

[Bug fortran/25109] formatted reads with embedded blanks in input fields

[Bug fortran/25135] New: Interface name does not conflict with subroutine name

[Bug fortran/25135] Interface name does not conflict with subroutine name

[Bug fortran/25146] New: ICE on error diagnostics

[Bug fortran/25146] ICE on error diagnostics

[Bug fortran/25147] New: passing variable in place of function dummy argument not caught

[Bug fortran/25149] New: Compiler dies on -std=f95

[Bug fortran/25149] Compiler dies on -std=f95

[Bug fortran/25162] Issue with OpenMP COPYIN and gfortran

[Bug fortran/25171] New: FAIL: gfortran.dg/mixed_io_1.f90

[Bug fortran/25172] New: FAIL: gfortran.dg/module_equivalence_1.f90

[Bug fortran/25172] FAIL: gfortran.dg/module_equivalence_1.f90

[Bug fortran/25174] New: gfortran ignores explicit return type for functions

[Bug fortran/25178] New: installation of gfortran failed after deveral trys

[Bug gcov/profile/24487] [3.4/4.0 Regression] Basic block frequencies inaccurate

[Bug inline-asm/23200] [4.0/4.1 regression] rejects "i"(&var + 1)

[Bug inline-asm/24751] New: ARM : poor register allocation around inline assembler

[Bug inline-asm/24751] ARM : poor register allocation around inline assembler

[Bug inline-asm/24761] New: Missing register load before inline asm in templated function causes SIGSEGV

[Bug inline-asm/24761] Missing register load before inline asm in templated function causes SIGSEGV

[Bug java/1427] gcj should generate N_MAIN stab or DW_AT_entry_point dwarf2 debug info

[Bug java/15411] CNI: gcjh not aware of "miranda" methods

[Bug java/16439] gcj generates wrong line number for static function breakpoint

[Bug java/17352] Uninitialized char variable causes erratic behavior

[Bug java/18278] JNI functions cannot return a weak reference

[Bug java/18585] uniform passing of the classpath parameter

[Bug java/20495] [4.0/4.1 Regression] building gcj hangs on gcj-dbtool

[Bug java/20977] Invalid long to int promotion permitted in array initializer

[Bug java/21517] Bytecode -> native code mis-compilation

[Bug java/21856] null pointer check elimination

[Bug java/23617] Out of memory when classpath contains jar file with zip-style comment

[Bug java/24184] bytecode miscompilation of CORBA

[Bug java/24186] [3.4/4.0/4.1 Regression] interface and extends does not cause us to reject invalid code

[Bug java/24242] Redundant null pointer checks generated on refrerences returned by new operator.

[Bug java/24441] [4.1 regression] ICE's when building the ecj compiler 3.1.1

[Bug java/24572] [4.0 regression] ICE in gimplify_expr, at gimplify.c:3983

[Bug java/24652] New: [4.1 Regression] Segmentation fault while bytecompiling ecj

[Bug java/24652] [4.1 Regression] Segmentation fault while bytecompiling ecj

[Bug java/24698] New: [4.1 regression] Apparent problem getting non-.class files out of jars

[Bug java/24698] [4.1 regression] Apparent problem getting non-.class files out of jars

[Bug java/24698] [4.1/4.2 regression] Failure locating .properties files inside jars

[Bug java/24736] New: Gcjh method inlining violates weak semantics of mingw linker

[Bug java/24736] Gcjh method inlining violates weak semantics of mingw linker

[Bug java/24792] New: Inner interface's are not know inside package's

[Bug java/24792] Inner interface's are not know inside package's

[Bug java/24798] New: classmap.db should reside in /var/lib/gcj/

[Bug java/24825] New: Standard runtime methods that are known to not return null should not trigger null checks.

[Bug java/24825] Standard runtime methods that are known to not return null should not trigger null checks.

[Bug java/24835] New: gcj accepts invalid code with static final variables

[Bug java/24835] gcj accepts invalid code with static final variables

[Bug java/24938] New: gcj -C miscompiles gnu/CORBA/DynAn/gnuDynValue.java

[Bug java/24938] gcj -C miscompiles gnu/CORBA/DynAn/gnuDynValue.java

[Bug java/24980] New: GCJ/GIJ segfaults on Workout.java from Click and Hack's "Java Puzzlers"

[Bug java/24980] GCJ/GIJ segfaults on Workout.java from Click and Hack's "Java Puzzlers"

[Bug java/24999] New: [4.0.2 regression] symbol lookup failure

[Bug java/24999] [4.0.2 regression] symbol lookup failure

[Bug java/25001] New: dos equis

[Bug java/25001] dos equis

[Bug java/25021] New: Can't compile ant 1.6.5 to machine code

[Bug java/25021] Can't compile ant 1.6.5 to machine code

[Bug java/25032] New: GCC Java not compile

[Bug java/25032] GCC Java not compile

[Bug java/25040] New: gcjh generated .h files missing methods inherited from interfaces

[Bug java/25040] gcjh generated .h files missing methods inherited from interfaces

[Bug java/4822] Evaluation order of =

[Bug java/6388] Integer.MIN_VALUE == 0x80000000 optimized to false on powerpc

[Bug java/6519] Empty Strings cannot always be optimized away

[Bug java/6520] Mauve java.lang.Math.min compile failure

[Bug java/8544] Inner interface's are not know inside package's

[Bug libffi/12782] ffi.h #defines ffi_type_[us]long wrong on 32bit arches

[Bug libffi/21229] LibFFI can't handle Longs

[Bug libfortran/16339] Unformatted i/o on large arrays inefficient

[Bug libfortran/19303] Unformatted record header is 4-bytes on 32-bit targets

[Bug libfortran/19524] 5 times uninitialized var in libgfortran

[Bug libfortran/21303] "Positive width required in format string"

[Bug libfortran/21468] vectorizing libfortran

[Bug libfortran/21547] Unable to build libfortran library

[Bug libfortran/21820] Really, really, horrible IO performance

[Bug libfortran/21995] Problem using spread intrinsic

[Bug libfortran/22097] libgfortran build failure on mips-sgi-irix6.5

[Bug libfortran/22298] libgfortran init() constructor isn't called if executable is statically linked

[Bug libfortran/23138] [mingw32] real values are printed incorrectly

[Bug libfortran/23262] [mingw32] rewind truncates file

[Bug libfortran/23363] gfortran 30 x slower that g77 on random I/O

[Bug libfortran/23419] unformatted complex I/O with kind=10

[Bug libfortran/24174] real(10) array output broken

[Bug libfortran/24305] Complex(10) formatted IO is broken.

[Bug libfortran/24313] complex sqrt function does not return principal value

[Bug libfortran/24342] [4.1 regression] testsuite failure:gfortran.fortran-torture/execute/in-pack.f90 exe

[Bug libfortran/24432] [4.1 regression] Missing symbols

[Bug libfortran/24459] gfortran namelist problem

[Bug libfortran/24489] read_block wrong execution order

[Bug libfortran/24541] libgfortran.so in 4.1 is incompatible with 4.0

[Bug libfortran/24584] Segfault when reading empty string in namelist file

[Bug libfortran/24685] New: real(10) formatted input is broken for huge values

[Bug libfortran/24685] real(10) formatted input is broken for huge values

[Bug libfortran/24699] New: READ with T format specifier fails on end-of-record condition

[Bug libfortran/24699] READ with T format specifier fails on end-of-record condition

[Bug libfortran/24700] New: Bad write after backing up from end of file

[Bug libfortran/24700] Bad write after backing up from end of file

[Bug libfortran/24719] [4.1 Regression] Nonadvancing read does not read more than 1 line

[Bug libfortran/24785] New: X edit descriptor lost with ADVANCE="NO"

[Bug libfortran/24785] X edit descriptor lost with ADVANCE="NO"

[Bug libfortran/24787] New: [libfortran] SCAN is broken

[Bug libfortran/24787] [libfortran] SCAN is broken

[Bug libfortran/24794] New: problem with namelist input of character array

[Bug libfortran/24794] problem with namelist input of character array

[Bug libfortran/24796] New: end-of-record error when writing

[Bug libfortran/24796] end-of-record error when writing

[Bug libfortran/24892] New: ACCESS argument to the OPEN statement

[Bug libfortran/24892] ACCESS argument to the OPEN statement

[Bug libfortran/24902] New: COMPLEX_ASSIGN is wrong

[Bug libfortran/24902] COMPLEX_ASSIGN is wrong

[Bug libfortran/24903] New: dotprod should use conj?

[Bug libfortran/24903] dotprod should use conj?

[Bug libfortran/24909] New: libmatmul.a breaks darwin build

[Bug libfortran/24909] libmatmul.a breaks darwin build

[Bug libfortran/24918] New: GFORTRAN input and carriage returns

[Bug libfortran/24918] GFORTRAN input and carriage returns

[Bug libfortran/24919] New: GFORTRAN input and carriage returns

[Bug libfortran/24919] [4.0/4.1] CRLF support in libgfortran

[Bug libfortran/24919] CRLF support in libgfortran

[Bug libfortran/24919] GFORTRAN input and carriage returns

[Bug libfortran/24927] New: libfortran isn't parallel build safe

[Bug libfortran/24927] [regression] libfortran Makefile missing -I.

[Bug libfortran/24927] libfortran isn't parallel build safe

[Bug libfortran/24927] libfortran Makefile missing -I.

[Bug libfortran/24945] calling two open statements (same unit) without close fails

[Bug libfortran/24957] New: scan() fails sometimesk

[Bug libfortran/24957] scan() fails sometimesk

[Bug libfortran/24991] New: gfortran build fails with - error:gthr-default.h: No such file or directory

[Bug libfortran/24991] [4.1/4.2 Regression] gfortran build fails with - error:gthr-default.h: No such file or directory

[Bug libfortran/25017] New: sqrt, csqrt may give a wrong result if real part of compex argument is zero

Re: [Bug libfortran/25017] sqrt, csqrt may give a wrong result if real part of compex argument is zero

[Bug libfortran/25017] sqrt, csqrt may give a wrong result if real part of compex argument is zero

[Bug libfortran/25039] New: broken formatted I/O

[Bug libfortran/25039] broken formatted I/O

[Bug libfortran/25116] New: [regression wrt g77] A namelist read from an unnamed file should read from fort.n

Re: [Bug libfortran/25116] [regression wrt g77] namelist read from non-opened file

[Bug libfortran/25116] [regression wrt g77] namelist read from non-opened file

[Bug libfortran/25116] namelist read from non-opened file

[Bug libfortran/25132] New: collect2: ld terminated with signal 10 [Bus error], core dumped

[Bug libfortran/25132] [4.1/4.2 Regression] collect2: ld terminated with signal 10 [Bus error], core dumped

[Bug libfortran/25139] New: Fortran runtime error: Invalid argument

[Bug libfortran/25139] "Invalid argument" error on I/O

[Bug libfortran/25139] Fortran runtime error: Invalid argument

[Bug libfortran/25142] New: Segfault in unformatted_write for large records

[Bug libfortran/25142] Segfault in unformatted_write for large records

[Bug libgcj/1373] recursion stress test causes segmentation fault

[Bug libgcj/14358] Selection of default encoding is not sufficient with EUC-JP on FreeBSD

[Bug libgcj/15430] Cannot interrupt blocking I/O calls with close()

[Bug libgcj/20993] GCC/GCJ not creating proper symbols for inline native CNI code

[Bug libgcj/21326] seg fault in _Jv_Linker

[Bug libgcj/23292] libjava build fails with recent version of GNU Make

[Bug libgcj/23758] java::lang::ConcreteProcess::nativeSpawn unsafe

[Bug libgcj/23763] Runtime.getRuntime().exec() signalling

[Bug libgcj/24170] natFilePosix.cc seems to have a security problem

[Bug libgcj/24403] --enable-java-awt=qt fails to build

[Bug libgcj/24552] Encoding alias "EUC_JP" missing

[Bug libgcj/24587] libgcj should set gnu.classpath.version system property

[Bug libgcj/24616] New: linking BC-compiled classes: NoClassDefFoundErrors should be deferred

[Bug libgcj/24616] linking BC-compiled classes: NoClassDefFoundErrors should be deferred

[Bug libgcj/24637] New: static and non-static declarations of missing type do not pass the verifier

[Bug libgcj/24638] New: inconsistent use of Jv_FindClass causing too weak error condition

[Bug libgcj/24638] inconsistent use of Jv_FindClass causing too weak error condition

[Bug libgcj/24642] New: Failure to produce random values.

[Bug libgcj/24798] classmap.db should reside in /var/lib/gcj/

[Bug libgcj/24832] New: Modularization of Java libraries

[Bug libgcj/24832] Modularization of Java libraries

[Bug libgcj/24833] New: Variable declared as 'final' can be assigned in conflict with Java standard

[Bug libgcj/24833] Variable declared as 'final' can be assigned in conflict with Java standard

[Bug libgcj/24834] New: PersistentByteMap close() method is not catching Exception

[Bug libgcj/24834] PersistentByteMap close() method is not catching Exception

[Bug libgcj/24860] New: java.util.Calendar needs updating

[Bug libgcj/24940] New: libjava/configure uses $SED without defining it

[Bug libgcj/24940] libjava/configure uses $SED without defining it

[Bug libgcj/25016] New: Integer overflow in _Jv_CondWait

[Bug libgcj/25016] Integer overflow in _Jv_CondWait

[Bug libgcj/25026] New: -libXtst not detected [--enable-java-awt=gtk]

[Bug libgcj/25187] New: dereferencing type-punned pointer warnings while building libgcj

[Bug libgcj/25187] dereferencing type-punned pointer warnings while building libgcj

[Bug libgcj/9250] runtime should only use non-visible locks

[Bug libgomp/24682] New: Sample program at OpenMP web site fails with ICE

[Bug libgomp/24682] Sample program at OpenMP web site fails with ICE

[Bug libgomp/24703] New: Unable to compile OpenMP program with omp parallel for schedule(dynamic) directive

[Bug libgomp/24797] New: Segfault in libgomp.c/nested-1.c

[Bug libgomp/24797] Segfault in libgomp.c/nested-1.c

[Bug libgomp/25162] New: Issue with OpenMP COPYIN and gfortran

[Bug libmudflap/24619] New: mudflap instrumentation of dlopen is incorrect

[Bug libmudflap/24619] mudflap instrumentation of dlopen is incorrect

[Bug libmudflap/24865] compiling 64-bit gfortran

[Bug libmudflap/24865] libmudflap build problem

[Bug libobjc/19024] name collisions libobjc/libmysqlclient

[Bug libobjc/24714] objc/execute/bf-10.m and others fail on sh64-elf

[Bug libobjc/24775] New: libobjc should not include GCC's target headers

[Bug libobjc/24775] libobjc should not include GCC's target headers

[Bug libobjc/24829] New: libobjc testsuite failures

[Bug libobjc/24829] [4.1/4.2 Regression] libobjc testsuite failures

[Bug libstdc++/11953] _REENTRANT defined when compiling non-threaded code.

[Bug libstdc++/12854] libstdc++ vs. -Weffc++

[Bug libstdc++/1773] __cplusplus defined to 1, should be 199711L

[Bug libstdc++/18174] documentation example for std::priority_queue usage

[Bug libstdc++/19664] libstdc++ headers should have pop/push of the visibility around the declarations

[Bug libstdc++/19962] local dependencies permeated throughout other libraries instead of for $prefix/lib

[Bug libstdc++/20647] Wrong typeid for incomplete types

[Bug libstdc++/21072] base allocator change shared object issues

[Bug libstdc++/21251] Placement into shared memory

[Bug libstdc++/22203] std::numeric_limits<int>::traps is wrong on PPC

[Bug libstdc++/23425] vector::clear should be manually inlined

[Bug libstdc++/23497] [4.1 regression] Bogus 'is used uninitialized...' warning about std::complex<T>

[Bug libstdc++/23591] exceptions in plugins in threads cause segmentation violation by leaving bad exit handler for the pthread

[Bug libstdc++/23953] using stringstreams causes crashes with some locales

[Bug libstdc++/24347] Document boost_shared_ptr vs concurrency

[Bug libstdc++/24469] Possible race condition in mt_allocator causing SIGSEGV

[Bug libstdc++/24595] std::tr1::get_deleter not declared

[Bug libstdc++/24617] New: vector vs __erase_at_end

[Bug libstdc++/24617] vector vs __erase_at_end

[Bug libstdc++/24645] New: Commonize arithmetic inserters/extractors bodies

[Bug libstdc++/24645] Commonize arithmetic inserters/extractors bodies

[Bug libstdc++/24660] New: versioning weak symbols in libstdc++

[Bug libstdc++/24660] versioning weak symbols in libstdc++

[Bug libstdc++/24692] Atomic builtins for v3

[Bug libstdc++/24693] New: Deque improvements

[Bug libstdc++/24693] Deque improvements

[Bug libstdc++/24704] New: __gnu_cxx::__exchange_and_add is out of line and called even for single threaded applications using std::string

[Bug libstdc++/24704] [3.4/4.0/4.1 Regression] __gnu_cxx::__exchange_and_add is out of line and called even for single threaded applications using std::string

[Bug libstdc++/24704] [4.0/4.1 Regression] __gnu_cxx::__exchange_and_add is out of line and called even for single threaded applications using std::string

[Bug libstdc++/24704] __gnu_cxx::__exchange_and_add is called even for single threaded applications

[Bug libstdc++/24704] __gnu_cxx::__exchange_and_add is out of line and called even for single threaded applications using std::string

[Bug libstdc++/24712] New: Accidental ABI change between 4.0.1 and 4.0.2?

[Bug libstdc++/24712] [4.0 Regression] Accidental ABI change between 4.0.1 and 4.0.2?

[Bug libstdc++/24715] New: __exchange_and_add is called too much

[Bug libstdc++/24715] __exchange_and_add is called too much

[Bug libstdc++/24720] poorly named include guard in stl_tree.h

[Bug libstdc++/24799] New: std::tr1::hash missing inheritance

[Bug libstdc++/24799] std::tr1::hash missing inheritance

[Bug libstdc++/24800] New: std::mem_fn returns a function object that does not inherit from std::unary_function/binary_function

[Bug libstdc++/24800] std::mem_fn returns a function object that does not inherit from std::unary_function/binary_function

[Bug libstdc++/24800] tr1::mem_fn returns a function object that does not inherit from std::unary_function/binary_function

[Bug libstdc++/24803] New: reference_wrapper and pointers to member functions

[Bug libstdc++/24803] tr1::reference_wrapper and pointers to member functions

[Bug libstdc++/24805] New: No non-member swap for shared_ptr

[Bug libstdc++/24805] No non-member swap for shared_ptr

[Bug libstdc++/24808] New: is_object fails to compile with incomplete types

[Bug libstdc++/24808] is_object fails to compile with incomplete types

[Bug libstdc++/24809] New: is_polymorphic doesn't compile if the argument type has non-throwing destructor

[Bug libstdc++/24809] is_polymorphic doesn't compile if the argument type has non-throwing destructor

[Bug libstdc++/24818] New: tr1::reference_wrapper improperly calls nullary function objects

[Bug libstdc++/24818] tr1::reference_wrapper improperly calls nullary function objects

[Bug libstdc++/24881] New: Lazy facet instantiation

[Bug libstdc++/24882] New: [meta-bug] Non-refcounted, moveable basic_string

[Bug libstdc++/24882] [meta-bug] Non-refcounted, moveable basic_string

[Bug libstdc++/24970] Error in header file: ctime:69: error: ::tm has not been declared

[Bug libstdc++/24975] New: Aliasing problems inside libstdc++

[Bug libstdc++/24975] Aliasing problems inside libstdc++

[Bug libstdc++/25025] New: Failure to build, <command line>:1:2: error: missing '(' after predicate

[Bug libstdc++/25025] Failure to build, <command line>:1:2: error: missing '(' after predicate

[Bug libstdc++/25134] New: AIX 5.3 64bit - xgcc error: 1252-191 Only .llong should be used for relocatable expressions

[Bug libstdc++/25191] exception_defines.h #defines try/catch

[Bug libstdc++/4455] [HP-UX] libstdc++.sl depends on libgcc.a

[Bug libstdc++/5291] Bad reference to build directory in libstdc++.la

[Bug middle-end/11492] Unsigned char promoted to signed int in for loop test for gpp but not gcc

[Bug middle-end/16187] ARRAY_REF should be used for pointers also

[Bug middle-end/16315] Strange variable names for temporaries in warnings

[Bug middle-end/16458] PowerPC - redundant compare

[Bug middle-end/17886] variable rotate and long long rotate should be better optimized

[Bug middle-end/17965] ice in expand_call

[Bug middle-end/18071] [3.4/4.0/4.1 Regression] -Winline does not respect -fno-default-inline

[Bug middle-end/18908] Missed folding opportunities with bools

[Bug middle-end/18956] [3.4 only] [hppa] 'bus error' at runtime while passing a special struct to a C++ member function

[Bug middle-end/19207] Suggestion for speeding up data flow analysis

[Bug middle-end/19371] [3.4 Regression] Missing uninitialized warning with dead code (pure/const functions)

[Bug middle-end/20109] printf optimizations and non-ASCII character sets

[Bug middle-end/20219] Missed optimisation sin / tan --> cos

[Bug middle-end/20491] internal compiler error: in subreg_regno_offset, at rtlanal.c:3042

[Bug middle-end/20644] bogus uninitialized warning on unused variable

[Bug middle-end/20968] Spurious "may be used uninitialized" warning

[Bug middle-end/21059] Bogus warning about clobbered variable

[Bug middle-end/21309] [4.0/4.1/4.2 regression] internal compiler error: in expand_mult_const, at expmed.c:2884

[Bug middle-end/21733] filecmp.c:252: warning: #n1# may be used uninitialized in this function

[Bug middle-end/21750] GCC gives may be used uninitialized warning for a non-conditional initialised variable. (not a duplicate bug!)

[Bug middle-end/21939] [3.4 Regression] corrupted memory with deque of >63 items

[Bug middle-end/21957] IA-64 register stack is not preserved after getcontext call

[Bug middle-end/21988] GCC should transform printf("%s",foo) and printf("foo") into fputs(foo,stdout)

[Bug middle-end/22127] [3.4 Regression] register window not preserved after getcontext call

[Bug middle-end/22127] [3.4/4.0/4.1 Regression] register window not preserved after getcontext call

[Bug middle-end/22197] invalid "is" used uninitialized, should be "may be"

[Bug middle-end/22275] [3.4/4.0/4.1 Regression] bitfield layout change (regression?)

[Bug middle-end/22429] [4.1 Regression] -1073741824 <= n && n <= 1073741823 is true where n is 1073741824

[Bug middle-end/22561] [4.1/4.2 Regression] ACATS ca11c01 wrong code

[Bug middle-end/23150] 20050713-1.c fails on arm-none-eabi with -O2 or -Os.

[Bug middle-end/23155] [4.0/4.1 Regression] Gimplification failed for union cast

[Bug middle-end/23159] internal compiler error: in change_address_1, at emit-rtl.c:2022

[Bug middle-end/23181] [4.1 Regression] Slowdown of the bresenham line drawing by roughly 20%

[Bug middle-end/23195] [4.0 Regression] Using frexp with fabs produces negative result

[Bug middle-end/23294] fold does not fold a*C+a to a*(C+1) or a*C-a to a*(C-1)

[Bug middle-end/23295] fold does not simplify -a - (5) to (-5) - a

[Bug middle-end/23470] a*a (for floats) is not considered always postive (-ffast-math only)

[Bug middle-end/23497] [4.1 regression] Bogus 'is used uninitialized...' warning about std::complex<T>

[Bug middle-end/23518] some gcc optimizations do not take overflow into account with -fwrapv

[Bug middle-end/23606] fold does not fold (type)(a == b) into a == b (with type as the type)

[Bug middle-end/23666] Fold does not reduce C - ~a into a + (C+1)

[Bug middle-end/23669] fold does convert (-a)/10 into a/-10 with -fno-wrapv

[Bug middle-end/23673] fold does not fold (a^b) != 0 to a != b

[Bug middle-end/23785] [4.1 Regression] 197.parser performance drop

[Bug middle-end/24003] [4.1 Regression] 17 ACATS regressions (fixed point or decimal artihmetic)

[Bug middle-end/24150] [3.4 only]: HOT_TEXT_SECTION_NAME doesn't have the leading `.'

[Bug middle-end/24239] spurious warning about clobbered variables w.r.t. longjmp

[Bug middle-end/24279] SEGV at reload.c:2400 with -O2

[Bug middle-end/24342] [4.1 regression] testsuite failure:gfortran.fortran-torture/execute/in-pack.f90 exe

[Bug middle-end/24408] [4.1 Regression] Invariant code no longer removed from loop when doing FDO.

[Bug middle-end/24434] [4.0/4.1 Regression] get_varargs_alias_set returns 0 always

[Bug middle-end/24437] OBJ_TYPE_REF handling in fold_stmt should be moved to fold

[Bug middle-end/24462] [4.1 Regression] packed-aligned structures are laid out differently

[Bug middle-end/24514] [4.0/4.1 Regression] ICE on bootstrap

[Bug middle-end/24514] ICE on bootstrap

[Bug middle-end/24563] getting internal error

[Bug middle-end/24585] [3.4/4.0/4.1 Regression] spurious section conflict error while building linux kernel

[Bug middle-end/24589] [4.1 Regression] wrong code with zero sized structs on CONSTRUCTOR

[Bug middle-end/24601] ICE/segfault on valid code gcc-4.1-20051001

[Bug middle-end/24612] New: [gomp] Bogus "is used uninitialized" warning

[Bug middle-end/24612] [gomp] Bogus "is used uninitialized" warning

[Bug middle-end/24627] New: [4.1 Regression] xntp miscompiled

[Bug middle-end/24627] [4.1 Regression] xntp miscompiled

[Bug middle-end/24635] Wrong statement reordering

[Bug middle-end/24639] New: [meta-bug] bug to track all uninit variable issues

[Bug middle-end/24639] [meta-bug] bug to track all uninit variable issues

[Bug middle-end/24644] [4.1 Regression] gcc-4.1 compiled ppc64 kernels do not boot

[Bug middle-end/24691] attribute aligned is silently ignored or program is miscompiled

[Bug middle-end/24703] [GOMP] Unable to compile OpenMP program with omp parallel for schedule(dynamic) directive

[Bug middle-end/24716] [4.1 Regression] Wrong code generated when optimising

[Bug middle-end/24729] New: function calls created by builtins do not make use of inline definitions

[Bug middle-end/24729] function calls created by builtins do not make use of inline definitions

[Bug middle-end/24737] const bool& optimization error

[Bug middle-end/24750] New: [4.1 regression] global-alloc (reload) trips over own confusion for unexpected addressing modes

[Bug middle-end/24750] [4.1 regression] global-alloc (reload) trips over own confusion for unexpected addressing modes

[Bug middle-end/24770] [3.4 Regression] Incorrect "unreachable code" warning from 3.4.3 under specific conditions

[Bug middle-end/24776] New: [GOMP] non-TLS and thread private

[Bug middle-end/24776] [GOMP] non-TLS and thread private

[Bug middle-end/24804] [3.4 Regression] Produces wrong code

[Bug middle-end/24819] [4.1 Regression] glibc math tests miscompiled with gcc-4.1

[Bug middle-end/24820] New: [4.1 regression] SEGV in integer_valued_real_p at gcc/builtins.c:6711

[Bug middle-end/24820] [3.4/4.0/4.1 regression] SEGV in integer_valued_real_p at gcc/builtins.c:6711

[Bug middle-end/24820] [4.1 regression] SEGV in integer_valued_real_p at gcc/builtins.c:6711

[Bug middle-end/24827] New: FAIL: gcc.dg/attr-weakref-1.c

[Bug middle-end/24827] FAIL: gcc.dg/attr-weakref-1.c

[Bug middle-end/24851] [4.1 Regression] f2c miscompilation

[Bug middle-end/24853] New: scheduling takes 40% or more time

[Bug middle-end/24853] scheduling takes 40% or more time

[Bug middle-end/24900] [4.1 Regression] new "value computed is not used" warning in gcc 4.1

[Bug middle-end/24901] Misaligned data in fold_checksum_tree (--enable-checking=all)

[Bug middle-end/24912] [4.1, 4.2 Regression] m68k build failure: ICE: in reload_cse_simplify_operands

[Bug middle-end/24912] [4.1/4.2 Regression] m68k build failure: ICE: in reload_cse_simplify_operands

[Bug middle-end/24912] m68k build failure: ICE: in reload_cse_simplify_operands

[Bug middle-end/24929] New: long long shift/mask operations should be better optimized

[Bug middle-end/24929] long long shift/mask operations should be better optimized

[Bug middle-end/24932] New: GCC segfault's on strcmp in tree.c:annotate_with_file_line

[Bug middle-end/24932] GCC segfault's on strcmp in tree.c:annotate_with_file_line

[Bug middle-end/24947] -Os should maximize inlining --param values.

[Bug middle-end/24950] New: ICE in operand_subword_force

[Bug middle-end/24950] [3.4/4.0/4.1/4.2 Regression] ICE in operand_subword_force

[Bug middle-end/24950] ICE in operand_subword_force

[Bug middle-end/24952] New: ICE: RTL check: expected code 'set' or 'clobber', have 'unspec' in try_combine, at combine.c:2898

[Bug middle-end/24952] ICE: RTL check: expected code 'set' or 'clobber', have 'unspec' in try_combine, at combine.c:2898

[Bug middle-end/24968] wrong "will never be executed" warning

[Bug middle-end/24969] tmpdir-gcc.dg-struct-layout-1/t026 fails execution

[Bug middle-end/24989] New: boolvar != 1 is not converted to !boolvar

[Bug middle-end/24989] boolvar != 1 is not converted to !boolvar

[Bug middle-end/24990] New: fold should convert ~a == C to a == ~C where C is a constant

[Bug middle-end/24990] fold should convert ~a != C to a != ~C where C is a constant

[Bug middle-end/24990] fold should convert ~a == C to a == ~C where C is a constant

[Bug middle-end/24997] [4.1/4.2 regression] ICE with -ftree-vectorize

Re: [Bug middle-end/24998] [4.2 Regression] Build failure on sparc-sun-solaris2.9/arm: undefined symbol __floatunsitf

[Bug middle-end/24998] [4.2 Regression] Build failure on sparc-sun-solaris2.9/arm: undefined symbol __floatunsitf

[Bug middle-end/25022] New: [4.2,4.1,4.0,3.4 regression] failure to transform the unlocked stdio calls

[Bug middle-end/25022] [3.4/4.0 regression] failure to transform the unlocked stdio calls

[Bug middle-end/25022] [3.4/4.0/4.1/4.2 regression] failure to transform the unlocked stdio calls

[Bug middle-end/25022] [4.2,4.1,4.0,3.4 regression] failure to transform the unlocked stdio calls

[Bug middle-end/25023] New: [4.1/4.2 Regression] ICE in def_cfa_1, at dwarf2out.c:792

[Bug middle-end/25023] [4.1/4.2 Regression] ICE in def_cfa_1, at dwarf2out.c:792

[Bug middle-end/25027] New: libgcov.c:652: ICE: in default_secondary_reload, at targhooks.c:529

[Bug middle-end/25027] [4.2 Regression] libgcov.c:652: ICE: in default_secondary_reload, at targhooks.c:529

[Bug middle-end/25120] New: [3.4/4.0/4.1/4.2] builtin printf/fprintf is confused by -fexec-charset

[Bug middle-end/25120] [3.4/4.0/4.1/4.2] builtin printf/fprintf is confused by -fexec-charset

[Bug middle-end/25120] builtin *printf handlers are confused by -fexec-charset

[Bug middle-end/25120] builtin printf/fprintf is confused by -fexec-charset

[Bug middle-end/25125] [4.1/4.2 Regression] (short) ((int)(unsigned short) + (int)) is done in the wrong type

[Bug middle-end/25140] New: aliases, including weakref, break alias analysis

[Bug middle-end/25140] aliases, including weakref, break alias analysis

[Bug middle-end/25158] New: FAIL: gcc.c-torture/execute/builtins/fprintf.c compilation

[Bug middle-end/25158] FAIL: gcc.c-torture/execute/builtins/fprintf.c compilation

[Bug middle-end/25159] New: FAIL: gcc.c-torture/execute/builtins/fputs.c execution

[Bug middle-end/25181] [3.4 Regression] wrong "will never be executed" warning in switch - case block

[Bug middle-end/25184] New: another wrong "will never be executed" warning with switch - case

[Bug middle-end/25184] [3.4 Regression] another wrong "will never be executed" warning with switch - case

[Bug middle-end/25186] New: (short)(((int)short_var) <<1) should be done in short

[Bug middle-end/25186] (short)(((int)short_var) <<1) should be done in short

[Bug middle-end/8081] ICE with variably sized types and nested functions

[Bug objc/24777] New: objc needs to use normal builtins for functions it declares

[Bug objc/24777] objc needs to use normal builtins for functions it declares

[Bug objc/24867] New: many N^2 loops in objc frontend

[Bug objc/24867] many N^2 loops in objc frontend

[Bug objc/24868] New: objc-act.c builds non-type-safe structure

[Bug objc/24868] objc-act.c builds non-type-safe structure

[Bug objc/7098] ObjC front end doesn't understand attributes on method parameters

[Bug other/14251] Use POSIX-compatible flags for 'head' and 'tail'

[Bug other/19266] [mudflap] ICE when compiling with -fmudflap -O

[Bug other/22313] [4.1 Regression] gcc HEAD as of 2005/07/05 fails to profiledbootstrap without -g

[Bug other/22313] [4.1/4.2 Regression] gcc HEAD as of 2005/07/05 fails to profiledbootstrap without -g

[Bug other/23416] Problem compiling gcc 4.0.1

[Bug other/24692] New: Atomic builtins for v3

[Bug other/24692] Atomic builtins for v3

[Bug other/24724] _Unwind_Backtrace() calls malloc

[Bug other/24757] New: __sync_fetch_and_add on ia64

[Bug other/24757] __sync_fetch_and_add on ia64

[Bug other/24829] [4.1 Regression] libobjc testsuite failures

[Bug other/24829] [4.1/4.2 Regression] libobjc testsuite failures

[Bug other/24829] libobjc testsuite failures

[Bug other/24845] New: [gomp] make "-fopenmp" imply "-lgomp" when linking

[Bug other/24845] [gomp] make "-fopenmp" imply "-lgomp" when linking

[Bug other/24870] New: make check fails for fixincl

[Bug other/24870] make check fails for fixincl

[Bug other/24901] New: Misaligned data in fold_checksum_tree (--enable-checking=all)

[Bug other/24970] Error in header file: ctime:69: error: ::tm has not been declared

[Bug other/25004] New: elfutils misscompilation (testuite failure).

[Bug other/25004] elfutils misscompilation (testuite failure).

[Bug other/25009] [4.2 Regression] Bootstrap: Failure to build doc/gcc.info

[Bug other/25028] New: TImode-to-floating conversions broken

[Bug other/25028] TImode-to-floating conversions broken

[Bug other/25035] Building an avr cross compiler fails

[Bug other/25121] New: libgcj misscompilation?

[Bug other/25121] libgcj misscompilation?

[Bug other/25131] New: genpreds.c doesn't correctly mark predicates as special

[Bug other/25131] genpreds.c doesn't correctly mark predicates as special

[Bug other/25157] New: /libdecnumber/decContext.h:43:49: stdint.h: No such file or directory

[Bug other/25157] [4.2 Regression] /libdecnumber/decContext.h:43:49: stdint.h: No such file or directory

[Bug other/25180] New: ICE during kernel build.

[Bug other/25180] ICE during kernel build.

[Bug other/2678] gcc/g++ should stick compilation options into the .o file

[Bug other/4372] #pragma weak pthread* inclusion causes applications to crash without a linker error when one forgets to link with -lpthread

[Bug pending/25118] New: PPC/-O2 bug causes segfault, -O1 works fine

[Bug pending/25118] PPC/-O2 bug causes segfault, -O1 works fine

[Bug preprocessor/14331] please add option to suppress warning message "no newline at end of file"

[Bug preprocessor/15220] [3.4 regression] "gcc -E -MM -MG" reports missing system headers in source directory

[Bug preprocessor/15772] "Permission denied" compiling glibc 2.3.3 on reiser4: EACCES fatal to #include

[Bug preprocessor/15772] Preprocessing fails if an inaccessible directory is on include path

[Bug preprocessor/215] Problem when generating depencies with -MD and -MMD

[Bug preprocessor/22042] [3.4/4.0/4.1 Regression] stringification BUG

[Bug preprocessor/23479] Implement binary constants with a "0b" prefix

[Bug preprocessor/23751] cpp -P emits two newlines

[Bug preprocessor/24202] [3.4 Regression] Segfault with #pragma once

[Bug preprocessor/24202] [3.4/4.0/4.1 Regression] Segfault with #pragma once

[Bug preprocessor/24732] New: Invalid location of depency files generated with -MD and -MMD

[Bug preprocessor/24916] New: option -O undocumented in cpp docs

[Bug preprocessor/24976] [3.4/4.0/4.1/4.2 Regression] simple hexadecimal number and plus/minus and no space

[Bug preprocessor/24976] simple hexadecimal number parsed as C99 hex float

[Bug preprocessor/25011] gcc exits with core

[Bug preprocessor/25033] New: cpp prepends 2 extraneous empty lines when run with -P

[Bug preprocessor/25033] cpp prepends 2 extraneous empty lines when run with -P

[Bug preprocessor/7976] pasting xxx and xxx does not give a valid preprocessing token

[Bug regression/24662] New: gcc unable to bootstrap and build as 64 bit binary

[Bug regression/24662] gcc unable to bootstrap and build as 64 bit binary

[Bug regression/24709] New: 4.1.0 HEAD crashes with enable-checking on huge switch statement

[Bug regression/24709] 4.1.0 HEAD crashes with enable-checking on huge switch statement

[Bug regression/24819] New: glibc math tests miscompiled with gcc-4.1

[Bug regression/24819] glibc math tests miscompiled with gcc-4.1

[Bug regression/24956] New: Optimizer and uninitialised variables.

[Bug regression/24956] Optimizer and uninitialised variables.

[Bug regression/24978] New: ICE in gfc_assign_data_value_range

[Bug regression/25133] New: gcc-3.4 wrong code for conditionals on arm

[Bug rtl-optimization/15439] ICE with -fschedule-insns2 -fsched2-use-traces

[Bug rtl-optimization/16456] PowerPC - redundant subtract involving pointer types

[Bug rtl-optimization/16702] [3.4 regression] ICE (segfault) when compiling qemu with -O on x86_64 with gcc 3.4

[Bug rtl-optimization/16796] PowerPC - Unnecessary Floating Point Register Copy

[Bug rtl-optimization/16803] PowerPC - invariant code motion could be removed from loop.

[Bug rtl-optimization/19097] [3.4/4.0/4.1 regression] Quadratic behavior with many sets for the same register in gcse CPROP

[Bug rtl-optimization/20211] autoincrement generation is poor

[Bug rtl-optimization/20583] [4.0 regression] ICE in output_operand: invalid expression as operand

[Bug rtl-optimization/20586] bootstrap comparision fails with -funroll-loops.

[Bug rtl-optimization/20800] [4.0 regression] cris-elf testsuite failure: gcc.c-torture/execute/931004-6.c -O3

[Bug rtl-optimization/22002] [4.0 Regression] internal consistency failure with -funroll-loops

[Bug rtl-optimization/22469] [4.1 regression] testsuite failure, gcc.c-torture/compile/941014-2.c -O3 loops

[Bug rtl-optimization/22509] [4.1 regression] elemental.f90 testsuite failure (-fweb)

[Bug rtl-optimization/22563] [3.4/4.0/4.1 Regression] performance regression for gcc newer than 2.95

[Bug rtl-optimization/23392] [4.1 Regression] foward-1.m fails with -funroll-loops -O3 -fgnu-runtime

[Bug rtl-optimization/23453] [4.0/4.1 regression] miscompilation of PARI/GP on x86 with gcse after reload

[Bug rtl-optimization/23490] [3.4/4.0 Regression] Long compile time for array initializer with inlined constructor

[Bug rtl-optimization/23490] [3.4/4.0/4.1 Regression] Long compile time for array initializer with inlined constructor

[Bug rtl-optimization/23523] peephole2 causes code size on i686

[Bug rtl-optimization/23567] [3.4/4.0/4.1 regression] if-conversion causes wrong code

[Bug rtl-optimization/23585] [4.0 regression] mem_fun* code fine with -O1, bus error with -O2

[Bug rtl-optimization/23726] Missed optimizations for divmod

[Bug rtl-optimization/23837] [4.0/4.1 regression] Wrong code with -fschedule-insns

[Bug rtl-optimization/24034] [4.1 regression] Regrename: Inconsistency Failure

[Bug rtl-optimization/24160] [4.1 Regression] ICE with -O1 -ftree-vectorize -msse

[Bug rtl-optimization/24257] [4.1 Regression] ICE: in extract_insn with -O -fgcse -fgcse-sm

[Bug rtl-optimization/24319] [3.4/4.0/4.1 regression] amd64 register spill error with -fschedule-insns

[Bug rtl-optimization/24408] [4.1 Regression] Invariant code no longer removed from loop when doing FDO.

[Bug rtl-optimization/24497] [3.4/4.0 Regression] internal compiler error: in apply_opt_in_copies, at loop-unroll.c:2122

[Bug rtl-optimization/24497] [3.4/4.0/4.1 Regression] internal compiler error: in apply_opt_in_copies, at loop-unroll.c:2122

[Bug rtl-optimization/24626] [4.1 Regression] internal compiler error: verify_flow_info failed

[Bug rtl-optimization/24683] [3.4/4.0/4.1 Regression] ICE in in extract_insn, at recog.c:2084

[Bug rtl-optimization/24683] [4.0/4.1 Regression] ICE in in extract_insn, at recog.c:2084

[Bug rtl-optimization/24683] [4.1 Regression] ICE in in extract_insn, at recog.c:2084

[Bug rtl-optimization/24713] New: objc/execute/exceptions/foward-1.m fails on sh-elf with -O3

[Bug rtl-optimization/24760] New: -d option changes generated code

[Bug rtl-optimization/24760] -d option changes generated code

[Bug rtl-optimization/24762] New: [killloop-branch] code motion of non-invariant expressions with hard registers.

[Bug rtl-optimization/24762] [killloop-branch] code motion of non-invariant expressions with hard registers.

Re: [Bug rtl-optimization/24762] [killloop-branch] code motion ofnon-invariant expressions with hard registers.

[Bug rtl-optimization/24810] New: mov + mov + testl generated instead of testb

[Bug rtl-optimization/24810] [4.1 Regression] mov + mov + testl generated instead of testb

[Bug rtl-optimization/24810] mov + mov + testl generated instead of testb

[Bug rtl-optimization/24812] New: Optimizer creates infinite loop with -fno-strict-aliasing

[Bug rtl-optimization/24812] Optimizer creates infinite loop with -fno-strict-aliasing

[Bug rtl-optimization/24814] New: unrolling doesn't put loop notes in right place

[Bug rtl-optimization/24814] unrolling doesn't put loop notes in right place

[Bug rtl-optimization/24815] New: loop unrolling ends up with too much reg+index addressing

[Bug rtl-optimization/24815] loop unrolling ends up with too much reg+index addressing

[Bug rtl-optimization/24823] New: [4.1 Regression] ICE

[Bug rtl-optimization/24823] [4.1 Regression] ICE

[Bug rtl-optimization/24823] [4.1 Regression] ICE in insert_save, at caller-save.c:719

[Bug rtl-optimization/24823] [4.1/4.2 Regression] ICE in insert_save, at caller-save.c:719

[Bug rtl-optimization/24883] New: [4.1 Regression] fatal error: internal consistency failure building xorg-x11

[Bug rtl-optimization/24883] [4.1 Regression] fatal error: internal consistency failure building xorg-x11

[Bug rtl-optimization/24883] [4.1/4.2 Regression] fatal error: internal consistency failure building xorg-x11

[Bug rtl-optimization/24899] [4.1 Regression] loop.c miscompiles libgnomecanvas

[Bug rtl-optimization/24899] [4.1 Regression] Miscompiles libgnomecanvas

[Bug rtl-optimization/24899] [4.1/4.2 Regression] loop.c miscompiles libgnomecanvas

[Bug rtl-optimization/24899] loop.c miscompiles libgnomecanvas

[Bug rtl-optimization/24912] New: m68k build failure: ICE: in reload_cse_simplify_operands

[Bug rtl-optimization/24912] m68k build failure: ICE: in reload_cse_simplify_operands

[Bug rtl-optimization/24922] New: gcc -O2 removes important instruction for ASM

[Bug rtl-optimization/24922] gcc -O2 removes important instruction for ASM

[Bug rtl-optimization/24930] New: Crash in combine

[Bug rtl-optimization/24930] [4.0/4.1 Regression] Crash in combine

[Bug rtl-optimization/24930] [4.0/4.1/4.2 Regression] Crash in combine

[Bug rtl-optimization/24930] Crash in combine

[Bug rtl-optimization/24982] [4.1/4.2 Regression] Bootstrap failure with ICE in refers_to_regno_for_reload_p

[Bug rtl-optimization/24995] New: [4.1/4.2 Regression] gcc.dg/vect/vect-10.c fails on x86_64 with -m32

[Bug rtl-optimization/24995] [4.1/4.2 Regression] gcc.dg/vect/vect-10.c fails for -march=athlon

[Bug rtl-optimization/24995] [4.1/4.2 Regression] gcc.dg/vect/vect-10.c fails on x86_64 with -m32

[Bug rtl-optimization/25115] [4.2 Regression] Segmentation fault in pre_insert_copy_insn

[Bug rtl-optimization/25130] New: 4.1: miscompilation in loop optimization

[Bug rtl-optimization/25130] [4.1/4.2 Regression] miscompilation in GCSE

[Bug rtl-optimization/25133] [3.4 regression] wrong code for conditionals on arm

[Bug rtl-optimization/323] optimized code gives strange floating point results

[Bug rtl-optimization/4570] error reading bytes from double variable

[Bug rtl-optimization/6891] G++ generates incorrect code when -Os is used

[Bug rtl-optimization/6985] GCC-3.x incorrectly initializes local arrays

[Bug rtl-optimization/7061] Access of bytes in struct parameters

[Bug rtl-optimization/7061] Alpha: Access of bytes in struct parameters

[Bug rtl-optimization/7632] gcc 3.2 for PowerPC: instruction scheduling ignores dependency in variable asignments

[Bug rtl-optimization/8175] different behaviour with different optimization levels

[Bug rtl-optimization/8302] Pointer casting causes ++ to be ignored when optimizing

[Bug target/11026] [Darwin] g++ does not instantiate static data members of templates

[Bug target/14330] using -O3 causes a core whereas -O2 and under work

[Bug target/14532] [3.4 Regression] s390x internal compiler error: output_operand: Cannot decompose address.

[Bug target/14552] compiled trivial vector intrinsic code is inefficient

[Bug target/14552] compiled trivial vector intrinsic code is ineffiencent

[Bug target/15231] [3.4 only] constant pool entries referring to nonexistent labels

[Bug target/15535] [3.4 regression][sh-linux] ICE with -m4 -O2

[Bug target/15914] [3.4 only] gcc-3_4-branch ICE on Linux kernel

[Bug target/16185] ICE: in spill_failure, at reload1.c:1892, global registers and long long

[Bug target/16314] EP9312 gcc: undefined reference to __divdf3

[Bug target/16660] attribute((aligned)) doesn't work for variables on the stack

[Bug target/16798] PowerPC - Opportunity to use recording form instruction.

[Bug target/17108] Missed opportunity for strength reduction

[Bug target/17593] Over Aggressive Speculative Code Motion

[Bug target/17828] -O2 -fPIC doesn't work with switches in linkonce functions and new binutils

[Bug target/18339] testsuite failure: gcc.dg/bitfld-3.c

[Bug target/18603] [3.4 only] local label names can collide with function names

[Bug target/18900] ppc optimization non removable

[Bug target/19061] IA64 GCC pointer confusion results in optimization error

[Bug target/19161] No emms or femms emitted between MMX and FP instructions

[Bug target/19201] [m68k] Inefficient code for array accesses (from old PROBLEMS)

[Bug target/19226] [3.4 only] ICE in g++.old-deja/g++.pt/asm1.C and asm2.C with -fpic/-fPIC

[Bug target/19226] ICE in g++.old-deja/g++.pt/asm1.C and asm2.C with -fpic/-fPIC

[Bug target/19227] [3.4 only] Error in gcc.c-torture/compile/20000804-1.c when using -fpic/-fPIC on i686-pc-linux-gnu

[Bug target/19228] [3.4 only] Error in gcc.dg/20011119-1.c when using -fpic/-fPIC

[Bug target/19232] Failure in gcc.dg/assign-warn-3.c on i686-pc-linux-gnu with -fpic/-fPIC

[Bug target/19340] Compilation SEGFAULTs with -O1 -fschedule-insns2 -fsched2-use-traces on an x86 architecture.

[Bug target/19421] [4.0/4.1 regression] ICE with soft-float on m68k

[Bug target/19421] [4.0/4.1/4.2 regression] ICE with soft-float on m68k

[Bug target/19520] protected function pointer doesn't work right

[Bug target/19653] x87 reg allocated for constants for -mfpmath=sse

[Bug target/19672] [3.4 Regression] Performance regression in simple loop code

[Bug target/19672] [3.4] Performance regression in simple loop code

[Bug target/19923] [4.0/4.1 Regression] openssl is slower when compiled with gcc 4.0 than 3.3

[Bug target/20010] *arm_extendqisi appears to never be matched

[Bug target/20583] [4.0/4.1 regression] ICE in output_operand: invalid expression as operand

[Bug target/20583] [4.0/4.1/4.2 regression] ICE in output_operand: invalid expression as operand

[Bug target/20801] [4.0 regression] mmix-knuth-mmixware testsuite failure: gcc.c-torture/execute/950612-1.c compilation -O3

[Bug target/21041] [4.0/4.1 Regression] ICE: output_operand: Cannot decompose address

[Bug target/21098] .note.GNU-stack emitted

[Bug target/21518] [4.0/4.1 Regression] unable to find a register with -fPIC and -O2 and non inlining static function

[Bug target/21578] ICE in reload_cse_simplify_operands for Coldfire.

[Bug target/21590] [3.4 only] FAIL: gcc.dg/sibcall-1.c and FAIL: gcc.dg/sibcall-2.c

[Bug target/21623] [4.0/4.1/4.2 regression] ICE in reload_cse_simplify_operands, at postreload.c:391

[Bug target/21715] [4.0/4.1 regression] code-generation performance regression

[Bug target/22082] Can't link 64-bit shared libraries with Xcode 2.1

[Bug target/22119] nonlocal goto's fail on i?86-darwin

[Bug target/22209] [4.1 regression] libgfortran unresolvable symbols on irix6.5

[Bug target/22331] internal compiler error: in arm_print_operand, at config/arm/arm.c:9869

[Bug target/22432] [4.0/4.1 Regression] Wrong code generation using MMX intrinsics on amd64

[Bug target/22539] Internal compiler error with maximum sized array

[Bug target/22553] [4.1 regression] ICE building libstdc++

[Bug target/23070] [3.4 only] CALL_V4_CLEAR_FP_ARGS flag not properly set

[Bug target/23153] [4.1 Regression] [meta-bug] code size regression from 4.0 on x86

[Bug target/23231] cross compiling fails for mips-sgi-irix6.5

[Bug target/23303] [4.1 Regression] 4.1 generates sall + addl instead of leal

[Bug target/23356] FLT_EVAL_METHOD not defined on openbsd3.4

[Bug target/23378] [4.1 Regression] code quality regression for complicated loop

[Bug target/23424] cris.md rtl canonicalization bug

[Bug target/23435] [4.1 Regression] Unrecognizable insn (in extract_insn, at recog.c)

[Bug target/23435] [4.1/4.2 Regression] Unrecognizable insn (in extract_insn, at recog.c)

[Bug target/23488] [4.1 Regression] GCSE load PRE does not work with non sets

[Bug target/23524] [4.1 Regression]bigger version of mov + cmp produced

[Bug target/23605] memset() Optimization on x86-32 bit

[Bug target/23648] Spurious uninitialized variable warnings at -O1 and higher

[Bug target/23695] [ColdFire] Illegal move of byte intoo address register causes compiler to ICE

[Bug target/23704] gcc.dg/rs6000-fpint.c fails

[Bug target/23731] [4.1 regression] [hppa] 475 test failures in libjava

[Bug target/23775] [4.1 Regression] wrong code in argument passing

[Bug target/24178] [4.0/4.1 regression] generates code that produces unaligned access exceptions

[Bug target/24188] [4.1 Regression] WRITE(6,*) causes an ICE with -mcmodel=medium

[Bug target/24230] [4.1 Regression] ICE in extract_insn with altivec

[Bug target/24265] [4.1 Regression] ICE: in extract_insn, at recog.c:2084 with -O -fgcse -fmove-loop-invariants -mtune=pentiumpro

[Bug target/24315] [3.4 Regression] amd64 fails -fpeephole2

[Bug target/24315] [3.4/4.0 Regression] amd64 fails -fpeephole2

[Bug target/24323] _MM_TRANSPOSE4_PS could be improved

[Bug target/24348] [4.1 regression] bootstrap failure building libgcc

[Bug target/24374] [4.0/4.1 Regression] Sibcalling optimization is happening in main

[Bug target/24378] [4.1 Regression] gcc.dg/vect/pr24300.c (test for excess errors) fails

[Bug target/24428] [4.1 regression] TLS miscompilation on x86_64

[Bug target/24436] (subreg:V4SF (reg:SF) 0) should be invalid RTL, happens for -mfp-math=sse

[Bug target/24445] "unable to find a register to spill in class 'R0_REGS"

[Bug target/24445] [4.1 Regression] "unable to find a register to spill in class 'R0_REGS"

[Bug target/24466] uprgading of gcc

[Bug target/24475] gcc.dg/tls/pr24428.c execution test and gcc.dg/tls/pr24428-2.c execution test fail on IA32

[Bug target/24476] [4.1/4.2 Regression] gcc.dg/tls/pr24428.c execution test and gcc.dg/tls/pr24428-2.c execution test fail on IA64

[Bug target/24600] [4.1 Regression] unrecognizable instruction

[Bug target/24603] Build crashes while compiling regex.c

[Bug target/24610] New: The comment start symbol of arm target

[Bug target/24610] The comment start symbol of arm target

[Bug target/24615] New: internal compiler error: in print_shift_count_operand, at config/s390/s390.c:4025

[Bug target/24615] [4.1 Regression] internal compiler error: in print_shift_count_operand, at config/s390/s390.c:4025

[Bug target/24615] internal compiler error: in print_shift_count_operand, at config/s390/s390.c:4025

[Bug target/24620] New: [4.1 Regression] internal compiler error: in find_reloads, at reload.c:3730

[Bug target/24620] [4.1 Regression] internal compiler error: in find_reloads, at reload.c:3730

[Bug target/24621] New: [4.1 Regression] internal compiler error: in reload_cse_simplify_operands, at postreload.c:393

[Bug target/24621] [4.1 Regression] internal compiler error: in reload_cse_simplify_operands, at postreload.c:393

[Bug target/24623] New: [4.1 Regression] internal compiler error: in propagate_one_insn, at flow.c:1702

[Bug target/24623] [4.1 Regression] internal compiler error: in propagate_one_insn, at flow.c:1702

[Bug target/24624] New: [4.1 Regression] internal compiler error: in reload, at reload1.c:1071

[Bug target/24624] [4.1 Regression] internal compiler error: in reload, at reload1.c:1071

[Bug target/24626] New: internal compiler error: verify_flow_info failed

[Bug target/24626] [4.1 Regression] internal compiler error: verify_flow_info failed

[Bug target/24626] internal compiler error: verify_flow_info failed

[Bug target/24647] New: two copies of a constant in two different registers

[Bug target/24661] unable to find a register to spill in class NO_REGS on ia64

[Bug target/24672] New: ICE on missing parentheses for constructor

[Bug target/24672] ICE on missing parentheses for constructor

[Bug target/24675] Stack corruption in ARM arch. if 64bit variable is passed to a function of which the low 32 use the register and the up 32 use the stack

[Bug target/24683] New: [4.1 Regression] ICE in in extract_insn, at recog.c:2084

[Bug target/24683] [4.1 Regression] ICE in in extract_insn, at recog.c:2084

[Bug target/24714] New: objc/execute/bf-10.m and others fail on sh64-elf

[Bug target/24718] Shared libgcc not used for linking by default

[Bug target/24738] New: [4.0]: Message typos in i386 backend

[Bug target/24738] [4.0 only]: help message typos in i386 backend

[Bug target/24743] NaN or correct result after divrp with 3 FPU registers

[Bug target/24753] FreeBSD make buildworld failure

[Bug target/24757] [4.1 Regression] __sync_fetch_and_add on ia64

[Bug target/24757] __sync_fetch_and_add on ia64

[Bug target/24764] New: TARGET_MEMORY_MISMATCH_STALL is never used

[Bug target/24764] TARGET_MEMORY_MISMATCH_STALL is never used

[Bug target/24765] New: TARGET_USE_BIT_TEST is never used

[Bug target/24765] TARGET_USE_BIT_TEST is never used

[Bug target/24766] New: Unused TARGET_DECOMPOSE_LEA

[Bug target/24766] Unused TARGET_DECOMPOSE_LEA

[Bug target/24772] New: Lots of ICEs in vrsave_operation_1 while running the testsuite on powerpc

[Bug target/24772] [4.1 Regression] Lots of ICEs in vrsave_operation_1 while running the testsuite on powerpc

[Bug target/24772] Lots of ICEs in vrsave_operation_1 while running the testsuite on powerpc

[Bug target/24778] [4.1 Regression] Assembler errors during bootstrap

[Bug target/24778] Assembler errors during bootstrap

[Bug target/24779] New: Python miscompilation - TOC reload

[Bug target/24779] [4.0 Regression] Python miscompilation - TOC reload

[Bug target/24779] Python miscompilation - TOC reload

[Bug target/24788] getting complier error:Internal compiler error in ix86_attr_length_immediate_default

[Bug target/24826] New: Incorrect default options

[Bug target/24826] [4.1 Regression] Incorrect default options

[Bug target/24831] New: [4.1 regression] gthr-dce.h:77: error: expected expression before '{' token

[Bug target/24831] [4.1 regression] gthr-dce.h:77: error: expected expression before '{' token

[Bug target/24831] [4.1/4.2 regression] gthr-dce.h:77: error: expected expression before '{' token

[Bug target/24837] New: move dynamic linker names out of LINK_SPEC and into new DYNAMIC_LINKER

[Bug target/24837] move dynamic linker names out of LINK_SPEC and into new DYNAMIC_LINKER

[Bug target/24838] New: g++.dg/tls/static-1.C execution test fails

[Bug target/24842] New: testsuite failure: gcc.dg/attr-weakref-1.c execution test

[Bug target/24842] testsuite failure: gcc.dg/attr-weakref-1.c execution test

[Bug target/24850] New: [4.1 regression] bootstrap failure on m68k-linux

[Bug target/24850] [4.1 regression] bootstrap failure on m68k-linux

[Bug target/24856] call to setlocale doesn't return expected value

[Bug target/24861] internal compiler error when building gcc with --with-cpu=ep9312 --with-fpu=maverick

[Bug target/24869] New: [4.1 regression] testsuite failure: gfortran.dg/func_derived_1.f90 -O3 unroll-loops

[Bug target/24869] [4.1 regression] testsuite failure: gfortran.dg/func_derived_1.f90 -O3 unroll-loops

[Bug target/24879] New: SSE3 intrinsic bug

[Bug target/24879] SSE3 intrinsic bug

[Bug target/24879] SSE3 monitor intrinsic doesn't work in 64bit

[Bug target/24894] ICE building newlib/libc/misc/init.c

[Bug target/24910] New: CONST (PLUS a + 4) is not done for -fPIC or -mdynamic-no-pic

[Bug target/24910] CONST (PLUS a + 4) is not done for -fPIC or -mdynamic-no-pic

[Bug target/24913] New: undocumented new CPU upgrade by -mpowerpc-gpopt overrides user-selected -mcpu= setting

[Bug target/24913] undocumented new CPU upgrade by -mpowerpc-gpopt overrides user-selected -mcpu= setting

[Bug target/24914] gcc fails when built with --with-cpu=ep9312 --with-fpu=maverick

[Bug target/24934] New: profilebootstrap failure with debugging disabled

[Bug target/24934] [4.1 Regression] profilebootstrap failure

[Bug target/24934] [4.1 Regression] profilebootstrap failure with debugging disabled

[Bug target/24934] [4.1/4.2 Regression] profilebootstrap failure

[Bug target/24934] profilebootstrap failure with debugging disabled

[Bug target/24949] New: FAIL: gcc.c-torture/compile/20000403-2.c -O0

[Bug target/24951] New: ICE: RTL check: expected code 'const_int', have 'const_double' in output_vec_const_move, at config/rs6000/rs6000.c

[Bug target/24951] [4.1/4.2 Regression] ICE: RTL check: expected code 'const_int', have 'const_double' in output_vec_const_move, at config/rs6000/rs6000.c

[Bug target/24953] New: RTL check: access of elt 1 of vector with last elt 0 in vrsave_operation_1, at config/rs6000/predicates.md:1041

[Bug target/24953] [4.1/4.2 Regression] RTL check: access of elt 1 of vector with last elt 0 in vrsave_operation_1, at config/rs6000/predicates.md:1041

[Bug target/24953] RTL check: access of elt 1 of vector with last elt 0 in vrsave_operation_1, at config/rs6000/predicates.md:1041

[Bug target/24954] New: ICE: could not split insn

[Bug target/24954] [4.1 Regression] ICE: could not split insn

[Bug target/24954] [4.1/4.2 Regression] ICE: could not split insn

[Bug target/24955] New: ICE: rs6000_output_function_epilogue, at config/rs6000/rs6000.c:15204

[Bug target/24955] ICE: rs6000_output_function_epilogue with treelang code

[Bug target/24955] ICE: rs6000_output_function_epilogue, at config/rs6000/rs6000.c:15204

[Bug target/24959] New: Trampolines fail on i686-apple-darwin

[Bug target/24959] Trampolines fail on i686-apple-darwin

[Bug target/24959] Trampolines fail on i686-apple-darwin because stack is not executable

[Bug target/24961] New: No constraint letter for destination_operand

[Bug target/24961] No constraint letter for destination_operand

[Bug target/24969] tmpdir-gcc.dg-struct-layout-1/t026 fails execution

[Bug target/24982] New: Bootstrap failure with ICE in refers_to_regno_for_reload_p

[Bug target/24982] [4.1/4.2 Regression] Bootstrap failure with ICE in refers_to_regno_for_reload_p

[Bug target/24982] Bootstrap failure with ICE in refers_to_regno_for_reload_p

[Bug target/24988] [4.2 Regression] gfortran build fails with - Undefined symbols

[Bug target/24997] [4.1/4.2 regression] ICE with -ftree-vectorize

[Bug target/25005] New: [4.1/4.2 regression] ICE in extract_constrain_insn_cached, at recog.c:2002

[Bug target/25005] [4.1/4.2 regression] ICE in extract_constrain_insn_cached, at recog.c:2002

[Bug target/25008] New: problems with "S" constraint in asms

[Bug target/25035] New: Building an avr cross compiler fails

[Bug target/25042] New: __float128 ICE on x86

[Bug target/25042] [3.4/4.0/4.1/4.2 Regression] __float128 ICE on x86

[Bug target/25043] [4.0 Regression] [m68k] ICE in instantiate_virtual_regs_lossage

[Bug target/25043] [m68k] ICE in instantiate_virtual_regs_lossage

[Bug target/25044] problems caused by unresolved symbols in libgcc

[Bug target/25111] New: [m68k] bset is not used for A = 1 << (B & 31) on ColdFire

[Bug target/25111] [m68k] bset is not used for A = 1 << (B & 31) on ColdFire

[Bug target/25112] New: [m68k] Inefficient equality comparison with small integers

[Bug target/25112] [m68k] Suboptimal equality comparisons with small integers

[Bug target/25113] New: [m68k] lshiftrt and some other insns are conservative on cc0

[Bug target/25113] [m68k] lshiftrt and some other insns are conservative on cc0

[Bug target/25114] New: [m68k] Inefficient inequality comparisons with small integers

[Bug target/25114] [m68k] Suboptimal inequality comparisons with small integers

[Bug target/25115] New: Segmentation fault in pre_insert_copy_insn

[Bug target/25115] [4.2 Regression] Segmentation fault in pre_insert_copy_insn

[Bug target/25126] New: -msoft-float does not work

[Bug target/25126] -msoft-float does not work

[Bug target/25127] internal compiler error: in rs6000_emit_prologue, at config/rs6000/rs6000.c:14039

[Bug target/25128] New: [m68k] Suboptimal comparisons against 65536

[Bug target/25128] [m68k] Suboptimal comparisons against 65536

[Bug target/25136] New: FAIL: gcc.c-torture/compile/20050303-1.c -O0

[Bug target/25138] New: [m68k] undefined reference to `__floatunsidf'

[Bug target/25138] [4.2 Regression] [m68k] undefined reference to `__floatunsidf'

[Bug target/25138] [m68k] undefined reference to `__floatunsidf'

[Bug target/25150] internal error with __thread and memcpy()

[Bug target/25160] New: ICE in print_operand if using -mfloat-gprs w/ non-854x -mcpu option

[Bug target/25166] New: FAIL: gcc.c-torture/execute/conversion.c compilation

[Bug target/25166] [4.2 Regression] FAIL: gcc.c-torture/execute/conversion.c compilation

[Bug target/25166] FAIL: gcc.c-torture/execute/conversion.c compilation

[Bug target/25168] New: FAIL: g++.old-deja/g++.abi/cxa_vec.C execution test

[Bug target/25176] New: FAIL: Array_3 -O3 execution - bytecode->native test

[Bug target/25176] FAIL: Array_3 -O3 execution - bytecode->native test

[Bug target/25180] [4.1 Regression] ICE during kernel build.

[Bug target/25180] [4.1/4.2 Regression] ICE during kernel build.

[Bug target/25190] New: Error: bad immediate value for offset (4100)

[Bug target/5312] [IA64] ICE in itanium_reorder at config/ia64/ia64.c:5917

[Bug target/6054] GCC 3.1 for ia64 fails to restore gp after indirect call in Linux kernel

[Bug target/8728] Using alloca and -finstrument-functions and vararg functions causes seg fault

[Bug target/9350] -fomit-frame-pointer does not work for main

[Bug testsuite/16230] Spurious test failures with --disable-static

[Bug testsuite/18338] mmix-knuth-mmixware testsuite failure: gcc.dg/bitfld-4.c and g++.dg/abi/bitfield4.C

[Bug testsuite/19231] Execute failure in gcc.c-torture/execute/builtins/strlen-3.c with -fpic/-fPIC

[Bug testsuite/19275] [3.4/4.0] gcc.dg/20020919-1.c fails with -fpic/-fPIC on i686-pc-linux-gnu

[Bug testsuite/23304] [4.1 Regression] testsuite failures: g++.dg/ext/packed3.C, packed4.C, packed8.c and g++.dg/other/crash-4.C

[Bug testsuite/23304] [4.1/4.2 Regression] testsuite failures: g++.dg/ext/packed3.C, packed4.C, packed8.c and g++.dg/other/crash-4.C

[Bug testsuite/23400] [4.1 Regression] "make check" fixinclude failure

[Bug testsuite/23400] [4.1/4.2 Regression] "make check" fixinclude failure

[Bug testsuite/24614] New: gcc.dg/nested-func-4.c (test for excess errors) fails

[Bug testsuite/24614] gcc.dg/nested-func-4.c (test for excess errors) fails

[Bug testsuite/24841] New: dg-require compilation-test trigged on test with additional-sources barfs

[Bug testsuite/24841] dg-require compilation-test trigged on test with additional-sources barfs

[Bug testsuite/24962] New: gcc.target/ia64/20030811-1.c (test for excess errors) fails with -milp32

[Bug testsuite/25037] New: gcc.target/i386/asm-1.c fails with -m64 passed

[Bug testsuite/25167] New: FAIL: gcc.dg/weak/weak-14.c

[Bug testsuite/25167] FAIL: gcc.dg/weak/weak-14.c

[Bug testsuite/25171] FAIL: gfortran.dg/mixed_io_1.f90

[Bug testsuite/25177] New: gcc.target/powerpc/pr18096-1.c fails on PPC

[Bug testsuite/25193] New: libstdc++ testsuite fails on cygwin

[Bug testsuite/25193] libstdc++ testsuite fails on cygwin

[Bug translation/12197] wrong french translation

[Bug tree-optimization/14844] [tree-ssa] narrow types if wide result is not needed for unsigned types or when wrapping is true

[Bug tree-optimization/15458] Combine ~ and ^.

[Bug tree-optimization/16372] [4.0 Regression] Wrong code for enums

[Bug tree-optimization/16797] Opportunity to remove unnecessary load instructions

[Bug tree-optimization/16876] [3.4/4.0/4.1 Regression] ICE on testcase with -O3 in gen_lowpart

[Bug tree-optimization/17106] Opportunity to eliminate loads from TOC.

[Bug tree-optimization/17863] [4.0/4.1/4.2 Regression] threefold performance loss, not inlining as much

[Bug tree-optimization/18048] [4.0/4.1 Regression] mgrid loop performance regression with ivopts (register pressure)

[Bug tree-optimization/18501] [4.1 Regression] Missing 'used unintialized' warning

[Bug tree-optimization/18576] [3.4/4.0 Regression] missing jump threading because of type changes

[Bug tree-optimization/18594] PHI insertion is slow

[Bug tree-optimization/18595] [4.0/4.1 Regression] IV-OPTS is O(N^3)

[Bug tree-optimization/19590] IVs with the same evolution not eliminated

[Bug tree-optimization/19703] [4.0 Regression] Poor optimisation of loop test, DOM causing unsigned to int and missing combine compares

[Bug tree-optimization/20219] Missed optimisation sin / tan --> cos

[Bug tree-optimization/20656] No strength reduction for a simple testcase

[Bug tree-optimization/21488] [4.0/4.1 regression] Not copy propagating single-argument PHIs causes out-of-ssa coalescing failure

[Bug tree-optimization/21513] [4.0/4.1 Regression] __builtin_expect getting in the way of uninitialized warnings

[Bug tree-optimization/21655] g++.dg/tree-ssa/pr14814.C scan-tree-dump-times &this 0 fails

[Bug tree-optimization/21883] [4.1 Regression] jump threading causing excessive code duplication

[Bug tree-optimization/22266] bad code generation at -O1 (conditional expression and constants)

[Bug tree-optimization/22501] [meta-bug] tramp3d-v4 missed optimizations

[Bug tree-optimization/23109] [4.1 Regression] compiler generates wrong code leading to spurious division by zero with -funsafe-math-optimizations (instead of -ftrapping-math)

[Bug tree-optimization/23115] [4.1 Regression] -ftree-vectorize generates wrong code

[Bug tree-optimization/23202] [4.1 Regression] internal compiler error: tree check: expected ssa_name, have var_decl in verify_ssa, at tree-ssa.c:746

[Bug tree-optimization/23282] [4.0 Regression] wrong results at -O on x86

[Bug tree-optimization/23311] [4.0 regression] GCC produces wrong code

[Bug tree-optimization/23326] [4.0 Regression] Wrong code from forwprop

[Bug tree-optimization/23361] Can't eliminate empty loops with power of two step and variable bounds

[Bug tree-optimization/23382] [4.1 Regression] Does not remove the old HEAP virtual variables in clobbered

[Bug tree-optimization/23659] Should able to add dereferencing (statements with VUSE) without rerunning may_alias

[Bug tree-optimization/23820] ICE in lambda_loopnest_to_gcc_loopnest, at lambda-code.c:1982

[Bug tree-optimization/23821] [4.0/4.1 Regression] DOM and VRP creating harder to optimize code

[Bug tree-optimization/24309] [4.1 Regression] ICE with -O3 -ftree-loop-linear

[Bug tree-optimization/24351] [4.1 Regression] ICE in do_simple_structure_copy with some C++ code

[Bug tree-optimization/24365] [4.1 Regression] statement makes a memory store with complex

[Bug tree-optimization/24379] gcc.dg/ipa/ipa-5.c fails

[Bug tree-optimization/24483] [4.1 Regression] ICE in ivopts

[Bug tree-optimization/24574] a!=0?0:a/10 is not reduced to a/10

[Bug tree-optimization/24575] -(-i / 10) is not foldded to i/10

[Bug tree-optimization/24575] -(i /- 10) is not foldded to i/-10

[Bug tree-optimization/24575] -(i /10) is not foldded to i/-10

[Bug tree-optimization/24599] [4.0 regression] segv after overflow detection

[Bug tree-optimization/24609] New: Same value duplicated in two different registers

[Bug tree-optimization/24609] [4.1 regression] Same value duplicated in two different registers

[Bug tree-optimization/24609] Same value duplicated in two different registers

[Bug tree-optimization/24627] [4.1 Regression] xntp miscompiled

[Bug tree-optimization/24644] [4.1 Regression] gcc-4.1 compiled ppc64 kernels do not boot

[Bug tree-optimization/24653] New: [4.1 regression] EON regressed seriously on x86-64

[Bug tree-optimization/24653] [4.1 regression] EON regressed seriously on x86-64

[Bug tree-optimization/24653] [4.1/4.2 regression] EON regressed seriously on x86-64

[Bug tree-optimization/24659] New: Conversions are not vectorized

[Bug tree-optimization/24659] Conversions are not vectorized

[Bug tree-optimization/24665] New: internal compiler error: get_indirect_ref_operands

[Bug tree-optimization/24665] [4.0/4.1 Regression] internal compiler error: get_indirect_ref_operands

[Bug tree-optimization/24669] New: Loop index variable has offset of 1

[Bug tree-optimization/24669] Loop index variable has offset of 1

[Bug tree-optimization/24670] New: VRP ICE in compare_name_with_value

[Bug tree-optimization/24670] [4.1 Regression] VRP ICE in compare_name_with_value

[Bug tree-optimization/24689] New: store_ccp is missing an opportunity!?

[Bug tree-optimization/24689] store_ccp does nothing for array references

[Bug tree-optimization/24689] store_ccp is missing an opportunity because of call clobber/alias load?

[Bug tree-optimization/24694] New: Address taken and addressable variables and call clobber

Re: [Bug tree-optimization/24694] New: Address taken andaddressable variables and call clobber

[Bug tree-optimization/24694] Address taken and addressable variables and call clobber

[Bug tree-optimization/24696] New: missing optimization in comparison of results of bit operations

[Bug tree-optimization/24696] missing optimization in comparison of results of bit operations

[Bug tree-optimization/24709] [4.1 Regression] 4.1.0 HEAD crashes with enable-checking on huge switch statement

[Bug tree-optimization/24709] [4.1 Regresssion] 4.1.0 HEAD crashes with enable-checking on huge switch statement

[Bug tree-optimization/24716] [4.1 Regression] Wrong code generated when optimising

[Bug tree-optimization/24793] New: ICE: expected ssa_name, have var_decl in verify_ssa, at tree-ssa.c:746

[Bug tree-optimization/24793] [4.1 Regression] ICE: expected ssa_name, have var_decl in verify_ssa, at tree-ssa.c:746

[Bug tree-optimization/24793] ICE: expected ssa_name, have var_decl in verify_ssa, at tree-ssa.c:746

[Bug tree-optimization/24819] [4.1 Regression] glibc math tests miscompiled with gcc-4.1

[Bug tree-optimization/24840] [4.1 Regression] ICE process_assert_insertions_for, at tree-vrp.c:2807

[Bug tree-optimization/24851] New: [4.1 Regression] f2c miscompilation

[Bug tree-optimization/24851] [4.1 Regression] f2c miscompilation

[Bug tree-optimization/24888] New: duplication of local variables after versioning/inlining

[Bug tree-optimization/24888] duplication of local variables after versioning/inlining

[Bug tree-optimization/24899] New: [4.1 Regression] Miscompiles libgnomecanvas

[Bug tree-optimization/24899] [4.1 Regression] Miscompiles libgnomecanvas

[Bug tree-optimization/24931] [4.0 Regression] uninitialized structure member after assignment

[Bug tree-optimization/24931] [4.0/4.1 Regression] uninitialized structure member after assignment

[Bug tree-optimization/24931] [4.0/4.1/4.2 Regression] uninitialized structure member after assignment

[Bug tree-optimization/24935] crash with -ftree-vectorize

[Bug tree-optimization/24963] New: [4.1/4.2 Regression] gcc.dg/vect/vect-62.c scan-tree-dump-times not vectorized: redundant loop. no profit to vectorize. 1 fails

[Bug tree-optimization/24963] [4.1/4.2 Regression] gcc.dg/vect/vect-62.c scan-tree-dump-times not vectorized: redundant loop. no profit to vectorize. 1 fails

[Bug tree-optimization/24964] Does not optimise abs(x)**2 to x**2

[Bug tree-optimization/24997] New: [4.1/4.2 regression] ICE with -ftree-vectorize

[Bug tree-optimization/24997] [4.1/4.2 regression] ICE with -ftree-vectorize

[Bug tree-optimization/25000] New: [4.1/4.2 Regression] ICE in coalesce_abnormal_edges, at tree-outof-ssa.c:646

[Bug tree-optimization/25000] [4.1 Regression] ICE in coalesce_abnormal_edges, at tree-outof-ssa.c:646

[Bug tree-optimization/25000] [4.1/4.2 Regression] ICE in coalesce_abnormal_edges, at tree-outof-ssa.c:646

[Bug tree-optimization/25145] New: missed VRP opportunity

[Bug tree-optimization/25145] missed VRP opportunity

[Bug tree-optimization/25148] New: compare_values assumes that CST in a + CST (and a - CST) is always postive

[Bug tree-optimization/25148] compare_values assumes that CST in a + CST (and a - CST) is always postive

[Bug tree-optimization/5035] Incorrectly produces '`<var>' might be used uninitialized in this function'

[Bug treelang/23072] multiple runs of treelang testsuite does not work...

[Bug treelang/24066] almost all treelang testsuite fails with -maltivec as an option

[Bug treelang/24771] New: treelang does not have a man page

[Bug treelang/24771] treelang does not have a man page

[Bug treelang/24844] New: syntax error when running treelang testsuite

[sliwa@blue.cft.edu.pl: gnu fortran - arpack examples hang]

arm-elf-nm --print-size fails on static variables

Bug in strtof

C++ bug with std::copy and std::pair

GCC Compiling Problem

Language and academic programs from around the world

long function name

problem with malloc in gcc-3.2.2

problems with gfortran in 64-bit mode

strange behavior...

THE_HACKER_IS_HACKING 757147

ü Ƽ  ĺ Ǹմϴ.


Indexes: [Date Index] [Subject Index] [Author Index] [Thread Index]
Site Nav: [Browse other archives for this mailing list]
[Browse other mailing lists at this site]
Search: Limit to:

Mail converted by MHonArc 2.6.3