gcc-bugs archive
subject index for February, 2004

This is the mail archive of the gcc-bugs@gcc.gnu.org mailing list for the GCC project.

Indexes: [Date Index] [Subject Index] [Author Index] [Thread Index]
Site Nav: [Browse other archives for this mailing list]
[Browse other mailing lists at this site]
Search: Limit to:

2nd notice, Please respond ugy

[Bug ada/10670] gcc ignors 'pragma Machine_Attribute' directive

[Bug ada/13897] gnat does not implement tasking on powerpc

[Bug ada/14068] gnatmake fails with error box

[Bug ada/14068] New: gnatmake fails with error box

[Bug ada/14115] 'pragma Linker_Section' stop working with gcc-3.2.1 or earlier

[Bug ada/14115] New: 'pragma Linker_Section' stop working with gcc-3.2.1 or earlier

[Bug ada/14131] [3.5 Regression] Toplevel configure tries to build libada even if gnat is not available

[Bug ada/14131] New: [3.5] Toplevel configure tries to build libada even if gnat is not available

[Bug ada/14150] Ada documentation out of date

[Bug ada/14150] New: Ada documentation out of date

[Bug ada/14155] New: [3.4 regression] ada bootstrap error

[Bug ada/14195] New: Suggestion for System.OS_Interface.struct_sigaction

[Bug ada/14195] Suggestion for System.OS_Interface.struct_sigaction

[Bug ada/14350] libada/configure.in should not hardcode GCC version

[Bug ada/14350] New: libada/configure.in should not hardcode GCC version

[Bug ada/5911] Ada runtime and utilities should be broken out to their own directory

[Bug ada/5911] Support for multilib in Ada

[Bug ada/6637] Ada libraries should honour --enable-shared

[Bug ada/6637] Would be nice to support --enable-shared=gnat

[Bug bootstrap/11060] [3.4/3.5 regression] [m68k] bootstrap error in libgcj

[Bug bootstrap/11660] libffi only builds when java is selected as language

[Bug bootstrap/11932] [3.4 regression] Parallel bootstrap failure with sparc libiberty multilib

[Bug bootstrap/11932] [3.4/3.5 regression] Parallel bootstrap failure with sparc libiberty multilib

[Bug bootstrap/11998] soft-float libstdc++ multilib fails to build

[Bug bootstrap/12015] [arm-netbsdelf] hidden symbol __fixunsdfsi referenced by DSO

[Bug bootstrap/12098] gcc build fails without gas on ia64-hpux: error: invalid switch '-x'

[Bug bootstrap/12179] [3.4/3.5 Regression] --enable-version-specific-runtime-libs put files in the wrong place

[Bug bootstrap/12371] [3.4/3.5 regression] [m68k-linux] bootstrap error in make compare

[Bug bootstrap/12596] configure setting --with-libiconv-prefix doesn't get passed to gcc-subdir

[Bug bootstrap/12611] Gcc doesn't handle SGI's modularized compiler setup

[Bug bootstrap/12974] [3.4/3.5 Regression] gcc-3.4/3.5-20031105 bootstrap failure [MinGW]

[Bug bootstrap/13083] [3.3 Regression] bootstrap failure: segfault in stage2 compiling java/win32-host.o

[Bug bootstrap/13334] Bootstrap failure: libiberty/fibheap.c: LONG_MIN undeclared

[Bug bootstrap/13352] ICE SIGSEGV during bootstrap on libstdc++-v3/testsuite/testsuite_hooks.cc with the zone GC

[Bug bootstrap/13617] IRIX 6.5 Ada bootstrap failure with GNU as 2.14.90

[Bug bootstrap/13747] fail to build in source directory

[Bug bootstrap/13960] [3.3 Regression] Cannot bootstrap on powerpc-apple-darwin

[Bug bootstrap/13960] New: [3.3 Regression] Cannot bootstrap on powerpc-apple-darwin

[Bug bootstrap/13973] bootstrap fails in stage1 libgcc, trouble with movdf

[Bug bootstrap/13973] New: bootstrap fails in stage1 libgcc, trouble with movdf

[Bug bootstrap/13982] Bootstrap of gcc-3.4-20040128 on Darwin6.8/Mac OS X 10.2.8 failed

[Bug bootstrap/13982] New: Bootstrap of gcc-3.4-20040128 on Darwin6.8/Mac OS X 10.2.8 failed

[Bug bootstrap/13988] GCC-3.3.3 first prerelease (gcc-3.3.3-20040131) bootstrap failed on Darwin 6.8 / Mac OS X 10.2.8

[Bug bootstrap/13988] New: GCC-3.3.3 first prerelease (gcc-3.3.3-20040131) bootstrap failed on Darwin 6.8 / Mac OS X 10.2.8

[Bug bootstrap/13990] build fails because of wrong use of gen_rtx_NE

[Bug bootstrap/13990] New: build fails because of wrong use of gen_rtx_NE

[Bug bootstrap/14025] bootstrap of --enable-threads=posix fails on Compaq Tru64 UNIX V5.1B (Rev. 2650)

[Bug bootstrap/14025] New: bootstrap of --enable-threads=posix fails on Compaq Tru64 UNIX V5.1B (Rev. 2650)

[Bug bootstrap/14034] gcc-3.3-20040202 bootstrap failure on Darwin7.0.1/x86

[Bug bootstrap/14034] New: gcc-3.3-20040202 bootstrap failure on Darwin7.0.1/x86

[Bug bootstrap/14037] New: bootstrapping fails when configured with --with-cpu=601

[Bug bootstrap/14118] [tree-ssa] h8300-elf, avr-elf, m68k-elf ports don't build

[Bug bootstrap/14118] H8 port doesn't build

[Bug bootstrap/14118] h8300-elf, avr-elf, m68k-elf ports don't build

[Bug bootstrap/14118] New: H8 port doesn't build

[Bug bootstrap/14120] m32r-port and mcore-elf ports don't build

[Bug bootstrap/14120] New: m32r-port doesn't build

[Bug bootstrap/14148] Bootstrap dies on Cygwin with zone GC because it supposedly lacks mmap

[Bug bootstrap/14148] New: Bootstrap dies on Cygwin with zone GC because it supposedly lacks mmap

[Bug bootstrap/14152] New: `sdbout_type_decl' undeclared in sdbout.c, stage 1 of bootstrap

[Bug bootstrap/14155] [3.4 regression] ada bootstrap error

[Bug bootstrap/14162] Fail to bootstrap gcc-3.3.3 on an old Sparcstation 10

[Bug bootstrap/14162] New: Fail to bootstrap gcc-3.3.3 on an old Sparcstation 10

[Bug bootstrap/14171] New: Bootstrap dies with reg-stack.c:235: error: 'nan' redeclared as different kind of symbol

[Bug bootstrap/14180] [3.4 regression] bootstrap failure with 3.4 branch

[Bug bootstrap/14180] New: [3.4 regression] bootstrap failure with 3.4 branch

[Bug bootstrap/14207] [3.4 Regression] Bootstrap fails linking libstdc++.so for -mabi-o32 ABI

[Bug bootstrap/14207] [3.4/3.5? Regression] Bootstrap fails linking libstdc++.so for -mabi-o32 ABI

[Bug bootstrap/14207] New: Bootstrap fails linking libstdc++.so for -mabi-o32 ABI

[Bug bootstrap/14216] macro "INIT_CUMULATIVE_ARGS" passed 5 arguments, but takes just 4

[Bug bootstrap/14216] New: macro "INIT_CUMULATIVE_ARGS" passed 5 arguments, but takes just 4

[Bug bootstrap/14221] ansi.h:128: internal compiler error: Illegal instruction

[Bug bootstrap/14221] Compiler from stage1 ICE on system header: Illegal instruction

[Bug bootstrap/14221] New: ansi.h:128: internal compiler error: Illegal instruction

[Bug bootstrap/14239] New: Problem building gcc3.3.3 for x86_64

[Bug bootstrap/14239] Problem building gcc3.3.3 for x86_64

[Bug bootstrap/14285] [tree-ssa] current_function_needs_context is not declared

[Bug bootstrap/14285] New: [tree-ssa] current_function_needs_context is not declared

[Bug bootstrap/14316] collect2 doesnt build on windows hosts

[Bug bootstrap/14332] [3.3 Regression] Building GCC 3.3.3 for the AVR target fails

[Bug bootstrap/14332] New: Building GCC 3.3.3 for the AVR target fails

[Bug bootstrap/14336] New: bootstrapping gcc 3.3.3 fails on mips-sgi-irix5.3

[Bug bootstrap/14344] [3.3.3 Regression] MinGW Bootstrap Failure

[Bug bootstrap/14344] New: [3.3.3 Regression] MinGW Bootstrap Failure

[Bug bootstrap/14348] Cannot bootstrap GCC-3.3.4-pre with GCC-3.5 (experimental)

[Bug bootstrap/3437] [vxworks] cross-compile problem because of fixincludes

[Bug bootstrap/7087] sub-make FLAG propagation fails if flag ends with '='

[Bug bootstrap/9968] Prefix ending in "/" causes trouble in prefix.c

[Bug c++/10112] static data member is not correctly initialised

[Bug c++/10291] error referencing a static local from a local struct in template code

[Bug c++/10503] [3.2/3.3/3.4 regression] Compilation never stops in fixed_type_or_null

[Bug c++/10506] [3.3/3.4 regression] ICE in build_new at cp/init.c with -fkeep-inline-functions and multiple inheritance

[Bug c++/10618] Error message for function declarations with invalid return type could be improved

[Bug c++/10711] [3.3 regression] ICE in tree check: accessed elt 2 of tree_vec with 1 elts in tsubst, at cp/pt.c:6707

[Bug c++/10711] [3.3/3.4 regression] ICE in tree check: accessed elt 2 of tree_vec with 1 elts in tsubst, at cp/pt.c:6707

[Bug c++/10807] [DR 295] It should be possible to cv-qualify function types, if the CV qualifications are introduced through a typedef or a template argument

[Bug c++/10858] failure with calling a method inside sizeof: sorry, unimplemented: `method_call_expr' not supported by dump_expr

[Bug c++/11182] gcc should warn when assigning unassigned variables when not optimizating

[Bug c++/11224] [3.3/3.4/3.5 regression] warning "value computed is not used" no longer emitted

[Bug c++/11295] [3.4/3.5 regression] ICE in cp_expr_size, at cp/cp-lang.c:314 when using a non-trivial object in a compound statement expression

[Bug c++/11303] [3.3 regression] ICE in stor-layout.c:304 in int_mode_for_mode

[Bug c++/11326] C++ IA64 ABI: 3.1.4: sometimes pointer to temporary return value is implicit first parameter preceding "this"

[Bug c++/11613] attribute unused after label causes error with g++

[Bug c++/11804] Wrong warning about explicit initialization of base class default constructor

[Bug c++/11987] [3.4/3.5 regression] Accepts-invalid with inherited nested type

[Bug c++/12007] Multiple inheritance float pass by value fails

[Bug c++/12226] [3.3 Regression] g++ fails to enforce accessibility requirement for copy constructor

[Bug c++/12271] [3.3.3 regression] Compilation of OpenCV (Open Computer VIsion) with error message: in emit_move_insn_1, at expr.c:3510

[Bug c++/12271] Compilation of OpenCV (Open Computer VIsion) with error message: in emit_move_insn_1, at expr.c:3510

[Bug c++/12511] [3.3 Regression] When building with -O2 getsockname may fail

[Bug c++/12807] Failure to diagnose VLA in template

[Bug c++/12831] [3.3 regression] ICE with passing reference to bound pointer-to-member-function

[Bug c++/12850] [3.4/3.5 Regression] memory consumption for heavy template instantiations tripled since 3.3

[Bug c++/13074] [3.3/3.4 Regression] Stops with message: g++: Internal error: Killed (program cc1plus)

[Bug c++/13086] [3.3 Regression] the location of the warning message is wrong when calling delete on incomplete type

[Bug c++/13086] [3.3/3.4/3.5 regression] the location of the warning message is wrong when calling delete on incomplete type

[Bug c++/13088] templatizing outer class hides specialization of inner template class

[Bug c++/13092] [3.4/3.5 regression] Accepts invalid pointer-to-member conversion

[Bug c++/13113] [3.4/3.5 regression] Nice warning about &(X::m) lost

[Bug c++/13140] declaration in global namespace, definition inside named or anon namespace

[Bug c++/13157] [3.3 Regression] Argument Dependent Lookup Failure

[Bug c++/13160] [3.3/3.4/3.5 Regression] ABI=1 implementation difference vs. g++ 3.2

[Bug c++/13170] [3.4/3.5 Regression] ICE in build_base_path

[Bug c++/13178] [3.3 Regression] Bogus C++ error message referring to operator 1

[Bug c++/13316] g++ does not follow mangling ABI for pointer to qualified member function

[Bug c++/13358] long long and C++ do not mix well

[Bug c++/13495] Friendship to class nested withint a template is broken

[Bug c++/13527] __attribute__ ((unused)) ignored

[Bug c++/13549] Problem compiling Boost.Python test

[Bug c++/13578] [3.3 Regression] ICE in lookup_template_class

[Bug c++/13635] [3.3 regression] ICE in register_specialization for specific order of template specialization

[Bug c++/13635] [3.3/3.4/3.5 regression] ICE in register_specialization for specific order of template specialization

[Bug c++/13647] ICE in c_parse_error after error

[Bug c++/13658] [testcase] namespace association vs. templates part one

[Bug c++/13663] [3.3 regression] gcc segfaults on invalid use of member

[Bug c++/13700] Member function definition in non-enclosing scope

[Bug c++/13710] [3.3 regression] ICE with typeof

[Bug c++/13714] [3.4/3.5 Regression] destructor name `const s' does not match type `const s' of expression

[Bug c++/13745] [tree-ssa] expressions not converted back to array form

[Bug c++/13768] [3.4/3.5 Regression] -funit-at-a-time compiles unused inline function

[Bug c++/13768] C++ fails to diagnose invalid code

[Bug c++/13768] C++ fails to diagnose invalid code(calling a non exitsing function in a template class) in non unit-at-a-time mode

[Bug c++/13768] Incoherent behaviour in instantiation between -funit-at-a-time and -fno-unit-at-a-time

[Bug c++/13813] [DR206] Incomplete member variables in a template.

[Bug c++/13847] Additions to the changes.html file for 3.4.

[Bug c++/13854] [3.4/3.5 Regression] g++ messes up library file definitions

[Bug c++/13878] Uncaught exception on AIX with shared libraries

[Bug c++/13881] [3.3 Regression] Allow comparison between unrelated pointer-to-data-members

[Bug c++/13907] [3.3 regression] valid conversion rejected unless -pedantic is set

[Bug c++/13907] [3.3/3.4/3.5 regression] valid conversion rejected unless -pedantic is set

[Bug c++/13925] [3.4?/3.5 Regression] Bug while befriending specializations

[Bug c++/13927] [3.4/3.5 Regression] confusing error message on bad redeclaration of anon union

[Bug c++/13927] [3.4/3.5 Regression] duplicated error message on bad redeclaration of anon union

[Bug c++/13932] [3.3 regression] duplicate warning message for conversion

[Bug c++/13932] [3.3/3.4/3.5 regression] duplicate warning message for conversion

[Bug c++/13935] [3.4/3.5 Regression] Template friend lookup bug

[Bug c++/13944] [3.3/3.4/3.5 Regression] exception in constructor of a class to be thrown is not caught

[Bug c++/13944] [3.3/3.4/3.5] exception in constructor of a class to be thrown is not caught

[Bug c++/13950] [3.4/3.5 Regression] [DR176] ICE on lookup of dependent base name

[Bug c++/13950] [DR176] ICE on lookup of dependent base name

[Bug c++/13957] GCC 3.4 rejects some template heavy code that 3.3.1 accepts

[Bug c++/13957] Insufficient diagnostic for dependent expression parsed as non-type but instantiated as type

[Bug c++/13957] New: GCC 3.4 rejects some template heavy code that 3.3.1 accepts

[Bug c++/13959] New: un-init local variable detection enhancement request

[Bug c++/13959] un-init local variable detection enhancement request

[Bug c++/13963] gcc rejects array of unknown bounds as parameter of function template specialization

[Bug c++/13963] New: gcc rejects array of unknown bounds as parameter of function template specialization

[Bug c++/13966] default template arguments ignored in template template parameters

[Bug c++/13966] New: default template arguments ignored in template template parameters

[Bug c++/13967] [3.3?/3.4/3.5 regression] template template argument identifier lookup fails scoping rules

[Bug c++/13967] A warning could be emitted if a template parameter of a member template is begin shadowed by another member of the class

[Bug c++/13967] New: template template argument identifier lookup fails scoping rules

[Bug c++/13967] template template argument identifier lookup fails scoping rules

[Bug c++/13968] [3.4/3.5 Regression] Internal compiler error while compiling Boost library

[Bug c++/13968] Internal compiler error while compiling Boost library

[Bug c++/13968] New: Internal compiler error while compiling Boost library

[Bug c++/13969] [3.4/3.5 Regression] static const value rejected as template parameter

[Bug c++/13969] New: static const value rejected as template parameter

[Bug c++/13969] static const value rejected as template parameter

[Bug c++/13970] [3.4/3.5 Regression] internal compiler error: Segmentation fault

[Bug c++/13970] internal compiler error: Segmentation fault

[Bug c++/13970] New: internal compiler error: Segmentation fault

[Bug c++/13971] [3.4/3.5 Regression] ICE when compiling koffice-cvs (in build_conditional_expr, at cp/call.c:3068)

[Bug c++/13971] ICE when compiling koffice-cvs (in build_conditional_expr, at cp/call.c:3068)

[Bug c++/13971] New: ICE when compiling koffice-cvs (in build_conditional_expr, at cp/call.c:3068)

[Bug c++/13975] [3.4/3.5 Regression] ICE on misplaced visibility specifier.

[Bug c++/13975] New: ICE on misplaced visibility specifier.

[Bug c++/13977] New: xgcc c++

[Bug c++/13977] xgcc c++

[Bug c++/13978] [3.4/3.5 Regression] Koenig lookup doesn't find template functions in templates

[Bug c++/13978] Koenig lookup doesn't find template functions.

[Bug c++/13978] New: Koenig lookup doesn't find template functions.

[Bug c++/13979] [3.3/3.4/3.5 Regression] no matching function for call with derived class arguments

[Bug c++/13979] Error message about no matching function for call with derived class arguments could be improved

[Bug c++/13979] New: no matching function for call with derived class arguments

[Bug c++/13979] no matching function for call with derived class arguments

[Bug c++/13980] Can't assign a predefined const int 0 to a pointer

[Bug c++/13980] New: Can't assign a predefined const int 0 to a pointer

[Bug c++/13981] Give message about incomplete class that might be implicitly upcasted.

[Bug c++/13981] New: Give message about incomplete class that might be implicitly upcasted.

[Bug c++/13983] New: packed attribute does not take effect when using typedef

[Bug c++/13983] no warning on some non-POD struct with packed attribute

[Bug c++/13983] packed attribute does not take effect when using typedef

[Bug c++/13986] [3.4/3.5 regression] Unnecessary access check for copy constructor

[Bug c++/13986] New: [3.4/3.5 regression] Unnecessary check for copy constructor

[Bug c++/13989] C++ method lookup fails for methods returning vector types (because of attribute)

[Bug c++/13989] New: C++ method lookup fails for methods returning Altivec types

[Bug c++/13991] namespace-name clash with class-name compiles without warnings

[Bug c++/13991] New: namespace-name clash with class-name compiles without warnings

[Bug c++/13995] Friend declaration with template-id causes confusion of function arguments

[Bug c++/13995] New: Friend declaration with template-id causes confusion of function arguments

[Bug c++/13997] [3.4/3.5 Regression]

[Bug c++/13997] [3.4/3.5 Regression] Error while matching partial specialization of array type

[Bug c++/13997] New: [3.3?/3.4/3.5 Regression]

[Bug c++/13998] New: regression compared to gcc3.3, breaks boost::is_array

[Bug c++/13998] regression compared to gcc3.3, breaks boost::is_array

[Bug c++/13999] enabling c++ in gcc

[Bug c++/13999] New: enabling c++ in gcc

[Bug c++/14000] Can create and use datum of a type you cannot name

[Bug c++/14000] New: Can create and use datum of a type you cannot name

[Bug c++/14001] New: * Undefined reference to std::string::_Rep::_S_empty_rep_storage when compiling with -O2.

[Bug c++/14001] Undefined reference to std::string::_Rep::_S_empty_rep_storage when compiling with -O2.

[Bug c++/14002] [3.4/3.5 regression] Friend declaration with template-id causes confusion of function arguments

[Bug c++/14002] New: [3.4/3.5 regression] Friend declaration with template-id causes confusion of function arguments

[Bug c++/14006] New: Using "typedef typename std::iterator difference_type" causes a segfault.

[Bug c++/14006] Using "typedef typename std::iterator difference_type" causes a segfault.

[Bug c++/14007] [3.3/3.4/3.5 Regression] Incorrect use of const partial specialization for reference template argument

[Bug c++/14007] New: Incorrect use of const partial specialization for reference template argument

[Bug c++/14008] [3.4/3.5 Regression] Confusing diagnostic when ommitting a template parameter

[Bug c++/14008] New: Confusing diagnostic when ommitting a template parameter

[Bug c++/14014] inheritance failure

[Bug c++/14014] New: inheritance failure

[Bug c++/14017] New: Problem on gcc 3.4 with multiple inheritance having a common base

[Bug c++/14017] Problem on gcc 3.4 with multiple inheritance having a common base

[Bug c++/14020] New: template keyword used as a disambiguator not conforming to ISO C++ 98

[Bug c++/14020] template keyword used as a disambiguator not conforming to ISO C++ 98

[Bug c++/14021] lacking conversion from `std::streampos' to `std::streamoff'

[Bug c++/14021] New: lacking conversion from `std::streampos' to `std::streamoff'

[Bug c++/14024] g++ isn't reporting aliasing warnings

[Bug c++/14024] New: g++ isn't reporting aliasing warnings

[Bug c++/14026] New: std::uncaught_exception is true although there are no uncaught exceptions (rethrow, ghost exception)

[Bug c++/14026] std::uncaught_exception is true although there are no uncaught exceptions (rethrow, ghost exception)

[Bug c++/14027] gcc (c++ not found)

[Bug c++/14027] New: gcc (c++ not found)

[Bug c++/14028] [3.4/3.5 regression] Parser accepts invalid unbalanced triangular bracketing.

[Bug c++/14028] New: Parser accepts invalid unbalanced triangular bracketing.

[Bug c++/14029] [tree-ssa] Miscompilation of unrolled loop due to Iterator::base having an aliasing problem

[Bug c++/14031] [DR 226] Resolution of Core DR 226 (WP) not implemented

[Bug c++/14031] New: Resolution of Core DR 226 (WP) not implemented

[Bug c++/14032] New: non type boolean template argument partial specialization to argument in parent never matches

[Bug c++/14032] non type boolean template argument partial specialization to argument in parent never matches

[Bug c++/14033] [3.3 Regression] tree check: expected class 't', have 'x' (error_mark) in initialize_inlined_parameters, at tree-inline.c:829

[Bug c++/14033] [3.3/3.4/3.5 Regression] tree check: expected class 't', have 'x' (error_mark) in initialize_inlined_parameters, at tree-inline.c:829

[Bug c++/14033] New: tree check: expected class 't', have 'x' (error_mark) in initialize_inlined_parameters, at tree-inline.c:829

[Bug c++/14035] Compiler generates spurious temporary

[Bug c++/14035] New: Compiler generates spurious temporary

[Bug c++/14039] bug in std::find

[Bug c++/14039] New: bug in std::find

[Bug c++/14042] C++ abstraction penalty is high in simple Altivec cases

[Bug c++/14042] C++ abstraction penalty is high in simple cases

[Bug c++/14042] New: C++ abstraction penalty is high in simple cases

[Bug c++/14051] [3.4/3.5 regression]

[Bug c++/14051] [3.4/3.5 regression] rejects legal code dealing with enums

[Bug c++/14051] New: [3.4/3.5 regression]

[Bug c++/14057] error: conversion from `struct member*' to `enum PlayerNumber'

[Bug c++/14057] New: error: conversion from `struct member*' to `enum PlayerNumber'

[Bug c++/14073] const * loses highest order byte.

[Bug c++/14073] New: const * loses highest order byte.

[Bug c++/14075] ("foo") accepted as char[] initializer

[Bug c++/14075] New: ("foo") accepted as char[] initializer

[Bug c++/14079] New: wrong debug info for extern boolean variable in debug mode

[Bug c++/14079] wrong debug info for extern boolean variable in debug mode

[Bug c++/14083] [3.3 regression] ICE in conditional expression operator with throw

[Bug c++/14083] [3.3/3.4/3.5 regression] ICE in conditional expression operator with throw

[Bug c++/14083] New: ICE in conditional expression operator with throw

[Bug c++/14085] [3.4/3.5 Regression] when compiling template functors

[Bug c++/14085] [3.5 Regression] when compiling template functors

[Bug c++/14085] Internal error when compiling template functors

[Bug c++/14085] New: Internal error when compiling template functors

[Bug c++/14086] [3.3/3.4/3.5 Regression] internal compiler error: Segmentation fault (enum name equals classname)

[Bug c++/14086] New: internal compiler error: Segmentation fault (enum name equals classname)

[Bug c++/14089] [tree-ssa] ICE in check_pointer_types_r, at gimplify.c:3370

[Bug c++/14089] New: ICE in check_pointer_types_r

[Bug c++/14091] New: ostream crash on HPUX 11

[Bug c++/14091] ostream crash on HPUX 11

[Bug c++/14098] typeinfo issue with __gnu_cxx::stdio_sync_filebuf

[Bug c++/14102] New: Static data member template incorrect initialization

[Bug c++/14102] Static data member template incorrect initialization

[Bug c++/14106] [testcase] ICE on template func instanciation: stor-layout.c:1569

[Bug c++/14106] New: ICE on template func instanciation: stor-layout.c:1569

[Bug c++/14108] [3.4/3.5 regression] ICE on simple testcase

[Bug c++/14108] ICE on simple testcase

[Bug c++/14108] New: ICE on simple testcase

[Bug c++/14113] New: -O2 corrupts stack for small example

[Bug c++/14116] [testcase] internal compiler error: in lookup_member, at cp/search.c:1498

[Bug c++/14116] internal compiler error: in lookup_member, at cp/search.c:1498

[Bug c++/14116] New: internal compiler error: in lookup_member, at cp/search.c:1498

[Bug c++/14122] [3.4/3.5 Regression] problem with non-type tmplt parm in member template

[Bug c++/14122] New: problem with non-type tmplt parm in member template

[Bug c++/14122] problem with non-type tmplt parm in member template

[Bug c++/14123] New: odd number of parentheses in error message

[Bug c++/14123] odd number of parentheses in error message

[Bug c++/14124] enum definition with __attribute__((packed)) gives syntax errors

[Bug c++/14124] New: enum definition with __attribute__((packed)) gives syntax errors

[Bug c++/14132] New: static template member definition fails

[Bug c++/14132] static template member definition fails

[Bug c++/14136] [3.4?/3.5 Regression] double error message for typename used as destructor declarator

[Bug c++/14136] [3.5 Regression] double error message for typename used as destructor declarator

[Bug c++/14136] New: [3.4?/3.5 Regression] double error message for typename used as destructor declarator

[Bug c++/14137] New: ICE in cgraph_finalize_compilation_unit, at cgraphunit.c:407

[Bug c++/14138] 100x -O0 C++ Compile Time Regression {3.2,3.3} -> {3.4,3.5}

[Bug c++/14138] [3.4/3.5 Regression] 100x -O0 C++ Compile Time Regression {3.2,3.3} -> {3.4,3.5}

[Bug c++/14138] New: 100x -O0 C++ Compile Time Regression {3.2,3.3} -> {3.4,3.5}

[Bug c++/14140] New: Unwanted call to derived constructor after implicit conversion

[Bug c++/14140] Unwanted call to derived constructor after implicit conversion

[Bug c++/14143] New: Overeager ADL

[Bug c++/14143] Overeager ADL

[Bug c++/14154] g++ silently creates incorrect code when "this" used in initializer list

[Bug c++/14154] New: g++ silently creates incorrect code when "this" used in initializer list

[Bug c++/14156] New: no warning for address of parameter

[Bug c++/14156] no warning for address of parameter

[Bug c++/14158] [3.3/3.4/3.5 Regression] Typo in G++ manual

[Bug c++/14159] 64bit ppc64 header directory missing form system include chain

[Bug c++/14159] New: 64bit ppc64 header directory missing form system include chain

[Bug c++/14160] Mangled names for anonymous namespace members not guaranteeed unique

[Bug c++/14160] New: Mangled names for anonymous namespace members not guaranteeed unique

[Bug c++/14161] [3.4/3.5 Regression] Constructors invoking priority problem

[Bug c++/14161] New: Constructors invoking priority problem

[Bug c++/14167] New: Unneeded C++ types are output in debug info due to use of static constants

[Bug c++/14167] Unneeded C++ types are output in debug info due to use of static constants

[Bug c++/14172] g++ should ignore warnings in STL headers

[Bug c++/14172] g++ should not emit effc++ warnings in system headers

[Bug c++/14172] New: g++ should ignore warnings in STL headers

[Bug c++/14173] [3.4/3.5 Regression] -fpack-struct crashes on hello_world.cpp

[Bug c++/14176] New: standard allocator crashes when deallocating segment of zero length.

[Bug c++/14177] class forward declaration and typename are conflicting ?

[Bug c++/14177] New: class forward declaration and typename are conflicting ?

[Bug c++/14178] doc bug: -fabi-version=2 is now default (not 1)

[Bug c++/14178] New: doc bug: -fabi-version=2 is now default (not 1)

[Bug c++/14179] [3.3/3.4/3.5 Regression] out of memory

[Bug c++/14179] New: out of memory

[Bug c++/14179] out of memory

[Bug c++/14181] Cryptic error message for code that compiled without warnings in 3.3.x

[Bug c++/14181] New: Cryptic error message for code that compiled without warnings in 3.3.x

[Bug c++/14186] [3.4 Regression] enum in base class conflicts with derived class

[Bug c++/14186] [3.4/3.5 Regression] enum in base class conflicts with derived class

[Bug c++/14186] New: [REGRESSION 3.4] enum in base class conflicts with derived class

[Bug c++/14189] New: template inlining failed warning - with optimization -O2

[Bug c++/14189] template inlining failed warning - with optimization -O2

[Bug c++/14199] [3.4/3.5 regression] Unjustified warning about unused variable

[Bug c++/14199] [tree-ssa regression] Unjustified warning about unused variable

[Bug c++/14199] New: [tree-ssa regression] Unjustified warning about unused variable

[Bug c++/14203] [3.4/3.5 regression] ICE on warning about unused variable

[Bug c++/14203] New: [3.3 regression] ICE on valid code

[Bug c++/14208] [3.4/3.5 Regression] Regression compiling Boost.Python test

[Bug c++/14208] New: Regression compiling Boost.Python test

[Bug c++/14208] Regression compiling Boost.Python test

[Bug c++/14211] [3.3/3.4/3.5 Regression] const_cast should return lvalues

[Bug c++/14211] missing lvalue check ?

[Bug c++/14211] New: missing lvalue check ?

[Bug c++/14213] New: strange behavior with private cp-cstr...

[Bug c++/14213] strange behavior with private cp-cstr...

[Bug c++/14215] New: tree check: expected identifier_node, have integer_cst in c_parse_error, at c-common.c:5913

[Bug c++/14215] tree check: expected identifier_node, have integer_cst in c_parse_error, at c-common.c:5913

[Bug c++/14217] Assignment to vector references fails

[Bug c++/14217] New: Assignment to vector references fails

[Bug c++/14222] [3.3] duplicated conditionl checks leave dangling conditional jumps

[Bug c++/14222] New: [3.3] duplicated conditionl checks leave dangling conditional jumps

[Bug c++/14223] [3.3] duplicated checks leave dangling conditional jumps

[Bug c++/14223] New: [3.3] duplicated checks leave dangling conditional jumps

[Bug c++/14230] [3.3/3.4/3.5 Regression] ICE in cp_expr_size

[Bug c++/14230] ICE in cp_expr_size

[Bug c++/14230] New: ICE in cp_expr_size

[Bug c++/14232] New: static initialization bug

[Bug c++/14232] static initialization bug

[Bug c++/14233] New: SEGFAULT with -O3 -ffast-math

[Bug c++/14233] SEGFAULT with -O3 -ffast-math

[Bug c++/14234] New: Unresolved symbols for template instantitations

[Bug c++/14234] Unresolved symbols for template instantitations

[Bug c++/14241] ICE when returning template class where template argument is a template function

[Bug c++/14241] New: ICE when returning template class where template argument is a template function

[Bug c++/14242] [3.4 regression] symbol lookup in templates

[Bug c++/14242] New: [3.4 regression] symbol lookup in templates

[Bug c++/14244] New: Regression failure with v3.3: uninstantiated template code not ignored

[Bug c++/14244] Regression failure with v3.3: uninstantiated template code not ignored

[Bug c++/14246] [3.4/3.5 Regression] Problems with templates, ice in write_template_arg_literal

[Bug c++/14246] New: Problems with templates, ice in write_template_arg_literal

[Bug c++/14246] Problems with templates, ice in write_template_arg_literal

[Bug c++/14247] New: Problems with templates, ice in write_template_arg_literal

[Bug c++/14247] Problems with templates, ice in write_template_arg_literal

[Bug c++/14250] [3.3/3.4/3.5 Regression] switch() does not seem to see operator int() in template class

[Bug c++/14250] New: switch() does not seem to see operator int() in template class

[Bug c++/14258] [3.3/3.4/3.5 Regression] typename in a using declaration reports bogus error

[Bug c++/14258] [3.4/3.5 Regression] typename in a using declaration reports bogus error

[Bug c++/14258] New: using typename (only when necessary) in a using declaration reports bogus error

[Bug c++/14260] [3.4 REGRESSION] default arguments are only permitted for function parameters

[Bug c++/14260] [3.4/3.5 Regression] default arguments are only permitted for function parameters

[Bug c++/14260] New: [3.4 REGRESSION] default arguments are only permitted for function parameters

[Bug c++/14263] [3.3/3.4/3.5 Regression] Cryptic diagnostic for cast from virtual base class not using dynamic_cast

[Bug c++/14263] New: Cryptic diagnostic for cast from virtual base class not using dynamic_cast

[Bug c++/14267] [3.3/3.4/3.5 Regression] ICE on invalid, cast to lval related

[Bug c++/14267] ICE on invalid, cast to lval related

[Bug c++/14267] New: ICE on invalid, cast to lval related

[Bug c++/14268] internal compiler error

[Bug c++/14268] New: internal compiler error

[Bug c++/14270] 3.4 Regression, ice in write_template_arg_literal

[Bug c++/14270] [3.4/3.5 Regression] ICE in write_template_arg_literal

[Bug c++/14270] [3.4/3.5 Regression], ice in write_template_arg_literal

[Bug c++/14270] New: 3.4 Regression, ice in write_template_arg_literal

[Bug c++/14271] New: problem to get value on pointer to class-function

[Bug c++/14271] problem to get value on pointer to class-function

[Bug c++/14273] __attribute__ ((__unused__)) fails when attached to a label in c++

[Bug c++/14273] New: __attribute__ ((__unused__)) fails when attached to a label in c++

[Bug c++/14278] [3.4/3.5 Regression] fails when calling through a function pointer

[Bug c++/14278] New: fails when calling through a function pointer

[Bug c++/14281] New: Regression in v3.4: friend class not working

[Bug c++/14281] Regression in v3.4: friend class not working

[Bug c++/14283] [3.5 regression] ICE in cp_parser_parse_and_diagnose_invalid_type_name

[Bug c++/14283] New: [3.5 regression] ICE in cp_parser_parse_and_diagnose_invalid_type_name

[Bug c++/14284] [3.4/3.5 regression] Failure to select obvious template specialisation

[Bug c++/14284] New: v3.4 regression: Failure to select obvious template specialisation

[Bug c++/14284] v3.4 regression: Failure to select obvious template specialisation

[Bug c++/14290] Namespaces shadow direct struct declarations

[Bug c++/14290] New: Namespaces shadow direct struct declarations

[Bug c++/14301] Compilation errors on Cygwin

[Bug c++/14301] New: Compilation errors on Cygwin

[Bug c++/14302] New: arm-linux g++ error

[Bug c++/14307] [tree-ssa] ICE in copy_to_mode_reg (explow.c:675)

[Bug c++/14307] New: [tree-ssa] ICE in copy_to_mode_reg (explow.c:675)

[Bug c++/14317] New: Template functions linking problem

[Bug c++/14317] Template functions linking problem

[Bug c++/14318] New: sizeof() does too much

[Bug c++/14318] sizeof() does too much

[Bug c++/14324] [3.4/3.5 Regression] Multiple static definitions are not unique

[Bug c++/14324] New: Muliiple static definitions are not unique

[Bug c++/14337] [3.4/3.5 Regression] function overload rules don't handle the caller as a template

[Bug c++/14337] New: function overload rules don't handle the caller as a template

[Bug c++/14339] [3.3 Regression] Bogus extra error message after redefinition of member function

[Bug c++/14339] New: Bogus extra error message after redefinition of member function

[Bug c++/14340] [3.3/3.4/3.5 Regression] libstdc++: failure to convert iterator to const_iterator

[Bug c++/14340] New: libstdc++ debug mode: failure to convert iterator to const_iterator

[Bug c++/14349] ICE on function pointer template parameter

[Bug c++/14349] New: ICE on function pointer template parameter

[Bug c++/2204] G++ doesn't check (member) function parameter for abstract-ness.

[Bug c++/2708] ambiguity check fails for namespace vs class scope

[Bug c++/2892] array addresses corrupted when using template classes

[Bug c++/3576] Compiling the attach code causes g++ to segfault

[Bug c++/3610] ICE on C++ code

[Bug c++/3761] ICE in check_template_shadow, at cp/pt.c:2013, with friend and strange class hierarchy

[Bug c++/396] const int null = 0;

[Bug c++/4205] function template can call other function with incorrect parameters

[Bug c++/4672] [3.3/3.4/3.5 Regression] [DR 214] Template parameter deduction fails for overloaded template functions.

[Bug c++/5026] __attribute__ ((unused) seems misdocumented

[Bug c++/5509] -Wunused-parameter and tree inlining

[Bug c++/5802] spurious "might be used uninitialized" warning with dynamic_cast

[Bug c++/6709] typeof() cannot be used with the :: operator

[Bug c++/8211] -Weffc++ warns about copyable classes with func ptr members

[Bug c++/853] Error "`class X::Y' is private" reported at wrong line

[Bug c++/9283] __attribute__((visibility ("hidden"))) not supported for class/struct

[Bug c++/9393] [3.3 regression] Anonymous namespaces and compiling the same file twice

[Bug c++/9634] [3.4/3.5 regression] [DR224] Injected class name as qualifier should not make the name dependent

[Bug c++/9737] [DR150] Partial template specialisation selection failure involving template parameter defaults

[Bug c++/9844] Segmentation fault using function with return value with attribute for mode

[Bug c++/9851] [3.4/3.5 regression] confusing error message when using '.', not '->'

[Bug c++/9941] [3.3 regression] typeinfo not generated correctly when #pragmas are involved

[Bug c++/9941] [3.3/3.4/3.5 regression] typeinfo not generated correctly when #pragmas are involved

[Bug c/10676] Using unnamed fields in initializers

[Bug c/11658] Wrong error message

[Bug c/12207] Internal compiler error in size_binop, at fold-const.c:2014

[Bug c/12391] [3.4/3.5 regression] missing warning about assigning to an incomplete type

[Bug c/12794] [tree-ssa] ICE with attribute __alias__

[Bug c/12846] No warning when function pointer cast drops __attribute__ ((regparm))

[Bug c/13050] RFE: Support for implementation-specific format specifiers in format string warnings

[Bug c/13728] [3.4/3.5 regression] Duplicate parameter names not detected

[Bug c/13732] [3.3/3.4/3.5 Regression] internal compiler error with structures with VLAs and functions inside functions

[Bug c/13737] [3.3/3.4/3.5 Regression] gcc.c-torture/compile/20001226-1.c requires far too much memory

[Bug c/13842] [3.3 Regression] static inline emitted when not used

[Bug c/13856] [3.4/3.5 Regression] hidden support broken with builtin functions

[Bug c/13863] [tree-ssa] gcc.dg/uninit-D.c fails

[Bug c/13920] Segmentation Faults with optimization greater than 0

[Bug c/13984] Bad code generated with -O0

[Bug c/13984] New: Bad code generated with -O0

[Bug c/13984] sh-elf-gcc: Bad code generated with -O0

[Bug c/13985] New: [3.4/3.5 regression] ICE in gcc.c-torture/compile/930621-1.c

[Bug c/13994] New: Rejects valid code on GNU extension

[Bug c/13994] Rejects valid code on GNU extension

[Bug c/14005] gcc rounds up when it should round down

[Bug c/14005] New: gcc rounds up when it should round down

[Bug c/14030] missing parameter count check ?

[Bug c/14030] New: missing parameter count check ?

[Bug c/14036] [tree-ssa] [unit-at-a-time] gcc ICEs on redeclaration of local externs to global declaration

[Bug c/14036] New: tree-ssa gcc ICEs on redeclaration of local externs to global declaration

[Bug c/14047] New: __progmem__ attribute doesn't work

[Bug c/14050] [DR289] c99 restrict doesn't work in abs declarator

[Bug c/14050] c99 restrict doesn't work in abs declarator

[Bug c/14050] New: c99 restrict doesn't work in abs declarator

[Bug c/14053] New: second stage build errors (--with-cpu=601)

[Bug c/14053] second stage build errors (--with-cpu=601)

[Bug c/14062] New: noreturn attribute generates warning "function does return", still creates epilogue code

[Bug c/14062] noreturn attribute generates warning "function does return", still creates epilogue code

[Bug c/14065] New: tree-ssa generates duplicate definision of invisible sybmbol forward defined

[Bug c/14069] [3.3/3.4/3.5 Regression] This input file lets gcc crash

[Bug c/14069] New: This input file lets gcc crash

[Bug c/14076] ICE in dwarf2out add_abstract_origin_attribute

[Bug c/14076] New: ICE in dwarf2out add_abstract_origin_attribute

[Bug c/14087] Core dumped compiling ipchains-1.3.10

[Bug c/14087] ICE with warning in spanish translation

[Bug c/14087] New: Core dumped compiling ipchains-1.3.10

[Bug c/14088] Hexfloat constants with uppercase 0X prefix fail

[Bug c/14090] inline asm statement only compiles with -O

[Bug c/14090] New: inline asm statement only compiles with -O

[Bug c/14094] Anonymous struct initialization

[Bug c/14094] New: Anonymous struct initialization

[Bug c/14095] New: sh-elf build failure in libgcc2

[Bug c/14095] sh-elf build failure in libgcc2

[Bug c/14101] Error message: internal compiler error

[Bug c/14101] New: Error message: internal compiler error

[Bug c/14105] GCC over-optimisating extern

[Bug c/14105] New: GCC over-optimisating extern

[Bug c/14117] Internal Compiler Error in function pi_allocdesc

[Bug c/14117] New: Internal Compiler Error in function pi_allocdesc

[Bug c/14127] New: Problem installing 3.3.2

[Bug c/14127] Problem installing 3.3.2

[Bug c/14128] internal compiler error: asm clobber conflict with output operand

[Bug c/14128] New: internal compiler error: asm clobber conflict with output operand

[Bug c/14133] [3.4/3.5 Regression] Duplicate diagnostics on redeclaration

[Bug c/14133] New: Duplicate diagnostics on redeclaration

[Bug c/14134] New: structure member not defined

[Bug c/14134] structure member not defined

[Bug c/14139] ICE in gen_subprogram_die, at dwarf2out.c:10696

[Bug c/14139] New: ICE in gen_subprogram_die, at dwarf2out.c:10696

[Bug c/14141] New: static functions incorrectly generate multiple function descriptors

[Bug c/14141] static functions incorrectly generate multiple function descriptors

[Bug c/14142] [3.3 Regression] attribute(aligned())) has no effect with typedef's

[Bug c/14142] New: attribute(aligned())) has no effect with typedef's

[Bug c/14146] New: GCC 3.3-branch (only) has an ICE for sparc64

[Bug c/14147] New: Cross-Compilation fails

[Bug c/14149] libgcc2.c:731: internal compiler error: in extract_constrain_insn_cached, at recog.c:2090

[Bug c/14149] New: libgcc2.c:731: internal compiler error: in extract_constrain_insn_cached, at recog.c:2090

[Bug c/14151] New: new-ra get frame size incorrect

[Bug c/14157] New: undefined reference to `__ctype_b' (can't compile gcc for avr using gcc3.3.3)

[Bug c/14157] undefined reference to `__ctype_b' (can't compile gcc for avr using gcc3.3.3)

[Bug c/14163] hppa: glibc-2.3.3 pb to build with gcc-3.[45]

[Bug c/14163] New: hppa: glibc-2.3.3 pb to build with gcc-3.[45]

[Bug c/14165] GCC can't find libraries while compiling AVR cross compiler

[Bug c/14165] New: GCC can't find libraries while compiling AVR cross compiler

[Bug c/14170] e_sqrt.c in newlib compile error

[Bug c/14170] New: e_sqrt.c in newlib compile error

[Bug c/14171] Bootstrap (--enable-intermodule) dies with reg-stack.c:235: error: 'nan' redeclared as different kind of symbol

[Bug c/14175] I can compile this routine on Solaris 2.5 or newer, but not on Linux (Suse 9.0)

[Bug c/14175] New: I can compile this routine on Solaris 2.5 or newer, but not on Linux (Suse 9.0)

[Bug c/14182] New: [3.3.3 regression]arm cross compiler cannot be built

[Bug c/14183] [MIPS]FAIL: gcc.c-torture/execute/930429-1.c execution, -O1

[Bug c/14183] New: [MIPS]FAIL: gcc.c-torture/execute/930429-1.c execution, -O1

[Bug c/14184] [MIPS]FAIL: gcc.c-torture/execute/930429-1.c execution, -O1

[Bug c/14184] New: [MIPS]FAIL: gcc.c-torture/execute/930429-1.c execution, -O1

[Bug c/14185] [MIPS] FAIL: gcc.c-torture/execute/ptr-arith-1.c execution, -O1

[Bug c/14185] New: [MIPS] FAIL: gcc.c-torture/execute/ptr-arith-1.c execution, -O1

[Bug c/14188] New: Suggestion: improve warning message for call through incompatible type

[Bug c/14188] Suggestion: improve warning message for call through incompatible type

[Bug c/14190] [3.3 Regression] __attribute__ ((aligned(8))) inside a union has no effect

[Bug c/14190] New: __attribute__ ((aligned(8))) inside a union has no effect

[Bug c/14191] [3.3 Regression] alignment of types is ignored for struct members

[Bug c/14191] New: alignment of types is ignored for struct members

[Bug c/14204] [tree-ssa] Bogus uninitialized warning for stack pointer register var

[Bug c/14204] New: [tree-ssa] Bogus uninitialized warning for stack pointer register var

[Bug c/14205] New: ICE with -M and -include

[Bug c/14210] ICE on -O3

[Bug c/14210] New: ICE on -O3

[Bug c/14214] New: -fnew-ra build issues

[Bug c/14219] [3.3/3.4/3.5 regression] ICE with mmx vector comparison

[Bug c/14219] [3.3/3.4/3.5 regression] ICE with vector comparison

[Bug c/14219] New: mmx code fails to compile

[Bug c/14224] New: GCC generates bad assembly for integer division

[Bug c/14228] New: Stackoverflow in gimplifier (gcc.dg/20020425-1.c)

[Bug c/14228] Stackoverflow in gimplifier (gcc.dg/20020425-1.c)

[Bug c/14235] ICE in verify_local_live_at start (flow.c:546) on 2004-02-18 snapshot

[Bug c/14235] New: ICE in verify_local_live_at start (flow.c:546) on 2004-02-18 snapshot

[Bug c/14249] internal compiler error: in push_reload, at reload.c:1315

[Bug c/14249] New: internal compiler error: in push_reload, at reload.c:1315

[Bug c/14251] Coreutils POSIX2_VERSION as 200112L

[Bug c/14251] New: Coreutils POSIX2_VERSION as 200112L

[Bug c/14256] New: Vector extensions cause internal compiler error

[Bug c/14257] ICE for dp-bit.c source file of gnu 3.3.3 gcc compiler

[Bug c/14257] New: ICE for dp-bit.c source file of gnu 3.3.3 gcc compiler

[Bug c/14259] comparison is always true due to limited range of data type

[Bug c/14259] New: comparison is always true due to limited range of data type

[Bug c/14261] Compilation failure due to if-conversion

[Bug c/14261] New: Compilation failure due to if-conversion

[Bug c/14262] New: Structure size computed wrong

[Bug c/14265] New: variable name si_value causes strange errors; sivalue and ui_value not

[Bug c/14265] variable name si_value causes strange errors; sivalue and ui_value not

[Bug c/14269] compiler error: in cselib_record_set, at cselib.c:1196

[Bug c/14269] New: compiler error: in cselib_record_set, at cselib.c:1196

[Bug c/14272] New: miscompilation of __exchange_and_add (atomicity.h)

[Bug c/14274] Internal compiler error in assemble_integer, at varasm.c:2013

[Bug c/14274] New: Internal compiler error in assemble_integer, at varasm.c:2013

[Bug c/14276] ICE during glibc-2.3.3 build

[Bug c/14276] New: ICE during glibc-2.3.3 build

[Bug c/14282] New: ICE in sh-elf-gcc with -m4-single-only and -O2

[Bug c/14286] ICE with __builtin_va_start prototype

[Bug c/14286] New: hpux 11.i gcc3.3 compiler errors

[Bug c/14289] ICE in a register array

[Bug c/14289] New: ICE in a register array

[Bug c/14292] internal compiler error: segment fault linuxkernel/irda

[Bug c/14292] New: internal compiler error: segment fault linuxkernel/irda

[Bug c/14294] bogus warning

[Bug c/14294] New: bogus warning

[Bug c/14308] gcc unable to compile gdb-6.0

[Bug c/14308] New: gcc unable to compile gdb-6.0

[Bug c/14313] fail to warn of inconsistent prototype: const char * const vs. const char *

[Bug c/14313] New: gcc i486: fail to warn of inconsistent prototype: const char * const vs. const char *

[Bug c/14314] New: Wrong uninitialized warning.

[Bug c/14314] Wrong uninitialized warning.

[Bug c/14316] New: collect2 doesnt build on windows hosts

[Bug c/14319] incorrect optimization of union of structs with common initial sequences

[Bug c/14319] New: incorrect optimization of union of structs with common initial sequences

[Bug c/14321] New: gcc emitting "movaps" to unaligned memory

[Bug c/14323] New: stored_field (expr.c) should deal with PARALLELs in target

[Bug c/14327] New: -O0 -fdefer-pop generates wrong code

[Bug c/14330] New: using -O3 causes a core whereas -O2 and under work

[Bug c/14331] New: please add option to suppress warning message "no newline at end of file"

[Bug c/14333] __stdcall in function declaration in structure ignored?

[Bug c/14333] New: __stdcall in function declaration in structure ignored?

[Bug c/14338] internal compiler error dp-bits.c line 412 (thumb)

[Bug c/14338] New: internal compiler error dp-bits.c line 412 (thumb)

[Bug c/14343] internal error while using vector instructions [gcc 3.4.0 20040225 (prerelease)].

[Bug c/14343] New: internal error while using vector instructions [gcc 3.4.0 20040225 (prerelease)].

[Bug c/14345] New: internal compiler error: in cselib_record_set, at cselib.c:1196

[Bug c/14348] New: Cannot bootstrap GCC-3.3.4-pre with GCC-3.5 (experimental)

[Bug c/169] alloca in function arguments (2.95.2)

[Bug c/3325] cast of bit-field to same type gets discarded

[Bug c/456] constant expressions constraints

[Bug c/7860] few new suggested warnings

[Bug c/8093] Wrong warning by gcc suggests adding dead code to end of function

[Bug c/9071] Warning for blocks not closed in same file as opened in

[Bug c/9376] Typo in libgcc2.c __subvdi3

[Bug debug/10005] gcc -O -g does not produce location information for aliases of a variable

[Bug debug/11816] Incorrect debugging information for anonymous structures

[Bug debug/11983] [3.4/3.5 Regression] ICE in dwarf-2 on code using altivec

[Bug debug/12103] [3.4/3.5 Regression] -g only crash (segfault) with a forward declared class used as a template parameter

[Bug debug/12934] [3.4/3.5 regression] ICE with variable sized arrays in loc_descriptor_from_tree, at dwarf2out.c:8780

[Bug debug/13956] [3.4/3.5 regression] incorrect stabs for nested local variables

[Bug debug/13956] New: [3.4/3.5 regression] incorrect stabs for nested local variables

[Bug debug/13974] [3.4/3.5 regression] bad line marker in debug info

[Bug debug/13974] New: [3.4/3.5 regression] bad line marker in debug info

[Bug debug/14022] New: asm() should start a new line table entry

[Bug debug/14048] [regression tree-ssa] bad debug line numbers near "return" statement, c++

[Bug debug/14048] New: [regression tree-ssa] bad debug line numbers near "return" statement, c++

[Bug debug/14049] [regression tree-ssa] bad debug block info, dwarf-2, c++

[Bug debug/14049] New: [regression tree-ssa] bad debug block info, dwarf-2, c++

[Bug debug/14058] [3.5 Regression] ICE in vt_add_function_parameters

[Bug debug/14058] New: ICE in vt_add_function_parameters

[Bug debug/14079] [3.3/3.4/3.5 Regression] wrong debug info for extern boolean variable in debug mode

[Bug debug/14079] wrong debug info for extern boolean variable in debug mode

[Bug debug/14080] extern "C" {} fuctions treated as C++ in dwarf2 section

[Bug debug/14080] New: extern "C" {} fuctions treated as C++ in dwarf2 section

[Bug debug/14095] [3.5 Regression] sh-elf build failure in libgcc2

[Bug debug/14114] [3.4/3.5 Regression] [unit-at-a-time] ICE in gen_subprogram_die

[Bug debug/14114] New: ICE in gen_subprogram_die

[Bug debug/14139] [3.4/3.5 Regression] [unit-at-a-time] ICE in gen_subprogram_die, at dwarf2out.c:10696

[Bug debug/14168] New: Unneeded DIEs output for imported declarations

[Bug debug/14168] Unneeded DIEs output for imported declarations

[Bug debug/14169] New: Unneeded base types output in dwarf2

[Bug debug/14169] Unneeded base types output in dwarf2

[Bug debug/14328] [3.3/3.4/3.5 Regression] gcc3.2.2 generates incorrect debugging enum values

[Bug debug/14328] New: gcc3.2.2 generates incorrect debugging enum values

[Bug debug/8354] Incorrect DWARF-2/3 emitted for const + array

[Bug debug/9963] [CygWin] g++ -gcoff report "C_EFCN symbol out of scope"

[Bug driver/2252] If 'as' crashes gcc points you to the gcc bug site

[Bug fortran/13253] [gfortran] ICE when using DIMENSION and CHARACTER

[Bug fortran/13433] [gfortran] ICE in assumed-length character function (trans-decl.c)

[Bug fortran/13909] [gfortran] f77 style logical*1 variables unusable

[Bug fortran/13930] [gfortran] derived type with intent(in) attribute not accepted

[Bug fortran/13939] [gfortran] Does not accept missing subroutine arguments like g77

[Bug fortran/13940] [gfortran] F77 code accepted by g77 causes ICE in gfortran

[Bug fortran/13955] [gfortran] LAPACK file causes ICE (zhbgst.f)

[Bug fortran/13955] New: [gfortran] LAPACK file causes ICE (zhbgst.f)

[Bug fortran/14038] New: [gfortan] Mangled character in Hollerith

[Bug fortran/14054] [gfortran] ICE on statement function

[Bug fortran/14054] New: [gfortran] ICE on statement function

[Bug fortran/14055] [gfortran] Constants with a leading + in DATA are always zero

[Bug fortran/14055] New: [gfortran] Constants with a leading + in DATA are always zero

[Bug fortran/14056] [gfortran] Error passing intrinsic function as actual argument in subroutine

[Bug fortran/14056] New: [gfortran] Error passing intrinsic function as actual argument in subroutine

[Bug fortran/14059] [gfortran] Underflow while compiling a constant expression

[Bug fortran/14059] New: [gfortran] Underflow while compiling a constant expression

[Bug fortran/14066] [gfortran] Infinite DO loops not recognized.

[Bug fortran/14066] New: [gfortran] Infinite DO loops not recognized.

[Bug fortran/14067] [gfortran] ICE when character data statement overflows declared size

[Bug fortran/14067] New: [gfortran] ICE when character data statement overflows declared size

[Bug fortran/14077] [gfortran] Data statement within a module that doesn't initialize a whole array creates an error

[Bug fortran/14077] Data statement within a module that doesn't initialize a whole array creates an error

[Bug fortran/14077] New: Data statement within a module that doesn't initialize a whole array creates an error

[Bug fortran/14081] [gfortran] Not Implemented: CHARACTER inside COMMON block

[Bug fortran/14081] New: [gfortran] Not Implemented: CHARACTER inside COMMON block

[Bug fortran/14082] [gfortran] Not Implemented: arrays of strings

[Bug fortran/14082] New: [gfortran] Not Implemented: arrays of strings

[Bug fortran/14129] [g77] gcc/f/lex.c buffer size limitation.

[Bug fortran/14129] New: gcc/f/lex.c buffer size limitation.

[Bug inline-asm/10153] [3.3/3.4 regression] selection of %dil or %sil on ia32 by valid C source

[Bug inline-asm/11203] source doesn't compile with -O0 but they compile with -O3

[Bug inline-asm/6162] [3.3 regression] i386 asm reloader ice in reload_cse_simplify_operands

[Bug inline-asm/6162] [3.3/3.4 regression] i386 asm reloader ice in reload_cse_simplify_operands

[Bug java/12890] [3.3 Regression] ICE on compilation of class with throwing method

[Bug java/12911] Class initialization optimization pessimization

[Bug java/13468] [3.5 Regression] interpret.cc should register ffi closure stubs

[Bug java/13508] ICE on assert in inner class

[Bug java/13743] Debug Info for Java breaks inferior calls

[Bug java/13892] Incompatibility w/Suns JRE

[Bug java/13892] UTF8 encoding problem/JRE incompatiblity w/small testcase

[Bug java/13948] [3.4/3.5 Regression] GCJ segmentation fault while compiling GL4Java .class files

[Bug java/13948] GCJ segmentation fault while compiling GL4Java .class files

[Bug java/13964] jc1 crash when compiling class with circular definitions

[Bug java/13964] New: jc1 crash when compiling class with circular definitions

[Bug java/14023] gcj should call GC allocators directly

[Bug java/14023] New: gcj should call GC allocators directly

[Bug java/14044] libjava

[Bug java/14044] New: libjava

[Bug java/14045] New: replaceAll is missing from java.lang.String

[Bug java/14070] -jar argument should set the manifest Class-path recursively

[Bug java/14070] New: -jar argument should set the manifest Class-path recursively

[Bug java/14074] libgcj

[Bug java/14074] New: libgcj

[Bug java/14100] New: Regression in GCC 3.4, the attached app no longer compiles

[Bug java/14100] Regression in GCC 3.4, the attached app no longer compiles

[Bug java/14104] java testsuite fails "linking simple"

[Bug java/14104] New: java testsuite fails "linking simple"

[Bug java/14111] libgcj

[Bug java/14111] New: libgcj

[Bug java/14144] New: Serialisation bug with abstract classes

[Bug java/14144] Serialisation bug with abstract classes

[Bug java/14164] New: [Win32] gcj fails to load resource bundle based on classloader

[Bug java/14212] Can't mix compiled and interpreted code with 3.3.3

[Bug java/14212] New: Can't mix compiled and interpreted code with 3.3.3

[Bug java/14231] [3.4/3.5 Regression]Incorrect interface method called when compiling against .class files

[Bug java/14231] [Regression]Incorrect interface method called when compiling against .class files

[Bug java/14231] Incorrect interface method called when compiling against .class files

[Bug java/14231] New: Incorrect interface method called when compiling against .class files

[Bug java/14315] Java compiler is not parallel make safe

[Bug java/14315] New: Java compiler is not parallel make safe

[Bug java/6993] info page outdated about Input files

[Bug java/8626] warn for non-static references to static members

[Bug java/8627] warn about unused imports

[Bug libf2c/10885] On 64-bit targets one can write >2Gb records in sequential files, but not in direct access files

[Bug libfortran/12839] [gfortran] incorrect IO of Inf

[Bug libfortran/12921] [gfortran] direct access i/o doesn't work

[Bug libfortran/13919] [gfortran] Runtime 'internal error' in IO on i686-pc-linux-gnu only

[Bug libfortran/14038] [gfortan] Mangled character in Hollerith

[Bug libfortran/14325] [tree-ssa] libgfortran does not build with newlib on arm-elf

[Bug libfortran/14325] New: [tree-ssa] libgfortran does not build with newlib on arm-elf

[Bug libfortran/14334] [libgfortran] L edit descriptor does not work.

[Bug libfortran/14334] New: [libgfortran] L edit descriptor does not work.

[Bug libgcj/10353] [3.3/3.4/3.5 regression] Java testsuite failures Array_3, TLtest, Thread_Join, Thread_Wait_Interrupt & Throw_2

[Bug libgcj/13107] Wrong verification error in gij: recursive subroutine call

[Bug libgcj/13212] AttachCurrentThread() not working

[Bug libgcj/13708] [3.4/3.5 regression] static java program crashes at startup, UTF-8 environment

[Bug libgcj/13972] gcj's URL() does not handle ContextURL + "/redir?http://domain2.com/index.html" correctly.

[Bug libgcj/13972] New: gcj's URL() does not handle ContextURL + "/redir?http://domain2.com/index.html" correctly.

[Bug libgcj/14009] libgcj HttpURLConnection does not handle situation where retrieving url without trailing slash after domain.

[Bug libgcj/14009] libgcj HttpURLConnection does not handle situation where retrieving url without training slash after domain.

[Bug libgcj/14009] New: libgcj HttpURLConnection does not handle situation where retrieving url without training slash after domain.

[Bug libgcj/14012] HttpURLConnection.setRequestProperty() is not case insensitive

[Bug libgcj/14012] New: HttpURLConnection.setRequestProperty() is not case insensitive

[Bug libgcj/14013] HttpURLConnection.receiveReply() does not deal with code only responses

[Bug libgcj/14013] New: HttpURLConnection.receiveReply

[Bug libgcj/14045] replaceAll is missing from java.lang.String

[Bug libgcj/14045] replaceAll is not fully implemente in java.lang.String

[Bug libgcj/14070] gij and -jar argument should set the manifest Class-path recursively

[Bug libgcj/14126] libgcj

[Bug libgcj/14126] New: libgcj

[Bug libgcj/14145] libgcj, Re: Pinskia

[Bug libgcj/14145] New: libgcj, Re: Pinskia

[Bug libgcj/14225] New: when using gcj cni calls within a pthread i get a segfault

[Bug libgcj/14225] when using gcj cni calls within a pthread i get a segfault

[Bug libgcj/14264] New: libjava testsuite doesnt work with i18ned gcj

[Bug libgcj/14296] 3.4 regression: Method.Invoke

[Bug libgcj/14296] [3.4/3.5 Regression] 3.4 regression: Method.Invoke

[Bug libgcj/14296] New: 3.4 regression: Method.Invoke

[Bug libgcj/6219] java.util.Propertiies failures with Mauve

[Bug libgcj/9124] [win32] URLClassLoader.getResource() should return canonicalized file URLs

[Bug libmudflap/14118] [tree-ssa] h8300-elf, avr-elf, m68k-elf ports don't build

[Bug libmudflap/14120] [tree-ssa] m32r-port and mcore-elf ports don't build

[Bug libobjc/13834] [3.3 Regression] forward / performv broken

[Bug libobjc/9751] malloc of strlen, not strlen+1

[Bug libstdc++/10246] [3.4/3.5 regression] libsupc++ needs to be independent (again) of libstdc++

[Bug libstdc++/10606] uncaught_exception() returns false too early

[Bug libstdc++/10703] [3.3 regression] testsuite/27_io/istream_unformatted.cc fails

[Bug libstdc++/11193] [3.4/3.5 Regression] revision 1.126 of configure.in broke pre-installed newlib builds

[Bug libstdc++/11352] crash while internal padding numeric 0

[Bug libstdc++/11722] Unbuffered filebuf::sgetn is slow

[Bug libstdc++/12071] [3.4/3.5 Regression] libstdc++/configure bombs out, cannot do linker tests

[Bug libstdc++/13583] [3.3/3.4/3.5 Regression] __use_cache not threadsafe

[Bug libstdc++/13731] [3.4 regression] Low level I/O not safe wrt short writes

[Bug libstdc++/13731] [3.4/3.5 regression] Low level I/O not safe wrt short writes

[Bug libstdc++/13858] Bad error handling in basic_filebuf::imbue

[Bug libstdc++/13924] #include<vector> imports partial definition of std::abs

[Bug libstdc++/13943] call of overloaded `llabs(int)' is ambiguous

[Bug libstdc++/13976] ext/new_allocator.h:81: warning: unused parameter '__h'

[Bug libstdc++/13976] New: ext/new_allocator.h:81: warning: unused parameter '__h'

[Bug libstdc++/14001] Undefined reference to std::string::_Rep::_S_empty_rep_storage when compiling with -O2.

[Bug libstdc++/14004] New: seekg/eof problem: reading from a file twice fails

[Bug libstdc++/14004] seekg/eof problem: reading from a file twice fails

[Bug libstdc++/14021] lacking conversion from `std::streampos' to `std::streamoff'

[Bug libstdc++/14026] std::uncaught_exception is true although there are no uncaught exceptions (rethrow, ghost exception)

[Bug libstdc++/14039] bug in std::find

[Bug libstdc++/14043] error compiling new version.

[Bug libstdc++/14043] New: error compiling new version.

[Bug libstdc++/14061] New: poor performance of std::sort on large lexicographic c-string sort

[Bug libstdc++/14061] poor performance of std::sort on large lexicographic c-string sort

[Bug libstdc++/14071] locale::global doesn't always call setlocale

[Bug libstdc++/14071] New: locale::global doesn't always call setlocale

[Bug libstdc++/14072] basic_ios::imbue leaves dangling pointers

[Bug libstdc++/14072] New: basic_ios::imbue leaves dangling pointers

[Bug libstdc++/14078] Manipulators are slow

[Bug libstdc++/14078] New: Manipulators are slow

[Bug libstdc++/14097] [3.4 only] Severe disparity between stdio_filebuf and stdio_sync_filebuf.

[Bug libstdc++/14097] New: Severe disparity between stdio_filebuf and stdio_sync_filebuf.

[Bug libstdc++/14097] Severe disparity between stdio_filebuf and stdio_sync_filebuf.

[Bug libstdc++/14098] [3.4 only] typeinfo issue with __gnu_cxx::stdio_sync_filebuf

[Bug libstdc++/14098] New: typeinfo issue with __gnu_cxx::stdio_sync_filebuf

[Bug libstdc++/14098] typeinfo issue with __gnu_cxx::stdio_sync_filebuf

[Bug libstdc++/14112] New: Problem with Multi Threading safety in GCC 2.95.2

[Bug libstdc++/14112] Problem with Multi Threading safety in GCC 2.95.2

[Bug libstdc++/14125] New: std::ios_base::internal fails

[Bug libstdc++/14125] std::ios_base::internal fails

[Bug libstdc++/14173] [3.4/3.5 Regression] cvs20040211: -fpack-struct crashes on hello_world.cpp

[Bug libstdc++/14173] New: cvs20040211: -fpack-struct crashes on hello_world.cpp

[Bug libstdc++/14174] bug and workaround for stringstream tellg and operator>>

[Bug libstdc++/14174] New: bug and workaround for stringstream tellg and operator>>

[Bug libstdc++/14176] standard allocator crashes when deallocating segment of zero length.

[Bug libstdc++/14220] New: num_put::do_put() undesired float/double behavior

[Bug libstdc++/14220] num_put::do_put() undesired float/double behavior

[Bug libstdc++/14245] New: problem with user-defined allocators in std::basic_string

[Bug libstdc++/14245] problem with user-defined allocators in std::basic_string

[Bug libstdc++/14248] Bit_vectors do not work (regression)

[Bug libstdc++/14248] New: Bit_vectors do not work (regression)

[Bug libstdc++/14252] [3.4/3.5 regression] Problems with count and iterator_traits<istreambuf_iterator<char> >::difference_type

[Bug libstdc++/14252] New: Problems with count and cin (3.4 regression)

[Bug libstdc++/14252] Problems with count and cin (3.4 regression)

[Bug libstdc++/14253] [3.4/3.5 Regression] problems with global slices and valarrays

[Bug libstdc++/14253] New: problems with global slices and valarrays (regression)

[Bug libstdc++/14253] problems with global slices and valarrays (regression)

[Bug libstdc++/14254] New: Problems with masked valarrays

[Bug libstdc++/14277] Dependency tracking of libstdc++ broken

[Bug libstdc++/14277] New: Dependency tracking of libstdc++ broken

[Bug libstdc++/14306] comparison of postype and size_t breaks ACE

[Bug libstdc++/14306] New: comparison of postype and size_t breaks ACE

[Bug libstdc++/14311] New: builtins for atomic operations needed

[Bug libstdc++/14320] [3.4/3.5 Regression] istreambuf_iterator::difference_type is not a signed integral type

[Bug libstdc++/14320] New: [3.4/3.5 Regression] istreambuf_iterator::difference_type is not a signed integral type

[Bug libstdc++/14340] libstdc++ Debug mode: failure to convert iterator to const_iterator

[Bug libstdc++/3247] valarray private member

[Bug libstdc++/5625] [mips] exception unwinding creates invalid pointer on mips

[Bug middle-end/12454] [tree-ssa] Regression in g++.dg/parse/stack1.C

[Bug middle-end/12794] [tree-ssa] ICE with attribute __alias__

[Bug middle-end/12922] MIPS gcc.c-torture/compile/20001226-1.c times out...

[Bug middle-end/13066] [tree-ssa] ICE in in invert_truthvalue, at fold-const.c:2554

[Bug middle-end/13127] [tree-ssa] Inlining causes spurious "might be used uninitialized" warnings

[Bug middle-end/13325] [tree-ssa] Weird warning on memcpy(d, s, 0)

[Bug middle-end/13392] [3.3/3.4 regression] ICE in convert_from_eh_region_ranges_1, at except.c:1133

[Bug middle-end/13448] [3.3 Regression] gcc 3.3.2, internal error when -O3 and trying to modify function const arg

[Bug middle-end/13448] [3.3/3.4/3.5 Regression] gcc 3.3.2, internal error when -O3 and trying to modify function const arg

[Bug middle-end/13696] [3.4 Regression] enum not useable as array index?

[Bug middle-end/13696] [3.4/3.5 Regression] enum not useable as array index?

[Bug middle-end/13775] [3.4/3.5 Regression] Many C++ compile-time regression in 3.4.0 in comparison with 3.3.2

[Bug middle-end/13779] [3.4 only] powerpc64: incorrect initialization of 'long long' with constant

[Bug middle-end/13811] [gfortran/tree-ssa] -fdump-tree-all causes ICE at tree-inline.c:648

[Bug middle-end/13938] [3.5 Regression] ICE when rounding double to long long

[Bug middle-end/14060] An unused register is saved to the stack.

[Bug middle-end/14060] New: An unused register is saved to the stack.

[Bug middle-end/14084] New: Reg allocator changes REG_EXPR

[Bug middle-end/14084] Reg allocator changes REG_EXPR

[Bug middle-end/14084] Reg allocator incorrectly changes REG_OFFSET

[Bug middle-end/14088] New: Hexfloat constants with uppercase 0X prefix fail

[Bug middle-end/14092] [3.5 Regression] fold strips conversion from pointer to integer

[Bug middle-end/14092] fold strips conversion from pointer to integer

[Bug middle-end/14092] New: fold strips conversion from pointer to integer

[Bug middle-end/14107] [tree-ssa] Return warnings don't work without optimizations enabled

[Bug middle-end/14107] New: [tree-ssa] Return warnings don't work without optimizations enabled

[Bug middle-end/14113] -O2 corrupts stack for small example

[Bug middle-end/14153] [tree-ssa] ICE in tree-ssa-operands.c:add_stmt_operand

[Bug middle-end/14153] New: [tree-ssa] ICE in tree-ssa-operands.c:add_stmt_operand

[Bug middle-end/14192] New: Restrict pointers don't help

[Bug middle-end/14192] Restrict pointers don't help

[Bug middle-end/14193] New: Restrict pointers don't help

[Bug middle-end/14193] Restrict pointers don't help

[Bug middle-end/14197] [tree-ssa] Wrong code for bcopy/memmove (string-asm-2.c)

[Bug middle-end/14197] New: Wrong code for bcopy/memmove (string-asm-2.c)

[Bug middle-end/14197] Wrong code for bcopy/memmove (string-asm-2.c)

[Bug middle-end/14201] [tree-ssa] float -> int (in mem) with -mieee causes unrecognizable insn+segv

[Bug middle-end/14203] [3.4 regression] ICE on warning about uninitialized variable

[Bug middle-end/14203] [3.4/3.5 regression] ICE on warning about uninitialized variable

[Bug middle-end/14218] [tree-ssa] Failure of gcc.c-torture/execute/920501-5.c

[Bug middle-end/14218] Failure of gcc.c-torture/execute/920501-5.c

[Bug middle-end/14218] New: Failure of gcc.c-torture/execute/920501-5.c

[Bug middle-end/14236] dynamically-sized arrays break alloca()

[Bug middle-end/14236] New: dynamically-sized arrays break alloca()

[Bug middle-end/14286] ICE with __builtin_va_start prototype

[Bug middle-end/14288] New: warning: 'SR.29591' may be used uninitialized in this function

[Bug middle-end/14289] [3.3/3.4/3.5 Regression] ICE in a register array

[Bug middle-end/14307] [tree-ssa] ICE in copy_to_mode_reg (explow.c:675)

[Bug middle-end/14307] [tree-ssa][merge] ICE in copy_to_mode_reg (explow.c:675)

[Bug middle-end/14310] [tree-ssa] nonlocal goto savearea mode != STACK_SAVEAREA_MODE

[Bug middle-end/14310] New: nonlocal goto savearea mode != STACK_SAVEAREA_MODE

[Bug middle-end/14323] stored_field (expr.c) should deal with PARALLELs in target

[Bug middle-end/9200] C testsuite failures in compile/simd-5.c w/-m64 or on sparcv9/sparc64

[Bug middle-end/9707] Unnecessary range test in switches with less than 4 cases

[Bug objc/7098] ObjC front end doesn't understand attributes on method parameters

[Bug optimization/10348] testsuite failure in execute/20020720-1.c with -mcpu=v9 -fpic/-fPIC

[Bug optimization/10684] [3.3/3.4/3.5 regression] register variable update disappears when using -O

[Bug optimization/11320] [3.3 regression] Scheduler bug

[Bug optimization/11841] [3.3 Regression] The code compiled with -funroll-loops crashes

[Bug optimization/11864] [3.3 regression] miscompiles zero extention and test

[Bug optimization/12092] ICE: Floating point exception

[Bug optimization/12143] [new-ra] Internal error with -fnew-ra -O

[Bug optimization/12147] Wrong code with -O2 in context of reload

[Bug optimization/12786] -fvpt does not work with signed mod or signed divide with a constant negative number

[Bug optimization/12792] {u,}int64_t variables are incorrectly reported as used uninitialized

[Bug optimization/12837] The mod vpt does not work on PPC

[Bug optimization/12863] [3.4/3.5 regression] basic block reordering fails for fallthru of casesi

[Bug optimization/12871] ICE building gnat for native m68k-linux on i486-linux

[Bug optimization/13000] [3.4/3.5 Regression] [unit-at-a-time] Using -O2 cannot detect missing return statement in a function

[Bug optimization/13049] Does not warn on obvious aliasing problem

[Bug optimization/13187] Bug in optimizer?

[Bug optimization/13191] [64bit] Redundant sign extends

[Bug optimization/13222] [3.3 only] -O -funroll-loops miscompiles POOMA test

[Bug optimization/13260] [3.4 Regression] Incorrect optimisation of loop termination condition

[Bug optimization/13299] Unsafe treatment of extended givs

[Bug optimization/13300] Variable incorrectly identified as a biv

[Bug optimization/13347] [tree-ssa] Incorrect code generated for reinterpret_cast<> of pointer-to-member

[Bug optimization/13379] [tree-ssa] miscompiles 2.6.0-test11 Linux kernel

[Bug optimization/13411] segmentation fault occurs in correct code - optimisation problem at O2

[Bug optimization/13424] [3.4 Regression] gcc.dg/20031202-1.c is miscompiled

[Bug optimization/13424] [3.4/3.5 Regression] gcc.dg/20031202-1.c is miscompiled

[Bug optimization/13653] [3.3 regression] -O2 -funroll-loop miscompiles POOMA testcase

[Bug optimization/13712] Executable runs 25% slower than when compiled with INTEL compiler

[Bug optimization/13716] segfaults for big functions with heaps of computed goto

[Bug optimization/13745] [tree-ssa] expressions not converted back to array form

[Bug optimization/13751] [tree-ssa] PHI pruning misses obvious cases

[Bug optimization/13755] [tree-ssa] ICE on legal, depends on .GLOBAL_VAR.

[Bug optimization/13758] [tree-ssa] consecutive stores to the same array element not removed

[Bug optimization/13759] [tree-ssa] consecutive stores to the same structure field not removed

[Bug optimization/13796] [tree-ssa] consecutive stores to globals not removed

[Bug optimization/13799] [tree-ssa] consecutive stores to static vars not removed

[Bug optimization/13839] [3.5 Regression] make gnatlib_and_tools failure on Solaris 9/x86

[Bug optimization/13850] [tree-ssa] Fails to compile ffmpeg on x86: can't find a register in class `GENERAL_REGS' while reloading `asm'

[Bug optimization/13859] [3.5 Regression] ICE in insert_insn_on_edge

[Bug optimization/13862] [3.4?/3.5 Regression] ICE while optimizing asm

[Bug optimization/13869] [tree-ssa] wrong code with a simple loop

[Bug optimization/13875] [tree-ssa] missed jump thread optimization on the tree-level

[Bug optimization/13893] [3.5 regression] ICE emit_pop_insn, at reg-stack.c:922 (regression)

[Bug optimization/13931] [3.4/3.5 Regression] combiner much slower on big basic blocks

[Bug optimization/13951] [tree-ssa] cselib ICE during x86-64 kernel compile with treessa

[Bug optimization/13954] [tree-ssa] SRA does not work for classes that use inheritance

[Bug optimization/13955] [gfortran] LAPACK file causes ICE (zhbgst.f)

[Bug optimization/13958] Conversion from unsigned to double is painfully slow on P4

[Bug optimization/13958] New: Conversion from unsigned to double is painfully slow on P4

[Bug optimization/13962] [tree-ssa] make "fold" use alias information to optimize pointer comparisons

[Bug optimization/13962] New: [tree-ssa] make "fold" use alias information to optimize pointer comparisons

[Bug optimization/13965] [tree-ssa] fold takes into account branch target information at tree level

[Bug optimization/13965] New: [tree-ssa] fold takes into account branch target information at tree level

[Bug optimization/13985] [3.4/3.5 regression] ICE in gcc.c-torture/compile/930621-1.c

[Bug optimization/13987] [3.4/3.5 Regression] compile time regression while compile fold-const.i

[Bug optimization/13987] [3.4?/3.5 Regression] compile time regression while compile fold-const.i

[Bug optimization/13987] New: [3.4?/3.5 Regression] compile time regression while compile fold-const.i

[Bug optimization/13992] Apparent vrsave problem with complex Altivec code and -O2

[Bug optimization/13992] New: Apparent vrsave problem with complex Altivec code and -O2

[Bug optimization/13996] Assembler warning: Use of 'mov' may violate WAW dependency 'GR%, % in 1 - 127' (impliedf), specific resource number is 14

[Bug optimization/13996] New: Assembler warning: Use of 'mov' may violate WAW dependency 'GR%, % in 1 - 127' (impliedf), specific resource number is 14

[Bug optimization/14011] [tree-ssa] C++ doesn't optimize bool as well as C.

[Bug optimization/14011] New: [tree-ssa] C++ doesn't optimize bool as well as C.

[Bug optimization/14016] [tree-ssa] User variable get eliminated, only to be replaced with compiler generated ones

[Bug optimization/14016] New: [tree-ssa] User variable get eliminated, only to be replaced with compiler generated ones

[Bug optimization/14019] fortran if statement with .and. causes optimizer to produce wrong code

[Bug optimization/14019] New: fortran if statement with .and. causes optimizer to produce wrong code

[Bug optimization/14029] [tree-ssa] Miscompilation of unrolled loop

[Bug optimization/14029] [tree-ssa] wrong-code

[Bug optimization/14029] New: [tree-ssa] wrong-code

[Bug optimization/14040] New: ARM cross compiler: error: could not split insn

[Bug optimization/14042] C++ abstraction penalty is high in simple cases

[Bug optimization/14046] [tree-ssa regression] address calculation not moved out of innermost loop

[Bug optimization/14046] New: [tree-ssa regression] address calculation not moved out of innermost loop

[Bug optimization/14052] Combiner weakness

[Bug optimization/14052] New: Combiner weakness

[Bug optimization/14053] second stage build errors (--with-cpu=601)

[Bug optimization/14063] conditional around vec_dss() call disappears at -O2

[Bug optimization/14063] New: conditional around vec_dss() call disappears at -O2

[Bug optimization/14065] [tree-ssa] [unit-at-a-time] generates duplicate definision of invisible sybmbol forward defined

[Bug optimization/14065] [tree-ssa] [unit-at-a-time] generates duplicate definition of invisible sybmbol forward defined

[Bug optimization/14096] [tree-ssa] [unit-at-a-time] verify_cgraph_node failed with always_inline

[Bug optimization/14096] New: verify_cgraph_node failed with always_inline

[Bug optimization/14099] [new-ra] ICE in check_colors

[Bug optimization/14099] New: ICE in check_colors

[Bug optimization/14109] [tree-ssa]Can not compile correctly with -O1 option on IA64.

[Bug optimization/14109] Can not compile correctly with -O1 option on IA64.

[Bug optimization/14109] New: Can not compile correctly with -O1 option on IA64.

[Bug optimization/14110] altivec code misoptimized with any -O

[Bug optimization/14110] New: altivec code misoptimized with any -O

[Bug optimization/14113] [3.3 regression] -O2 corrupts stack

[Bug optimization/14119] libjava Array_3 test fails at -O1

[Bug optimization/14119] New: libjava Array_3 test fails at -O1

[Bug optimization/14121] New: use inline assembler register constraints as home register hints

[Bug optimization/14121] use inline assembler register constraints as home register hints

[Bug optimization/14135] New: No sibcalling for some obvious places (happens in java's front-end)

[Bug optimization/14135] No sibcalling for some obvious places (happens in java's front-end)

[Bug optimization/14151] [new-ra] new-ra get frame size incorrect

[Bug optimization/14153] [tree-ssa] ICE in tree-ssa-operands.c:add_stmt_operand

[Bug optimization/14187] [tree-ssa] restricted pointers should not alias

[Bug optimization/14187] [tree-ssa] restricted pointers should not alias on the tree level

[Bug optimization/14187] New: [tree-ssa] restricted pointers should not alias

[Bug optimization/14194] [tree-ssa] verify_ssa fails (missing definition for SSA_NAME) with __builtin_expect

[Bug optimization/14194] New: verify_ssa fails (missing definition for SSA_NAME) with __builtin_expect

[Bug optimization/14196] [tree-ssa] ICE with __builtin_isgreater

[Bug optimization/14196] New: [tree-ssa] ICE with __builtin_isgreater

[Bug optimization/14200] [MIPS] FAIL: gcc.c-torture/execute/20020720-1.c

[Bug optimization/14200] New: [MIPS] FAIL: gcc.c-torture/execute/20020720-1.c

[Bug optimization/14201] New: [tree-ssa] float -> int (in mem) with -mieee causes unrecognizable insn+segv

[Bug optimization/14214] [new-ra] build issues

[Bug optimization/14227] [3.5 Regression] Poor code for varargs functions.

[Bug optimization/14227] [regression] Poor code for varargs functions.

[Bug optimization/14227] New: [regression] Poor code for varargs functions.

[Bug optimization/14229] [3.5 regression] 20000504-1.c:15: error: missing barrier after block 1

[Bug optimization/14229] New: [regression 3.5] 20000504-1.c:15: error: missing barrier after block 1

[Bug optimization/14233] SEGFAULT with -O3 -ffast-math

[Bug optimization/14235] [3.4/3.5 Regression] ICE in verify_local_live_at start (flow.c:546)

[Bug optimization/14235] [3.4/3.5 Regression] ICE in verify_local_live_at start (flow.c:546) on 2004-02-18 snapshot

[Bug optimization/14235] ICE in verify_local_live_at start (flow.c:546) on 2004-02-18 snapshot

[Bug optimization/14237] New: suboptimal comparison between long and long long

[Bug optimization/14237] suboptimal comparison between long and long long

[Bug optimization/14240] [3.4/3.5 Regression] crossjumping does not update labels in constant pool

[Bug optimization/14240] crossjumping deletes jump table

[Bug optimization/14240] New: crossjumping deletes jump table

[Bug optimization/14255] New: i386 backend should be teached how to use divl

Re: [Bug optimization/14255] New: i386 backend should be teachedhow to use divl

[Bug optimization/14261] Compilation failure due to if-conversion

[Bug optimization/14266] [tree-ssa] ICE on legal, depends on .GLOBAL_VAR.

[Bug optimization/14266] New: ICE on legal

[Bug optimization/14269] [3.4 Regression] compiler error: in cselib_record_set, at cselib.c:1196

[Bug optimization/14269] compiler error: in cselib_record_set, at cselib.c:1196

[Bug optimization/14272] [tree-ssa] miscompilation of __exchange_and_add (atomicity.h)

[Bug optimization/14279] delete_null_pointer_checks removes live insn

[Bug optimization/14279] New: delete_null_pointer_checks removes live insn

[Bug optimization/14282] ICE in sh-elf-gcc with -m4-single-only and -O2

[Bug optimization/14287] [tree-ssa] does not remove unnecessary extensions

[Bug optimization/14287] New: [tree-ssa] does not remove unnecessary extensions

[Bug optimization/14288] [tree-ssa] [SRA] warning: 'SR.29591' may be used uninitialized in this function

[Bug optimization/14295] [tree-ssa] copy propagation for aggregates

[Bug optimization/14295] New: [tree-ssa] copy propagation for aggregates

[Bug optimization/14297] [tree-ssa] ICE's on tree-ssa-ccp.c on bootstrap

[Bug optimization/14297] New: [tree-ssa] ICE's on tree-ssa-ccp.c on bootstrap

[Bug optimization/14298] [tree-ssa] ICE during bootstrap

[Bug optimization/14298] New: [tree-ssa] ICE during bootstrap

[Bug optimization/14299] Improperly derefences pointers with casting

[Bug optimization/14299] New: Improperly derefences pointers with casting

[Bug optimization/14303] [tree-ssa] gcc.c-torture/execute/20020720-1.c is not fully folded

[Bug optimization/14303] New: [tree-ssa] gcc.c-torture/execute/20020720-1.c is not fully folded

[Bug optimization/14309] [tree-ssa] ICE on legal

[Bug optimization/14309] New: ICE on legal

[Bug optimization/14312] [tree-ssa regression] tailcalls not being generated when functions contain pointers

[Bug optimization/14312] [tree-ssa] [regression] tailcalls not being generated when functions contain pointers

[Bug optimization/14312] New: [tree-ssa regression] tailcalls not being generated when functions contain pointers

[Bug optimization/14319] [tree-ssa] incorrect optimization of union of structs with common initial sequences

[Bug optimization/14329] [tree-ssa] badly formatted warnings for SRA replacements

[Bug optimization/14329] New: [tree-ssa] badly formatted warnings for SRA replacements

[Bug optimization/14330] using -O3 causes a core whereas -O2 and under work

[Bug optimization/14335] Infinite loop while compiling Sendmail with -ftracer

[Bug optimization/14335] New: Infinite loop while compiling Sendmail with -ftracer

[Bug optimization/14341] Missed comparision optimization (jump threading related)

[Bug optimization/14341] New: Missed optimization

[Bug optimization/14345] [3.4/3.5 Regression] internal compiler error: in cselib_record_set, at cselib.c:1196

[Bug optimization/14347] ifconvert doesn't generate conditional store on i386

[Bug optimization/14347] New: ifconvert doesn't generate conditional store on i386

[Bug optimization/7871] [3.3 regression] ICE on legal code, global register variables problems

[Bug optimization/7871] [3.3/3.4 regression] ICE on legal code, global register variables problems

[Bug optimization/7871] [3.3/3.4/3.5 regression] ICE on legal code, global register variables problems

[Bug optimization/8361] [3.3/3.4/3.5 regression] C++ compile-time performance regression

[Bug optimization/9723] With -Os optimization increases size if the loop contains array element access

[Bug other/10584] [3.4/3.5 regression] ICE in copy_insn_list with __inline__ and -finstrument-functions

[Bug other/10584] [3.5 regression] ICE in copy_insn_list with __inline__ and -finstrument-functions

[Bug other/10944] alloc_page in ggc-page.c is slow

[Bug other/12220] [tree-ssa] bootstrap error with gmake,cc on mips-sgi-IRIX6.5

[Bug other/13485] [3.4/3.5 regression] Generated files no longer get messages extracted

[Bug other/13873] gcc/longlong.h uses test for PPC

[Bug other/13961] 3.3.3-prerelease is missing info files

[Bug other/13961] New: 3.3.3-prerelease is missing info files

[Bug other/13993] New: Relative path as srcdir causes problem

[Bug other/14003] Fix typos/wording in invoke.texi

[Bug other/14003] New: Fix typos/wording in invoke.texi

[Bug other/14147] Cross-Compilation fails

[Bug other/14158] New: Typo in G++ manual

[Bug other/14264] all testsuite do not work with i18ned

[Bug other/14304] make install tries to modify source tree

[Bug other/14304] New: make install tries to modify source tree

[Bug other/14305] make install tries to modify source tree

[Bug other/14305] New: make install tries to modify source tree

[Bug other/1494] Residual EGCS references in comments

[Bug other/8757] GCC crash when sizeof (long) > sizeof (char *), (splay_tree_compare_fn)strcmp is wrong

[Bug pch/10591] Members of anonymous namespaces get name mangled with header name

[Bug pch/13361] const wchar_t * strings not stored in pch

[Bug pch/14130] #pragma once ignored with Precompiled header

[Bug pch/14130] New: #pragma once ignored with Precompiled header

[Bug pch/14137] [pch] [unit-at-a-time] ICE in cgraph_finalize_compilation_unit, at cgraphunit.c:407

[Bug pch/14137] [pch] ICE in cgraph_finalize_compilation_unit, at cgraphunit.c:407

[Bug preprocessor/11439] [3.4/3.5 regression] CPP insists on UTF-8 input files

[Bug preprocessor/12743] [3.4/3.5 Regression] Multi-line strings not diagnosed when occurring in a macro call

[Bug preprocessor/12753] [3.3/3.4/3.5 regression] Memory corruption in cpp on bad input

[Bug preprocessor/13046] [3.3 Regression] -traditional-cpp rejects valid code

[Bug preprocessor/13726] [3.3/3.4/3.5 regression]cpp -C -dI loses comments on same line as #include directives

[Bug preprocessor/14103] [3.4/3.5 Regression] ICEs on "gcc -E -imacros foo.h baz.c"

[Bug preprocessor/14103] New: gcc-3.4-20040206.tar.bz2 ICEs on "gcc -E -imacros foo.h baz.c"

[Bug preprocessor/14198] [3.4.0][MIPS]FAIL: gcc.dg/cpp/assert4.c (test for excess errors)

[Bug preprocessor/14198] FAIL: gcc.dg/cpp/assert4.c (test for excess errors)

[Bug preprocessor/14198] New: FAIL: gcc.dg/cpp/assert4.c (test for excess errors)

[Bug preprocessor/14205] [3.4/3.5 Regression] ICE with -M and -include

[Bug preprocessor/14238] Dependency tracking and PCH

[Bug preprocessor/14238] New: Dependency tracking and PCH

[Bug preprocessor/14276] ICE during glibc-2.3.3 build

[Bug preprocessor/14331] please add option to suppress warning message "no newline at end of file"

[Bug preprocessor/14342] cpp -C -dD loses comments on same line as #define directives

[Bug preprocessor/14342] New: cpp -C -dD loses comments on same line as #define directives

[Bug target/10129] Ada bootstrap fails on PPC-Darwin - invalid assembler emitted - PIC related

[Bug target/10383] c++ testsuite failures in g++.dg/eh/simd-1.C & g++.dg/eh/simd-2.C

[Bug target/10412] Renesas SH - Incorrect code generation

[Bug target/10567] -fno-delayed-branch not honored in back-end

[Bug target/10692] [3.3/3.4/3.5 regression] [m68k] miscompilation of perl with -O2 -fPIC

[Bug target/10901] [ppc-darwin] non-local goto's (still) don't work

[Bug target/10904] invalid (misaligned) FP register at -O2

[Bug target/11026] [Darwin] g++ does not instantiate static data members of templates

[Bug target/11197] two function pointers to the same function are not equal

[Bug target/11476] [arc-elf] gcc ICE on newlib's vfprintf.c

[Bug target/11587] [3.3 Regression] SH ICE in reload_cse_simplify_operand, postreload.c

[Bug target/11793] [3.3 regression] ICE in extract_insn, at recog.c:2175 (const_vector's)

[Bug target/11877] gcc should use xor trick with -Os

[Bug target/12027] [3.3/3.4/3.5 Regression] sparclite-coff build fails with INIT_SECTION_ASM_OP' undeclared

[Bug target/12028] [3.4/3.5 Regression] powerpc-eabispe: ICE building __divdi3.o: in ccr_bit, at config/rs6000/rs6000.c:8136

[Bug target/12028] [3.5 Regression] powerpc-eabispe produces bad sCOND operation

[Bug target/12476] ARM/THUMB thunk calls broken

[Bug target/12898] [3.4 Regression] Tru64 UNIX bootstrap failure: ICE in gen_reg_rtx, at emit-rtl.c:819

[Bug target/12916] No vector ABI

[Bug target/12958] [3.3/3.4/3.5 regression] Spill failure when compiling FLAC

[Bug target/13058] [3.3/3.4/3.5 regression] ICE in reload_cse_simplify_operands

[Bug target/13132] long-double code leads to unresolved reference to __trunctfxf2

[Bug target/13309] Incorrect code generated for __udivdi3 (really __udivmoddi4) (MIPS)

[Bug target/13610] __attribute__((progmem)) allocation problem

[Bug target/13721] SEGV on inline-asm

[Bug target/13750] [3.4/3.5 Regression] Ada bootstrap failure on Tru64 UNIX: b_gnat[1b].o comparison failure

[Bug target/13754] [3.4/3.5 regression] ip2k-elf ICE on multiple gotos

[Bug target/13789] [tree-ssa] ICE on _builtin_expect_addr

[Bug target/13803] [3.4/3.5 Regression] movqi operand constraints too restrictivefor TARGET_COLDFIRE

[Bug target/13866] [3.4/3.5 regression] ICE in extract_insn, at recog.c:2083

[Bug target/13877] [3.3 regression] miscompilation with -O -funroll-loops on powerpc

[Bug target/13889] [3.3 Regression] Assignment of an int to an int of different size in a struct gives ICE

[Bug target/13891] gmake bootstrap fails

[Bug target/13899] [x86] -mfpmath misdocumented

[Bug target/13914] [3.4 only] dwarf2 frame unwinding broken.

[Bug target/13914] dwarf2 frame unwinding broken.

[Bug target/13918] [3.3.3 regression] [ia64] bootstrap comparision failure

[Bug target/13921] busybox compile error

[Bug target/13949] illigal code

[Bug target/13984] sh-elf-gcc: Bad code generated with -O0

[Bug target/14010] large stack frame long double ice

[Bug target/14010] New: large stack frame long double ice

[Bug target/14015] large stack frame long double ice

[Bug target/14015] New: large stack frame long double ice

[Bug target/14018] m68k backend: -malign-loops/-malign-jumps broken

[Bug target/14018] New: m68k backend: -malign-loops/-malign-jumps broken

[Bug target/14037] bootstrapping fails when configured with --with-cpu=601

[Bug target/14040] [3.3 Regression] ARM cross compiler: error: could not split insn

[Bug target/14040] [3.3/3.4 Regression] ARM cross compiler: error: could not split insn

[Bug target/14041] H8300-elf unaligned word/longword access of zero initialized variables

[Bug target/14041] New: H8300-elf unaligned word/longword access of zero initialized variables

[Bug target/14047] [3.4/3.5 Regression] __progmem__ attribute doesn't work

[Bug target/14047] __progmem__ attribute doesn't work

[Bug target/14063] conditional around vec_dss() call disappears at -O2

[Bug target/14064] -fdata-sections triggers ICE

[Bug target/14064] New: -fdata-sections triggers ICE

[Bug target/14093] Internal compiler error for code when using -mhitachi option in SH.

[Bug target/14093] New: Internal compiler error for code when using -mhitachi option in SH.

[Bug target/14113] [3.3 regression] -O2 corrupts stack

[Bug target/14113] [3.3/3.4 regression] -O2 corrupts stack

[Bug target/14146] GCC 3.3-branch (only) has an ICE for sparc64

[Bug target/14149] [3.3 Regression] libgcc2.c:731: internal compiler error: in extract_constrain_insn_cached, at recog.c:2090

[Bug target/14152] [3.5 Regression] `sdbout_type_decl' undeclared in sdbout.c, stage 1 of bootstrap

[Bug target/14166] [3.3 Regression] GCC-3.3.3 build fails with internal compiler error

[Bug target/14166] GCC-3.3.3 build fails with internal compiler error

[Bug target/14166] New: GCC-3.3.3 build fails with internal compiler error

[Bug target/14170] e_sqrt.c in newlib compile error

[Bug target/14182] [3.3.3 regression]arm cross compiler cannot be built

[Bug target/14183] [3.4/3.5 Regression] [MIPS]FAIL: gcc.c-torture/execute/930429-1.c execution, -O1

[Bug target/14201] [3.4/3.5 regression] float -> int (in mem) with -mieee causes unrecognizable insn+segv

[Bug target/14202] [arm] Thumb __builtin_setjmp not interworking safe

[Bug target/14202] New: [arm] Thumb __builtin_setjmp not interworking safe

[Bug target/14206] Mention that exec-shield (linux) conflicts with PCH

[Bug target/14209] Bug in cris.md, shrinking access size of postincrement.

[Bug target/14209] New: Bug in cris.md, shrinking access size of postincrement.

[Bug target/14210] ICE on -O3

[Bug target/14224] GCC generates pessimizes code for integer division

[Bug target/14226] [3.4] ICE in emit_move_insn for -mcpu=power4

[Bug target/14226] New: [3.4] ICE in emit_move_insn for -mcpu=power4

[Bug target/14243] ICE in dwarf2out add_location_or_const_value_attribute

[Bug target/14243] New: ICE in dwarf2out add_location_or_const_value_attribute

[Bug target/14255] i386 backend should be teached how to use divl

[Bug target/14256] Vector extensions cause internal compiler error

[Bug target/14262] Structure size computed wrong

[Bug target/14268] internal compiler error

[Bug target/14275] New: Problem building gcc3.3.3 x86_64 cross-compiler

[Bug target/14275] Problem building gcc3.3.3 x86_64 cross-compiler

[Bug target/14280] Cpp is marked with DT_TEXTREL

[Bug target/14280] New: Cpp is marked with DT_TEXTREL

[Bug target/14285] [tree-ssa] current_function_needs_context is not declared

[Bug target/14286] hpux 11.i gcc3.3 compiler errors

[Bug target/14291] [3.4/3.5 Regression] -fprofile-arcs fails (unresolved symbol)

[Bug target/14291] New: -fprofile-arcs fails (unresolved symbol)

[Bug target/14293] gcc 3.3.3 fails to build with --target=arm-unknown-elf

[Bug target/14300] New: -pthread doesn't define _REENTRANT in preprocessor on alpha-linux

[Bug target/14302] arm-linux g++ error

[Bug target/14321] gcc emitting "movaps" to unaligned memory

[Bug target/14322] New: Unrecognizable lo_sum insn with -m64 and -fPIC

[Bug target/14322] Unrecognizable lo_sum insn with -m64 and -fPIC

[Bug target/14326] boehm-gc hardcodes to 3DNow! prefetch for x86_64

[Bug target/14326] New: boehm-gc hardcodes to 3DNow! prefetch for x86_64

[Bug target/14327] [3.3/3.4/3.5 Regression] -O0 -fdefer-pop generates wrong code

[Bug target/14332] [3.3 Regression] Building GCC 3.3.3 for the AVR target fails

[Bug target/14333] [3.3 Regression] __stdcall in function declaration in structure ignored?

[Bug target/14336] bootstrapping gcc 3.3.3 fails on mips-sgi-irix5.3

[Bug target/14338] internal compiler error dp-bits.c line 412 (thumb)

[Bug target/14343] [3.4/3.5 Regression] internal error while using vector instructions [gcc 3.4.0 20040225 (prerelease)].

[Bug target/14344] [3.3.3 Regression] MinGW Bootstrap Failure

[Bug target/14346] [3.3 only] With -fpic/-fPIC, thunks jump through PLT, not directly to thunked function

[Bug target/14346] New: With -fpic/-fPIC, thunks jump through PLT, not directly to thunked function

[Bug target/14346] With -fpic/-fPIC, thunks jump through PLT, not directly to thunked function

[Bug target/1532] [3.3 Regression] -O3 generates (obviously) redundant tests and jumps

[Bug target/1532] [3.3/3.4 Regression] -O3 generates (obviously) redundant tests and jumps

[Bug target/1532] [3.3/3.4/3.5 Regression] -O3 generates (obviously) redundant tests and jumps

[Bug target/1987] [Interix 2.2] GCC 2.95.2 fails to build

[Bug target/545] -std=c89 defines macros it shouldn't

[Bug target/6482] gcc-3.1 g++ testsuite failure in g++.dg/special/conpr-2.C

[Bug target/9348] [HP-UX] error in int to unsigned long multiplication

[Bug target/9571] [PPC] problems with 'const', -msdata=eabi and sections.

[Bug target/9908] [x86] wrong code generated for virtual method call (gas bug?) with -masm-intel

[Bug translation/12954] Please ignore this bug

[Bug translation/14087] Core dumped compiling ipchains-1.3.10

[Bug translation/14087] ICE with warning in spanish translation

[Bug translation/14293] New: gcc 3.3.3 fails to build with --target=arm-unknown-elf

[Bug translation/14351] gcc -print-search-dirs must not use LANG and friends

[Bug translation/14351] New: gcc -print-search-dirs must not use LANG and friends

[Bug translation/9390] [translation] Segmentation Fault when compiling for athlon with LANG=es_ES@euro or LC_ALL=es_ES@euro

[Bug web/14206] New: Mention that exec-shield (linux) conflicts with PCH

[CRASH]: gcc version 2.95.4 20011002 (Debian prerelease)

[lno] Two vectorizer ICEs

[MailServer Notification]To Sender file blocking settings matched and action taken.

Re: __attribute__((aligned(N))) silently ignored for auto variables

_REENTRANT not defined when -pthread is used on alpha-linux

about Chinese symbols bug

accessing private filds in 3.3.x

bug report

Bug report

BugReportGCC

Compile failure in builtin-attrs.def

Do I have a bug?

Exclusive gifts for ur valentine.

RE: explain!

Failure linking gengtype when using non-GCC stage1 compiler

g++: conflicting uses of namespace name not reported

g77 internal error for pdp11 target

gcc "bug"

gcc bug adds ^q to 12 character words

GCC does integer division badly on i386

I say we should give him what's owed. - was Re: JK4H45

incompleteness

RE:information - Gateway Response

internal compiler error on aix with gcc 3.3.3 and gcc 3.3.2

Is this right, or a bug?

Isolated Mail

libg++/iostream.h

nan -ffast-math

Possible minor g++ 3.4 issue

read it immediately

RETURN defined twice

RETURN token error in gcc 2.96-20000731

A simple bug

syntax error in parse.y

testing GCC

This should at least give a warning even if it is legal C

Undefined reference to std::string::_Rep::_S_empty_rep_storage when compiling with -O2.

Re: Undefined reference to std::string::_Rep::_S_empty_rep_storagewhen compiling with -O2.

Uninitialized reference member should cause an error.

warning


Indexes: [Date Index] [Subject Index] [Author Index] [Thread Index]
Site Nav: [Browse other archives for this mailing list]
[Browse other mailing lists at this site]
Search: Limit to:

Mail converted by MHonArc 2.6.3