gcc-bugs archive
subject index for July, 2003

This is the mail archive of the gcc-bugs@gcc.gnu.org mailing list for the GCC project.

Indexes: [Date Index] [Subject Index] [Author Index] [Thread Index]
Site Nav: [Browse other archives for this mailing list]
[Browse other mailing lists at this site]
Search: Limit to:

[Bug ada/10110] [3.3 regression] [mipsel-linux]ada bootstrap error

[Bug ada/10670] gcc ignors 'pragma Machine_Attribute' directive

[Bug ada/10693] make gnatlib_and_tools fails

[Bug ada/10768] ICEs on compilation of ada support library

[Bug ada/10881] [3.3 only] bootstrap fails on ada on powerpc with --enable-altivec

[Bug ada/10881] bootstrap fails on ada on powerpc with --enable-altivec

[Bug ada/10973] Bootstrap error building Ada

[Bug ada/10973] Bootstrap error building Ada (linking on Solaris 2.6 only)

[Bug ada/11055] "make bootstrap" fails with ada enabled

[Bug ada/11090] Variant Record Initialization.

[Bug ada/11100] Internal compiler error: Ada florist-3.15p posix-sockets.gpb:481:20

[Bug ada/11186] gcc aborts when using -gnatR on generic procedures

[Bug ada/11391] Invalid return values from math libraries

[Bug ada/11391] New: Invalid return values from math libraries

[Bug ada/11514] [tree-ssa] ICE on bootstrap with ada in sem_util.c

[Bug ada/11514] New: [tree-ssa] ICE on bootstrap with ada in sem_util.c

[Bug ada/11541] Ada: gnat bug detected when compiling GtkAda-1.2.12

[Bug ada/11541] New: Ada: gnat bug detected when compiling GtkAda-1.2.12

[Bug ada/11581] [3.4 Regression] gnat1 segfaults if it does receive any arguments

[Bug ada/11581] gnat1 segfaults if it does receive any arguments

[Bug ada/11581] New: gnat1 segfaults if it does receive any arguments

[Bug ada/11589] Compiler cannot deal with representation clause for renamed vars

[Bug ada/11589] New: Compiler cannot deal with representation clause for renamed vars

[Bug ada/11659] Makefiles don't respect --program-suffix

[Bug ada/11659] New: Makefiles don't respect --program-suffix

[Bug ada/11724] Ada Lseek->lseek() doesn't work with sizeof(off_t) != sizeof(long)

[Bug ada/11724] New: Ada Lseek->lseek() doesn't work with sizeof(off_t) != sizeof(long)

[Bug ada/4482] /tmp race condition fixed only partially

[Bug ada/4720] GNAT programs do not support --help and --version

[Bug ada/5590] Float'Image unreliable with zero, Is_Negative intrisic to blame

[Bug ada/5677] Assert failure in nlists.adb:933

[Bug ada/5679] ICE in assign_stack_temp_for_type, returning unconstrained type conversion ("GtkAda bug")

[Bug ada/5903] Buffer overflow in temporary file creation

[Bug ada/5909] Ada has no test suite.

[Bug ada/5910] Ada libraries are not built by "make all" from top level.

[Bug ada/5911] Ada runtime and utilities should be broken out to their own directory

[Bug ada/5978] A short-circuit return statement should be added to a-ngcefu.adb

[Bug ada/6584] failure building GNAT library: ICE on s-auxdec.adb

[Bug ada/6637] Ada libraries should honour --enable-shared

[Bug ada/6669] Irix6.5 ada bootstrap fail in ada/targparm.adb

[Bug ada/6725] --program-suffix breaks Ada; warning in Instatllation instruction should be strengthed

[Bug ada/6851] make gnatlib_and_tools fails when configured with relative pathname

[Bug ada/6852] gnatlib fails to build with newlib because it doesn't set up the include path

[Bug ada/6941] Gigi abort, Code=507

[Bug ada/7613] Can't with two child packages each of which is a renaming of the same package.

[Bug ada/7848] Linking with gnat/gnarl libs causes crash at run-time

[Bug ada/7889] Instantiation of Generic Granchild Package fails

[Bug ada/7984] [3.3 regression] ICE in loc_descriptor_from_tree

[Bug ada/7985] make gnatlib fails on mips-sgi-irix5.3

[Bug ada/8247] Compiler bug reported; may have to do with variant records

[Bug ada/8368] PR's 8223, 8177, 8088, 6452, 5679, Gtk-Ada fails with Gigi unknown error

[Bug ada/8614] Assert_Failure exp_util.adb:1404

[Bug ada/8693] Gigi abort, Code=113

[Bug ada/8924] gnatchop fails with EXCEPTION_ACCESS_VIOLATION

[Bug ada/8925] Floating point code gives incorrect results

[Bug ada/9087] Component_Size for packed array returns wrong values

[Bug ada/9130] [3.3/3.4 regression] Assertion failure in einfo.adb (line 4551)

[Bug ada/9131] [3.3 regression] ICE in varasm.c (line 2625)

[Bug ada/9132] gcc problem with s-secsta.ads:65

[Bug ada/9136] Compiler bomb on spec file with Elaborate_Body

[Bug ada/9137] [3.3/3.4 regression] renaming of array object fails

[Bug ada/9536] [3.3/3.4 regression] Constraint error on valid Ada.Calendar.Time_Of

[Bug bootstrap/10088] GCC 3.2.2 bootstrap croaks with "virtual memory exhausted: Not enough space"

[Bug bootstrap/10256] gcc-3.2.2 can't build it's libjava

[Bug bootstrap/10285] ICE during crtstuff

[Bug bootstrap/10289] config.status contains incorrect information

[Bug bootstrap/10501] [HP-UX] Syntax error when running make bootstrap

[Bug bootstrap/10626] [cygwin] install-sh does not correctly specify executable extension

[Bug bootstrap/10657] [3.3 regression] java section can not find libiconv

[Bug bootstrap/10666] undefined ATTRIBUTE_NULL_PRINTF_3

[Bug bootstrap/10758] bootstrap failure on HP-UX 11.22/IPF

[Bug bootstrap/10787] Segmentation fault during the upgrade from gcc2.95.3 to gcc3.2.3

[Bug bootstrap/10802] Bootstrap of gcc-3.3 on Solaris 9 x86 fails on undefined symbol in libgcj.so

[Bug bootstrap/10951] gcc-3.3 (libstdc++) fails to bootstrap on AIX 4.3.3

[Bug bootstrap/10957] m68k-cross build broken in libiberty (hashtab.c)

[Bug bootstrap/10973] Bootstrap error building Ada

[Bug bootstrap/10983] [3.4 regression] [SPARC64] ICE in verify_wide_reg, at flow.c:551, while compiling libjava

[Bug bootstrap/11043] [arc-elf32] make fails due to missing rules

[Bug bootstrap/11043] make -j2 fails due to missing rules

[Bug bootstrap/11060] [3.4 regression] [m68k] bootstrap error in libgcj

[Bug bootstrap/11171] Wrong ctype/OS include files when using Newlib

[Bug bootstrap/11273] make install fails in libobjc directory

[Bug bootstrap/11297] [3.4 Regression] ICE building abi_check.cc

[Bug bootstrap/11315] bootstrap error with math.h after fixes 5200-01

[Bug bootstrap/11317] make bootstrap-lean fails with #error Unrecognized value in TARGET_CPU_DEFAULT

[Bug bootstrap/11321] unknown option -m31 while bootstrapping on s390x

[Bug bootstrap/11341] [cygwin] [pch] ICE in ggc_pop_context, at ggc-page.c:1441 while compiling libstc++3

[Bug bootstrap/11354] GNAT ICE during make gnatlib_and_tools on Tru64 UNIX V5.1

[Bug bootstrap/11362] Implicit declaration of `internal_dfa_insn_code' in insn-attrtab.c

[Bug bootstrap/11383] byte ordering test breaks POSIX sed

[Bug bootstrap/11383] byte ordering test breaks using native sed

[Bug bootstrap/11388] gcc 3.3 fails to bootstrap on AIX 5.2 due to errors compiling plural.c in directory gcc/intl

[Bug bootstrap/11388] New: gcc 3.3 fails to bootstrap on AIX 5.2 due to errors compiling plural.c in directory gcc/intl

[Bug bootstrap/11396] Ada bootstrap failure on Tru64 UNIX V5.1

[Bug bootstrap/11396] New: Ada bootstrap failure on Tru64 UNIX V5.1

[Bug bootstrap/11408] installation fails for many target libraries on multilibbed sparc

[Bug bootstrap/11408] installation fails for many target libraries on sparc

[Bug bootstrap/11408] installation fails for many target libraries using CONFIG_SHELL

[Bug bootstrap/11408] New: installation fails for libsupc++ on multilibbed sparc

[Bug bootstrap/11455] Bootstrap failure in Cygwin

[Bug bootstrap/11455] New: Bootstrap failure in Cygwin

[Bug bootstrap/11458] cc1: conversion from UTF-8 to UCS-4BE not supported by iconv

[Bug bootstrap/11458] New: cc1: conversion from UTF-8 to UCS-4BE not supported by iconv

[Bug bootstrap/11479] Building GCC 3.3 on SCO OpenServer version 3.2v5.0.6 fails

[Bug bootstrap/11481] Bootstrap stage fails, internal compiler error, -DIN_LIBGCC2 -DL_fixunsdfsi

[Bug bootstrap/11481] New: Bootstrap stage fails, internal compiler error, -DIN_LIBGCC2 -DL_fixunsdfsi

[Bug bootstrap/11482] [v850-elf] ICE with -O2 building misc-inst.lo

[Bug bootstrap/11482] New: [v850-elf] ICE with -O2 building misc-inst.lo

[Bug bootstrap/11515] mingw32 fails to build gnatlib due to missing sys/wait.h

[Bug bootstrap/11515] New: mingw32 fails to build gnatlib due to missing sys/wait.h

[Bug bootstrap/11516] [3.4 egression] ld: Unsatisfied symbol "get_attr_pa_combine_type" in file libbackend.a[pa.o]

[Bug bootstrap/11516] New: [regression 3.4] ld: Unsatisfied symbol "get_attr_pa_combine_type" in file libbackend.a[pa.o]

[Bug bootstrap/11519] New: When Building m68hc11: Internal compiler error: in print_operand_address

[Bug bootstrap/11519] When Building m68hc11: Internal compiler error: in print_operand_address

[Bug bootstrap/11524] [3.4 regression] ada bootstrap error in stage2

[Bug bootstrap/11524] New: [3.4 regression] ada bootstrap error in stage2

[Bug bootstrap/11526] autoconf-2.5x's ac_configure_args quoting breaks config-ml.in

[Bug bootstrap/11526] New: autoconf-2.5x's ac_configure_args quoting breaks config-ml.in

[Bug bootstrap/11538] when trying to execute make (when installing gcc), I failed because of Segmentation fault in gzio.c

[Bug bootstrap/11558] can't install gcc in CygWin environment (patch included)

[Bug bootstrap/11558] New: can't install gcc in CygWin environment (patch included)

[Bug bootstrap/11566] gcc 3.3 faild to compile bootstrap

[Bug bootstrap/11566] New: gcc 3.3 faild to compile bootstrap

[Bug bootstrap/11590] Bootstraping gcc 3.3 make stop

[Bug bootstrap/11590] New: Bootstraping gcc 3.3 make stop

[Bug bootstrap/11593] [3.4 regression] infinite loop in find_rgns compiling c-parse.c

[Bug bootstrap/11593] New: [3.4 regression] infinite loop in find_rgns compiling c-parse.c

[Bug bootstrap/11605] Can't make bootstrap on HPUX

[Bug bootstrap/11605] New: Can't make bootstrap on HPUX

[Bug bootstrap/11611] [tree-ssa] Bootstrap failure on sparc-linux-gnu

[Bug bootstrap/11611] New: [tree-ssa] Bootstrap failure on sparc-linux-gnu

[Bug bootstrap/11621] 'make all' fails with "No rule to make target `../libiberty/libiberty.a'

[Bug bootstrap/11621] New: 'make all' fails with "No rule to make target `../libiberty/libiberty.a'

[Bug bootstrap/11625] New: TOT make install fails on RedHat Linux 8.0

[Bug bootstrap/11625] TOT make install fails on RedHat Linux 8.0

[Bug bootstrap/11630] I have a problem with configure

[Bug bootstrap/11640] 3.4: bootstrap ICE in rtl_verify_flow_info, at cfgrtl.c:2151

[Bug bootstrap/11640] New: 3.4: bootstrap ICE in rtl_verify_flow_info, at cfgrtl.c:2151

[Bug bootstrap/11640] p3.4 Regression]: bootstrap ICE in rtl_verify_flow_info, at cfgrtl.c:2151

[Bug bootstrap/11660] libffi only builds when java is selected as language

[Bug bootstrap/11668] Make error on HPUX with gcc3.3

[Bug bootstrap/11668] New: Make error on HPUX with gcc3.3

[Bug bootstrap/11686] Error on make bootstrap

[Bug bootstrap/11686] New: Error on make bootstrap

[Bug bootstrap/11698] New: Unable to compile GCC 3.3 on AIX 5.2 (maintenance level 1)

[Bug bootstrap/11698] Unable to compile GCC 3.3 on AIX 5.2 (maintenance level 1)

[Bug bootstrap/11745] Bootstrap fails when compiling insn-attrtab.c with stage1/xgcc

[Bug bootstrap/11745] New: Bootstrap fails when compiling insn-attrtab.c with stage1/xgcc

[Bug bootstrap/2168] genattr abort during cross compilation

[Bug bootstrap/2236] config.if (gcc 2.95.2, possibly others) pukes if it can't find gl*bc

[Bug bootstrap/3355] [alphaev6-dec-osf5.0] Build of gcc3.0 fails

[Bug bootstrap/3587] [arc-elf] GCC 3.0-CVS multilib problem

[Bug bootstrap/3632] [mips-irix-6.5] libstdc++ is not installed correctly

[Bug bootstrap/3746] [mips-elf] cross-compilation of mips-tfile missing mips/a.out.h

[Bug bootstrap/3922] [sparc-elf] embedded target makes UNIX calls

[Bug bootstrap/6651] libgcj build fails on powerpc-linux

[Bug bootstrap/6680] genattrtab crashes on tru64 5.0

[Bug bootstrap/6816] Makefile.adalib needs to be updated (Gigi file name changes)

[Bug bootstrap/6879] mips-elf cross fails with ada enabled

[Bug bootstrap/7087] sub-make FLAG propagation fails if flag ends with '='

[Bug bootstrap/7126] zlib version is wrong in zlib/configure.in

[Bug bootstrap/7548] gcc3.1.1 can't be bootstraped on HPUX 10.20 using HP compilers

[Bug bootstrap/7608] libgcj build fails

[Bug bootstrap/7635] [x86 x PPC] GCC 3.2 crashes during GCC 3.2 compilation

[Bug bootstrap/7664] [linux alpha] gcc-3.2 build problem gengenrtl

[Bug bootstrap/7727] `make install' fails when none of the localization files are installed (as controlled by LINGUAS)

[Bug bootstrap/7757] configure: error: can not find install-sh or install.sh in . ./.. ./../..

[Bug bootstrap/7791] [hpux 11.11] missing include prevents bootstrap

[Bug bootstrap/7817] [3.3/3.4 regression] Link to gcc man page in g++ man page incorrect

[Bug bootstrap/7881] Cannot compile gcc on Tru64 4.0G or 5.X if gnu libiconv is installed

[Bug bootstrap/8069] won't make java

[Bug bootstrap/8261] [HP-UX] internal error when trying to build hpux cross compiler

[Bug bootstrap/8304] [HP UX] quadlib.c can't be found

[Bug bootstrap/8498] [3.3 only] [powerpc-apple-darwin6.0] g77, objc Testsuite failures from Unresolved symbols.

[Bug bootstrap/8538] real.h `test_real_width' assertion fails when sizeof(long) == sizeof(long long) == 8

[Bug bootstrap/8677] "gcc -v" should report options used for bootstrap

[Bug bootstrap/8767] stage 2: error on dwarfout.o

[Bug bootstrap/8796] Bootstrap fails on Tru64 4.0f with native make and cc

[Bug bootstrap/8835] [mcore-elf] bootstrap ICE at expr.c:2771

[Bug bootstrap/8909] sparc-openbsd does not define TEXT_SECTION_ASM_OP or DATA_SECTION_ASM_OP so an error in varasm.c

[Bug bootstrap/9035] Building gcc version 3.2.1, make install yields "cc1: internal error: Segmentation fault"

[Bug bootstrap/9045] [sparc-solaris2.5]libintl and libiconv not found at first ./xgcc usage

[Bug bootstrap/9208] Makefile in gcc/intl have wrong path to install-sh

[Bug bootstrap/9330] [alpha-osf]small alphaev56-dec-osf5.1 --enable-threads=posix problem

[Bug bootstrap/9382] AIX 5.2 ../../gcc-20030120/gcc/libgcc2.c:1161: internal compiler error: in extract_insn, at recog.c:2175

[Bug bootstrap/9631] [hppa64-linux] [gcc-3.3] fails to bootstrap

[Bug bootstrap/9697] [3.4 regression] wrong assembly emitted for m68000 __umulsidi3

[Bug bootstrap/9741] [hppa-linux] ICE (segfault) while building a cross compiler

[Bug bootstrap/9968] Prefix ending in "/" causes trouble in prefix.c

[Bug bootstrap/9968] When gxx-include-dir contains 'include', its removed...

[Bug bootstrap/9989] [HPUX 11.00, gcc 3.3] fixing of stdio.h fails

[Bug bootstrap/9992] [SCO OpenServer] Building compiler for UDK fails

[Bug bootstrap/9996] plural.c can't be found

[Bug c++/10032] [3.3/3.4 regression] -pedantic converts some errors to warnings

[Bug c++/10079] ICE (segfault) while substitute return type containing unresolved qualified id

[Bug c++/10108] tree checking ICE: expected var_decl, have error_mark in tsubst_decl

[Bug c++/10118] [3.3/3.4 Regression] Conversion of ptrmem to derived class in template arg fails

[Bug c++/10126] ICE in convert_nontype_argument on using overload resolution in template args

[Bug c++/10135] [3.3/3.4 Regression] Uncaught exceptions with --disable-sjlj-exceptions configured GCC

[Bug c++/10135] Uncaught exceptions with --disable-sjlj-exceptions configured GCC

[Bug c++/10147] [3.3/3.4 regression] Confusing error message for invalid template function argument

[Bug c++/10150] ICE when using a name referring to a template within a math expression, in resolve_offset_ref, at cp/init.c:1841

[Bug c++/10200] Weird clash with same names in different scopes

[Bug c++/10219] [3.4 regression] ICE in maybe_adjust_types_for_deduction on invalid code

[Bug c++/10223] ICE (segfault) with dependent member pointers used as template parameters

[Bug c++/10243] typeof(expr) yields wrong result if expr has reference type

[Bug c++/10247] [3.4 regression] ICE in ocp_convert, at cp/cvt.c:636

[Bug c++/10310] [3.4 regression] [New parser] ICE on illegal use of template keyword

[Bug c++/10316] [3.3/3.4 regression] Very long compile time when exceptions enabled

[Bug c++/10345] [3.3/3.4 regression] Double parentheses in error message.

[Bug c++/10371] [3.4 regression] misleading error message for illegal member access

[Bug c++/10384] compiler error

[Bug c++/10398] [3.4 regression] ICE with missing typename keyword

[Bug c++/10433] [3.4 regression] [New parser] SegFault in type_unknown_p with sizeof

[Bug c++/10476] [3.4 regression] ICE in ocp_convert, at cp/cvt.c:652

[Bug c++/10527] [3.3/3.4 regression] confused error message with "new int()" parameter initializer

[Bug c++/10530] [3.4 regression] Cannot access non-dependent type within nested template

[Bug c++/10550] undefined reference to out_of_range::out_of_range

[Bug c++/10558] [3.3 regression] Segfault on illegal use of template without template args

[Bug c++/10577] emerge x11-misc/icewm-tools

[Bug c++/10583] [3.4 regression] ICE in cp_parser_template_id with missing typename to refer to nested struct

[Bug c++/1058] [parser]gcc version 2.95.2 produces "parse error before `>'"

[Bug c++/10594] [3.3 regression] ICE (segfault) on error recovering in weird code

[Bug c++/10646] [3.3/3.4 regression] non-const reference is incorrectly matched in a "const T" partial specialization

[Bug c++/10661] ICE in instantiate_decl, at cp/pt.c:10052 while instantiating static member variables

[Bug c++/10668] assigning address of non-static member variable to pointer

[Bug c++/10682] [3.3/3.4 regression] chokes on a typedef for an enum inside a class template

[Bug c++/10717] Performance issue in expand_static_init with large number of static initializors

[Bug c++/10722] [3.3 regression] ICE (segfault) with invalid specialization

[Bug c++/10749] [3.3 regression] triple nested template classes in namespace need to qualify ns

[Bug c++/10754] cast-as-lvalue extension breaks valid programs

[Bug c++/10760] Compile time increases quadratically with struct size

[Bug c++/10761] [3.4 regression] wrong virtual function called

[Bug c++/10762] [3.4 regression] [New parser] failure on illegal templated type declared with 'using'

[Bug c++/10779] [3.4 regression] Error cascade for unknown type in function prototype

[Bug c++/10793] [3.4 regression] ICE (treecheck) when partial-specializing with an invalid type and a base class, in xref_basetypes, at cp/decl.c:12834

[Bug c++/10796] [3.3/3.4 regression] ICE (segfault) when defining an enum with two values: -1 and MAX_INT_64BIT

[Bug c++/10804] [3.4 regression] missing implicit instantiation of template static methods

[Bug c++/10816] [3.3/3.4 regression] warning message refers to lines which don't exist

[Bug c++/10820] [3.3 regression] ICE in poplevel with attributes

[Bug c++/10832] Cannot define an out-of-class explicit specialization of a template constructor of a specialized template class.

[Bug c++/10849] [3.3 regression] Cannot define an out-of-class specialization of a private nested template class

[Bug c++/10858] failure with calling a method inside sizeof: sorry, unimplemented: `method_call_expr' not supported by dump_expr

[Bug c++/10898] [3.3 regression] ICE on illegal template parameter (resume_binding_level, at cp/decl.c:598)

[Bug c++/10903] [3.3 only] g++ says: "error: object ``type_decl' not supported by dump_expr"

[Bug c++/10903] [3.4 regression] ICE: error routines re-entered.

[Bug c++/10923] [3.4 regression] Accepting an elaborate-type-specifier as template parameter in a template definition (3.3 ICEs)

[Bug c++/10926] ICE in build_delete when trying to declare template destructor

[Bug c++/10952] ICE (segfault) in redeclare_class_template at cp/pt.c:2999

[Bug c++/10953] [3.4 regression] ICE in cp_parser_function_definition at cp/parser.c:10931

[Bug c++/10959] parse error before `>' token

[Bug c++/10968] [3.3/3.4 regression] If member function implicitly instantiated, explicit instantiation of class fails to instantiate it

[Bug c++/10989] Segmentation fault at compile

[Bug c++/11006] [CNI] ICE with use of __java_boolean

[Bug c++/11019] ICE at grokdeclarator

[Bug c++/11021] [3.3/3.4 regression] [cygwin/mingw]: Inheriting a virtual method from a dllimport'd base class->segfault

[Bug c++/11024] [3.4 regression] ICE in tsubst_decl at cp/pt.c:5988

[Bug c++/11025] [3.3 regression] ICE (segfault) in tsubst_decl

[Bug c++/11026] [Darwin] g++ does not instantiate static data members of templates

[Bug c++/11027] [3.4 regression] Error with static array of pointer-to-member-functions

[Bug c++/11030] Cannot befriend a template specialization

[Bug c++/11034] two-stage name lookup: name wrongly found in dependent base class (14.6.2)

[Bug c++/1103] [parser]G++ creates parse error when a member template is called within a template function

[Bug c++/11050] [3.4 regression] "some string" __FUNCTION__ is accepted

[Bug c++/11063] [3.3/3.4 Regression] ICE on parsing initialization list of const array member

[Bug c++/11070] [3.4 regression] ICE in regenerate_decl_from_template after forgotten template for disambiguation

[Bug c++/11071] [3.4 regression] ICE in regenerate_decl_from_template after forgotten template for disambiguation, part 2

[Bug c++/11072] [3.4 regression] Implementation of offsetof macro

[Bug c++/11078] ICE in write_type with typeof and templates

[Bug c++/11098] [3.3./3.4 regression] [dwarf2] g++ doesn't emit complete debugging information for local variables in destructors

[Bug c++/11131] [3.4 Regression]Unrelated declaration removes inline flag from function

[Bug c++/11131] Unrelated declaration removes inline flag from function

[Bug c++/11132] [3.4 Regression] tree-check failure after error for invalid template

[Bug c++/11137] [3.3 Regression] Linux shared library constructors not called unless there's one global object

[Bug c++/11145] Overloading math functions sometimes fails if not in std namespace

[Bug c++/11148] Incorrect codegen for explicit template instantiation, with ICE for error cases

[Bug c++/11149] [3.3/3.4 Regression] ICE on error when instantiation with call function of a base type

[Bug c++/11154] [3.3/3.4 regression] spurious ambiguity report for template class specialization

[Bug c++/11189] Destructors for static local objects use limited atexit().

[Bug c++/11190] ICE in output_operand (wrong address) with static and -fPIC

[Bug c++/11199] template

[Bug c++/11211] trivial static initializers of const objects should be done at compile time

[Bug c++/11223] dynamic_cast<> in shared library fails with SegFault when called from JNI

[Bug c++/11228] [3.3/3.4 regression] ICE on new-expression using array operator new and default-initialization

[Bug c++/11236] [3.3 regression] ICE (segfault) with a statement containing only the name of a member function

[Bug c++/11237] Internal Compiler Error (segfault) in convert_from_reference at cvt.c:568

[Bug c++/11247] -frepo fails to instantiate typeinfo

[Bug c++/11262] internal compiler error: Segmentation fault

[Bug c++/11282] [3.3 regression] Infinite memory usage after syntax error

[Bug c++/11283] [3.4 regression] ICE in build_conditional_expr

[Bug c++/11284] [3.3 only]ICE on valid code

[Bug c++/11285] GCC 3.3 C++ for Sparc Solaris assumes system header files are C.

[Bug c++/11295] [3.3/3.4 regression] ICE in cp_expr_size, at cp/cp-lang.c:314 when using a non-trivial object in a compound statement expression

[Bug c++/11296] Unqualified lookup should only use the definition context, if the funciton call is dependent (§14.6.4.2, p1, bullet 1)

[Bug c++/11308] [3.3 regression] ICE when calling a function on an enum type

[Bug c++/11309] Testsuite failures in g++.dg/expr/anew1.C (and anew2.C anew3.C anew4.c)

[Bug c++/11314] unqualified lookup prefers functions to non-functions

[Bug c++/11316] 3.3 ICE with empty constructor

[Bug c++/11323] Template parsing error

[Bug c++/11340] Overload Resolution Failure Vis-a-Vis Broken Signature

[Bug c++/11344] [3.3/3.4 Regression] templates + friend + name conflict = ICE

[Bug c++/11345] [3.3.1/3.4 regression] ICE in build_base_path

[Bug c++/11347] [3.4 regression] Error on valid expression in default value for int argument to inner template.

[Bug c++/11347] ICE on valid expression in default value for int argument to inner template.

[Bug c++/11357] no conversion of build-in binary operator argument attempted

[Bug c++/11376] [3.3/3.4 regression] mozilla-1.4 miscompiled

[Bug c++/11384] [3.4 regression] missing implicit instantiation of template static members

[Bug c++/11384] missing implicit instantiation of template static members

[Bug c++/11390] line directives interfere with friend linkage

[Bug c++/11390] New: line directives interfere with friend linkage

[Bug c++/11393] Initializer of static const float class member is not legal in c++98

[Bug c++/11393] New: Initializer of static const float class member is not legal in c++98

[Bug c++/11401] erreur interne de compilateur: erreur pour rapporter une routine ré-entée

[Bug c++/11401] ICE: error routine re-entered (was: erreur pour rapporter une routine ré-entée)

[Bug c++/11401] New: erreur interne de compilateur: erreur pour rapporter une routine ré-entée

[Bug c++/11404] New: same mangled name when compiling CGAL-2.4

[Bug c++/11404] same mangled name when compiling CGAL-2.4

[Bug c++/11405] dynamic_cast error / problems

[Bug c++/11405] New: dynamic_cast error / problems

[Bug c++/11406] New: ICE after `array_ref' not supported by dump_type

[Bug c++/11406] sorry+ICE: `array_ref' not supported by dump_type

[Bug c++/11407] [DR 115] Function cannot be resolved

[Bug c++/11407] Function cannot be resolved

[Bug c++/11407] New: Function cannot be resolved

[Bug c++/11409] [3.3/3.4 regression] using declarations and fabs built-in

[Bug c++/11415] [3.4 regression] Error message with ::::

[Bug c++/11415] New: Error message with ::::

[Bug c++/11416] Nested template as arg to base class template confuses args

[Bug c++/11416] New: Nested template as arg to base class template confuses args

[Bug c++/11418] implicit typename extension leads to wrong code

[Bug c++/11418] Nested template as arg to base class template confuses args

[Bug c++/11418] New: Nested template as arg to base class template confuses args

[Bug c++/11423] IA-32 optimization bug w/ 64 bit parameters

[Bug c++/11423] New: IA-32 optimization bug w/ 64 bit parameters

[Bug c++/11429] nested class within template class is not inherited by derived template class

[Bug c++/11429] New: nested class within template class is not inherited by derived template class

[Bug c++/11431] New: static_cast behavior with subclasses when default constructor available

[Bug c++/11431] static_cast behavior with subclasses when default constructor available

[Bug c++/11432] [3.4 Regression] ICE with int templates and static members, regression from 2.95 and 3.3

[Bug c++/11432] ICE with int templates and static members, regression from 2.95 and 3.3

[Bug c++/11432] New: ICE with int templates and static members, regression from 2.95 and 3.3

[Bug c++/11434] How to config gcc under AIX 4.2.1

[Bug c++/11434] New: How to config gcc under AIX 4.2.1

[Bug c++/11435] Incorrect main signatures fails to generate diagnostic, program fails

[Bug c++/11435] New: Incorrect main signatures fails to generate diagnostic, program fails

[Bug c++/11436] New: ios::app bug on RedHat 7.3 with gcc 3.3

[Bug c++/11437] ICE in lookup_name_real

[Bug c++/11437] New: [3.3/3.4] g++ segfaults

[Bug c++/11441] calling a member's template member function, from templated constructor

[Bug c++/11441] New: calling a member's template member function, from templated constructor

[Bug c++/11444] [3.3 regression] function fails to propagate up class tree (template-related)

[Bug c++/11444] New: [3.3 regression] function fails to propagate up class tree (template-related)

[Bug c++/11447] ignore this report

[Bug c++/11447] internal compiler error: Segmentation fault

[Bug c++/11447] New: ignore this report

[Bug c++/11454] New: pedantic causes errors with exceptions, were warnings under 2.95

[Bug c++/11454] pedantic causes errors with exceptions, were warnings under 2.95

[Bug c++/11456] New: Segfault in dot. AIX 5.1, GCC 3.2.2

[Bug c++/11456] Segfault in dot. AIX 5.1, GCC 3.2.2

[Bug c++/11461] [3.3 Regression] internal compiler error: in build_modify_expr, at cp/typeck.c:5346

[Bug c++/11461] New: internal compiler error: in build_modify_expr, at cp/typeck.c:5346

[Bug c++/11462] New: Segmentation Fault during Code Loading

[Bug c++/11462] Segmentation Fault during Code Loading

[Bug c++/11463] bugging on this: "strheaders = new string[headers.size ()];"

[Bug c++/11463] New: bugging on this: "strheaders = new string[headers.size ()];"

[Bug c++/11466] '-mlittle-endian' doesn't work with GCC3.2.3 under Solaris 2.x

[Bug c++/11466] New: '-mlittle-endian' doesn't work with GCC3.2.3 under Solaris 2.x

[Bug c++/11467] New: using doesn't help with two-stage lookup of members in template base

[Bug c++/11467] using doesn't help with two-stage lookup of members in template base

[Bug c++/11468] Deriving from CNI class java::lang::Object does not work.

[Bug c++/11468] New: Deriving from CNI class java::lang::Object does not work.

[Bug c++/11471] g++ segfaults (at probably illegal code)

[Bug c++/11471] ICE on illegal use of typedef'd member class

[Bug c++/11471] New: g++ segfaults (at probably illegal code)

[Bug c++/11473] New: 3.3: ICE with -gstabs when including STL headers

[Bug c++/11474] -Wreturn-type should default to on when compiling C++

[Bug c++/11474] New: -Wreturn-type should default to on when compiling C++

[Bug c++/11479] New: Building GCC 3.3 on SCO OpenServer version 3.2v5.0.6 fails

[Bug c++/11485] implicit typename warning reported for wrong line

[Bug c++/11485] New: implicit typename warning reported for wrong line

[Bug c++/11486] New: Wrong matching of template template parameters for templates with default arguments

[Bug c++/11486] Wrong matching of template template parameters for templates with default arguments

[Bug c++/11487] g++ accepts non-type as type in declaration

[Bug c++/11487] New: g++ accepts non-type as type in declaration

[Bug c++/11489] [3.4 Regression] ICE on typecast of template-argument-derived value as template argument

[Bug c++/11489] [3.4 Regression] ICE/segfault on legal code

[Bug c++/11489] New: ICE/segfault on legal code

[Bug c++/11490] [3.4 regression] Spurious signedness warning with templates

[Bug c++/11490] New: [3.4 regression] Spurious signedness warning with templates

[Bug c++/11492] New: Unsigned char promoted to signed int in for loop test for gpp but not gcc

[Bug c++/11492] Unsigned char promoted to signed int in for loop test for gpp but not gcc

[Bug c++/11493] [3.4 regression] tree check ICE in error.c

[Bug c++/11493] New: [3.4 regression] tree check ICE in error.c

[Bug c++/11495] [3.4 regression] Two-stage name lookup not Koenig-aware

[Bug c++/11495] New: [3.4 regression] Two-stage name lookup not Koenig-aware

[Bug c++/11497] const instance of class requires ctor definition

[Bug c++/11497] New: const instance of class requires ctor definition

[Bug c++/11501] New: template environmet confuses g++, and prohibits compiling valid code

[Bug c++/11501] template environmet confuses g++, and prohibits compiling valid code

[Bug c++/11503] [3.3/3.4 Regression] segfault when instantiating template with ADDR_EXPR

[Bug c++/11503] New: segfault when instantiating template with ADDR_EXPR

[Bug c++/11503] segfault when instantiating template with ADDR_EXPR

[Bug c++/11506] New: SFINAE fails sometimes

[Bug c++/11506] SFINAE fails sometimes

[Bug c++/11507] [3.4 regression] parser fails to recognize namespace

[Bug c++/11507] [3.4 regression]parser fails to recognize namespace; regression to 3.3

[Bug c++/11507] New: parser fails to recognize namespace; regression to 3.3

[Bug c++/11507] parser fails to recognize namespace; regression to 3.3

[Bug c++/11509] [3.4 regression] ICE with expression with static member in template arg

[Bug c++/11509] New: [3.4 regression] ICE with expression with static member in template arg

[Bug c++/11510] Error message with operator __imag__ is missing spaces

[Bug c++/11510] New: Error message with operator __imag__ is missing spaces

[Bug c++/11511] [3.4 Regression] ICE on typecast of template-argument-derived value as template argument

[Bug c++/11511] New: [3.4 Regression] ICE on typecast of template-argument-derived value as template argument

[Bug c++/11512] [3.4 Regression]Wrong warning in trivial function template

[Bug c++/11512] New: Wrong warning in trivial function template

[Bug c++/11513] [3.3/3.4 Regression] ICE in push_template_decl_real cp/pt.c:2755, template member functions

[Bug c++/11513] [3.4 Regression] ICE in push_template_decl_real cp/pt.c:2755, template member functions

[Bug c++/11513] New: ICE in push_template_decl_real cp/pt.c:2755, template member functions

[Bug c++/11517] [3.3/3.4 Regression]g++ fails to properly convert pointer expressions in conditional expressions.

[Bug c++/11517] [3.4 Regression]g++ fails to properly convert pointer expressions in conditional expressions.

[Bug c++/11517] g++ fails to properly convert pointer expressions in conditional expressions.

[Bug c++/11517] New: g++ fails to properly convert pointer expressions in conditional expressions.

[Bug c++/11518] (b==a && c==a && c!=b) == true

[Bug c++/11518] New: (b==a && c==a && c!=b) == true

[Bug c++/11525] [3.4 Regression] ICE/segfault on C++ code

[Bug c++/11525] ICE/segfault on C++ code

[Bug c++/11525] ICE/segfault on hppa2.0w-hp-hpux11.11

[Bug c++/11525] New: ICE/segfault on hppa2.0w-hp-hpux11.11

[Bug c++/11528] New: money_get does not get "$.00"

[Bug c++/11529] ICE in garbage collection

[Bug c++/11530] [3.4 regression] [unit-at-a-time] inline static function not emitted with -O3

[Bug c++/11530] [3.4 regression] unit-at-a-time: inline static function not emitted with -O3

[Bug c++/11530] New: inline static function not emitted with -O3

[Bug c++/11531] [3.4 Regression] ICE on invalid code (returning to void)

[Bug c++/11531] ICE on invalid code (returning to void)

[Bug c++/11531] New: ICE on invalid code (returning to void)

[Bug c++/11532] c++ segfault on __attribute__ for missing variable name

[Bug c++/11532] New: c++ segfault on __attribute__ for missing variable name

[Bug c++/11540] New: Redefinition of default arguments allowed for template functions

[Bug c++/11540] Redefinition of default arguments allowed for template functions

[Bug c++/11542] assignment to one bit of bitfield clobbers other bits

[Bug c++/11542] New: assignment to one bit of bitfield clobbers other bits

[Bug c++/11546] [3.3 Regression] Type lookup problems in out-of-line definition of a class doubly nested from a template class

[Bug c++/11546] New: Type lookup problems in out-of-line definition of a class doubly nested from a template class

[Bug c++/11547] [3.4 regression] ICE with const temporaries

[Bug c++/11547] New: [3.4 regression] ICE with const temporaries

[Bug c++/11548] [3.4 regression] Forwarding default template args ICEs

[Bug c++/11548] New: [3.4 regression] Forwarding default template args ICEs

[Bug c++/11549] internal compiler error: in ix86_expand_binop_builtin

[Bug c++/11549] New: internal compiler error: in ix86_expand_binop_builtin

[Bug c++/11550] New: Support for Locales and Facets Appears to be Missing or Unsupported

[Bug c++/11551] [3.4 regression] g++ accepts typedef as destructor name

[Bug c++/11551] New: [3.4 regression] g++ accepts specialization typedef as destructor name

[Bug c++/11552] [3.4 regression] g++ accepts class defined in return type

[Bug c++/11552] New: [3.4 regression] g++ accepts class defined in return type

[Bug c++/11553] [3.4 regression] g++ accepts duplicate 'friend'

[Bug c++/11553] New: [3.4 regression] g++ accepts duplicate 'friend'

[Bug c++/11554] [3.3/3.4 Regression] Warning about reordering of initializers doesn't mention location of constructor

[Bug c++/11554] New: Warning about reordering of initializers doesn't mention location of constructor

[Bug c++/11562] New: Reject legal code : call of template function in a template class

[Bug c++/11562] Reject legal code : call of template function in a template class

[Bug c++/11567] C++ code containing templated member function with same name as pure virtual member function results in linking failure

[Bug c++/11567] New: C++ code containing templated member function with same name as pure virtual member function results in linking failure

[Bug c++/11568] Crash in gcc 3.2

[Bug c++/11568] New: Crash in gcc 3.2

[Bug c++/11569] New: there's no substitute for #pragma once

[Bug c++/11569] there's no substitute for #pragma once

[Bug c++/11570] incorrect behaviour in calling base class methods

[Bug c++/11570] New: incorrect behaviour in calling base class methods

[Bug c++/11573] Forward class declaration is rejected in throw declaration

[Bug c++/11573] New: Forward class declaration is rejected in throw declaration

[Bug c++/11574] Internal compiler error with -fkeep-inline-functions

[Bug c++/11574] New: Internal compiler error with -fkeep-inline-functions

[Bug c++/11578] cp/mangle.c doesn't handle __typeof__

[Bug c++/11578] New: cp/mangle.c doesn't handle __typeof__

[Bug c++/11582] New: Odd error message with dynamically sized template arg printing

[Bug c++/11582] Odd error message with dynamically sized template arg printing

[Bug c++/11583] New: Cannot reopen file using ifstream

[Bug c++/11585] New: static template member definition fails

[Bug c++/11585] static template member definition fails

[Bug c++/11588] New: segfault on compiling mozilla component of openoffice

[Bug c++/11588] segfault on compiling mozilla component of openoffice

[Bug c++/11595] [3.3/3.4 Regresion] crash on duplicate label definition

[Bug c++/11595] New: crash on duplicate label definition

[Bug c++/11596] [3.4 Regression] ICE with int templates

[Bug c++/11596] New: ICE with int templates

[Bug c++/11613] attribute unused after label causes error with g++

[Bug c++/11613] New: attribute unused after label causes error with g++

[Bug c++/11614] Incorrect handling of pointers to arrays

[Bug c++/11614] New: Incorrect handling of pointers to arrays

[Bug c++/11616] Error message "instantiated from here" gives wrong location

[Bug c++/11616] New: Error message "instantiated from here" gives wrong location

[Bug c++/11617] [3.4 regression] g++ does not report missing member functions

[Bug c++/11617] New: [3.4 regression] g++ does not report missing member functions

[Bug c++/11618] Floating point values not reproduced at -O3 with a simple C++ copy constructor.

[Bug c++/11618] New: Floating point values not reproduced at -O3 with a simple C++ copy constructor.

[Bug c++/11620] Nested class template typedef

[Bug c++/11620] New: Nested class template typedef

[Bug c++/11622] New: pointer to multiply derived class where both base classes have virtual member function != pointer to second base class after assignment

[Bug c++/11622] pointer to multiply derived class where both base classes have virtual member function != pointer to second base class after assignment

[Bug c++/11624] -Wnon-virtual-dtor doesn't always work

[Bug c++/11624] New: -Wnon-virtual-dtor doesn't always work

[Bug c++/11630] I have a problem with configure

[Bug c++/11630] New: I have a problem with configure

[Bug c++/11632] -pedantic flag performs a less pedantic type checking

[Bug c++/11632] New: -pedantic flag performs a less pedantic type checking

[Bug c++/11633] g++ does not initialize structures when auto-increment variables are used

[Bug c++/11633] New: g++ does not initialize structures when auto-increment variables are used

[Bug c++/11636] [3.3 Regression] Internal compiler error: segmentation fault

[Bug c++/11636] internal compiler error: segmentation fault

[Bug c++/11636] New: internal compiler error: segmentation fault

[Bug c++/11637] [3.3.1 prerelease] g++ invalid assembly with -fnon-call-exceptions

[Bug c++/11637] New: [3.3.1 prerelease] g++ invalid assembly with -fnon-call-exceptions

[Bug c++/11642] New: Segment violation when compiling

[Bug c++/11642] Segment violation when compiling

[Bug c++/11644] Hang in throw when unloading a library

[Bug c++/11644] New: Hang in throw when unloading a library

[Bug c++/11645] [3.3/3.4 Regression] Failure to deal with using and private inheritance

[Bug c++/11645] New: Failure to deal with using and private inheritance

[Bug c++/11648] G++ parse error for simple template code

[Bug c++/11648] New: G++ parse error for simple template code

[Bug c++/11652] incorrect template instantiation in some circumstances

[Bug c++/11652] New: incorrect template instantiation in some circumstances

[Bug c++/11664] Bad overload resolution in recursive template

[Bug c++/11664] New: Bad overload resolution in recursive template

[Bug c++/11667] New: wider-than-ine enums never compare equal to 0

[Bug c++/11667] wider-than-ine enums never compare equal to 0

[Bug c++/11667] wider-than-int enums never compare equal to 0

[Bug c++/11670] [3.4 Regression] ICE in convert_like_real on illegal code

[Bug c++/11670] ICE in convert_like_real on illegal code

[Bug c++/11670] New: ICE in convert_like_real on illegal code

[Bug c++/11671] New: make install: install-sh: not found

[Bug c++/11672] [3.3 regression] ICE on template instantiation in erroneous source.

[Bug c++/11672] New: ICE on template instantiation in erroneous source.

[Bug c++/11675] New: gstabs

[Bug c++/11677] Incorrect warning with -Wunused-value

[Bug c++/11677] New: Incorrect warning with -Wunused-value

[Bug c++/11678] New: Segv

[Bug c++/11678] Segv

[Bug c++/11679] ICE in finish_file, at cp/decl2.c:2727: varray out of bounds

[Bug c++/11679] ICE in finish_file, at cp/decl2.c:2727: varray out of bounds in --enable-checking mode

[Bug c++/11679] New: ICE in finish_file, at cp/decl2.c:2727: varray out of bounds

[Bug c++/11680] member access of C++ class with all methods inline should be optimized better

[Bug c++/11680] New: member access of C++ class with all methods inline should be optimized better

[Bug c++/11681] g++ crashes gracefully on parse error, but fixed in 2.96 redhat

[Bug c++/11681] New: g++ crashes gracefully on parse error, but fixed in 2.96 redhat

[Bug c++/11682] ICE in Templates default value call a function

[Bug c++/11682] New: ICE in Templates default value call a function

[Bug c++/11684] cannot find non-template (builtin) operator*(float,float)

[Bug c++/11684] New: Template specialisation

[Bug c++/11684] Template specialisation

[Bug c++/11685] New: typeinfo is not demangled in error messages

[Bug c++/11685] typeinfo is not demangled in error messages

[Bug c++/11689] New: g++3.3 emmits un-assembleable code for k6 architecture

[Bug c++/11690] Construct invocation taken as declaration

[Bug c++/11690] New: Construct invocation taken as declaration

[Bug c++/11694] [3.3 Regression] ICE with missing typename/template keywords

[Bug c++/11694] ICE with missing typename/template keywords

[Bug c++/11694] New: Template member class of template class mix-up

[Bug c++/11694] Template member class of template class mix-up

[Bug c++/11695] Memory corruption with -O1 and complex ET code

[Bug c++/11695] New: Memory corruption with -O1 and complex ET code

[Bug c++/11697] [3.3/3.4 Regression] Failure to diagnose class template redeclaration via using declaration

[Bug c++/11697] New: Failure to diagnose class template redeclaration via using declaration

[Bug c++/11701] New: Typeof problems in detecting whether its argument is a type or an expression

[Bug c++/11702] [3.4 Regression] [unit-at-a-time] Failure to emit code for inlined function in space

[Bug c++/11702] New: Failure to emit code for inlined function in space

[Bug c++/11703] [3.4 Regression] Problem with using enum in placement delete

[Bug c++/11703] New: Problem with using enum in placement delete

[Bug c++/11704] [3.4 Regression] ICE in type_dependent_expression_p with wrong method call in template class

[Bug c++/11704] New: ICE in type_dependent_expression_p with wrong method call in template class

[Bug c++/11711] Inheritance from partially specialized template does not work

[Bug c++/11711] New: Inheritance from partially specialized template does not work

[Bug c++/11712] [HPUX 11.00 - gcc 3.3] __STDC_EXT__ not defined for .cpp by default anymore?

[Bug c++/11712] New: [HPUX 11.00 - gcc 3.3] __STDC_EXT__ not defined for .cpp by default anymore?

[Bug c++/11713] [3.3/3.4 regression] c++ parser error

[Bug c++/11713] New: c++ parser error

[Bug c++/11715] Error with template keyword in a non-dependent type

[Bug c++/11715] New: Error with template keyword in a non-dependent type

[Bug c++/11719] Cannot specialize a member function of a template class

[Bug c++/11719] New: Cannot specialize a member function of a template class

[Bug c++/11720] mozilla configure script thinks 3.3.1 has pedantic long long bug

[Bug c++/11720] New: mozilla configure script thinks 3.3.1 has pedantic long long bug

[Bug c++/11721] error on specialization as friend class

[Bug c++/11721] New: error on specialization as friend class

[Bug c++/11725] [3.4 Regression] Wrong return statement warning with -Wreturn-type in template class method

[Bug c++/11725] New: Wrong return statement warning with -Wreturn-type in template class method

[Bug c++/11727] New: segv

[Bug c++/11727] segv

[Bug c++/11729] New: no operator!= for const_reverse_iterator

[Bug c++/11731] New: segv

[Bug c++/11731] segv

[Bug c++/11733] New: std::string as static member

[Bug c++/11733] std::string as static member

[Bug c++/11735] [3.3 Regression] internal compiler error: Segmentation fault

[Bug c++/11735] New: internal compiler error: Segmentation fault

[Bug c++/11738] ICE "could not split insn" building libstdc++-v3

[Bug c++/11738] New: ICE "could not split insn" building libstdc++-v3

[Bug c++/11742] -fPIC generates invalid assembly on Pentium III coppermine

[Bug c++/11742] New: -fPIC generates invalid assembly on Pentium III coppermine

[Bug c++/11743] ICE with typeof applied to template parameter dependant expression

[Bug c++/11743] Internal error

[Bug c++/11743] New: Internal error

[Bug c++/11744] [3.4 Regression] Wrong namespace lookup when induced by a template parameter

[Bug c++/11744] New: Wrong namespace lookup when induced by a template parameter

[Bug c++/11746] __attribute__((__noreturn__)) causing compiler SEGV

[Bug c++/11746] New: __attribute__((__noreturn__)) causing compiler SEGV

[Bug c++/11748] g++ compiles invalid code

[Bug c++/11748] New: g++ compiles invalid code

[Bug c++/11749] New: warning when initializing an enum type exceeding precision

[Bug c++/11749] warning when initializing an enum type exceeding precision

[Bug c++/11750] New: Incorrect virtual method invoked for class hierarchy w/ virtual bases

[Bug c++/11752] New: partial ordering overloaded function templates

[Bug c++/11752] partial ordering overloaded function templates

[Bug c++/14] template template parameters

[Bug c++/1607] [3.3 only] Format attributes on methods undocumented

[Bug c++/1692] -fvtable-gc flag is only meaningful on ELF targets

[Bug c++/1833] Temporary rvalue (result of cast) can be illegally bound to non-const reference

[Bug c++/1920] no warning or error with cast-as-lvalue extension

[Bug c++/2019] Wrong line number warning listing the previous declaration of a befriended function

[Bug c++/2474] global destructors should run in reverse order of _finishing_ construction

[Bug c++/2518] user-declared operator new hides standard one

[Bug c++/2650] ICE, in c_expand_expr, at c-common.c:3906

[Bug c++/3004] Accepts illegal code

[Bug c++/3012] parser:templated member function fails within templated class

[Bug c++/3063] Explicit specification of a template-argument gives syntax error inside a template function.

[Bug c++/35] template operator () lookup fails

[Bug c++/3671] cannot deduce enum template parameter with multiple overloads

[Bug c++/3761] ICE in check_template_shadow, at cp/pt.c:2013, with friend and strange class hierarchy

[Bug c++/3765] member using declaration can't change access from public

[Bug c++/3792] Internal compiler error in grokdeclarator, at cp/decl.c:9760

[Bug c++/3907] [3.3/3.4 Regression] nested template parm collides with member name

[Bug c++/4232] template instantiation in function body using a template argument fails

[Bug c++/4672] [3.3/3.4 Regression] [DR 214] Template parameter deduction fails for overloaded template functions.

[Bug c++/4862] Parse error with templated member function

[Bug c++/4908] Pointer to function type template arguments include default argument info

[Bug c++/4926] Segmentation Fault on Legal Code

[Bug c++/495] ICE in in lookup_template_class, at cp/pt.c:3961

[Bug c++/5026] __attribute__ ((unused) seems misdocumented

[Bug c++/5050] template instantiation depth exceeds/maybe recursion problem

[Bug c++/5247] Memory eating infinite loop on default parameter in constructor which is reference to class

[Bug c++/5293] [3.3/3.4 regression] confusing message when binding a temporary to a reference

[Bug c++/5388] [3.3/3.4 regression] Incorrect message "operands to ?: have different types"

[Bug c++/5421] friends+templates: ICE: expected identifier_node, have template_id_expr in grokfndecl, at cp/decl.c:8835

[Bug c++/5533] g++ segfaults when processing std::accumulate(begin, end, init, invalid_op)

[Bug c++/5577] Non-dependent member template without template keyword does not parse

[Bug c++/5767] ICE with forwarding template template parameters

[Bug c++/629] floating point comparison

[Bug c++/6321] no warning for bad main function declaration

[Bug c++/641] Incorrect warning about befriending two template specializations (with arguments <T> and <const T>) when "T" is already a const type

[Bug c++/6424] sizeof() with overload resolution (core issue 339)

[Bug c++/6548] Incorrect mangling for extern C and namespace

[Bug c++/6706] [3.4 regression] ICE with variable-sized arrays and DWARF-1 output

[Bug c++/6730] Crash involving templates: ICE in lookup_members: cp/search.c:1228

[Bug c++/6749] infinte loop with inheritance of abstract classes

[Bug c++/6771] [3.4 regression] [cygwin] ICE in in rest_of_compilation, at toplev.c:3761 for code with dllimport/dllexport

[Bug c++/6785] Core dump from g++ 3.0.4 (on Linux)

[Bug c++/6880] Inefficient Copy constructor generation

[Bug c++/6949] [3.3/3.4 regression] ICE in tsubst_decl, at cp/pt.c:5733

[Bug c++/7019] [3.3/3.4 Regression] SFINAE does not work with explicitally specified template arguments

[Bug c++/7019] SFINAE does not work with explicitally specified template arguments

[Bug c++/7053] [3.3 Regression] ICE when declaring a function already defined as a friend method of a template class

[Bug c++/7053] [3.3/3.4 Regression] ICE when declaring a function already defined as a friend method of a template class

[Bug c++/7083] ICE using -gstabs with dodgy class derivation

[Bug c++/7307] -pedantic makes errors to warnings

[Bug c++/7385] [3.3/3.4 Regression] g++ problems with enum and __attribute__

[Bug c++/7385] g++ problems with enum and __attribute__

[Bug c++/7586] Incorrect handling of attributes in template codes

[Bug c++/7588] Built-in functions not marked as such

[Bug c++/7638] inline friend in template class produces strange error msg

[Bug c++/7722] ICE in find_function_data, at function.c:318, with static array of label addresses in function templates

[Bug c++/7765] Problems with french translation

[Bug c++/7809] befriending inaccessible names

[Bug c++/7841] gcc accepts illegal member function syntax for template classes

[Bug c++/7855] [3.3 regression] Wrong line number specified in error / warning message

[Bug c++/7874] [3.3/3.4 regression] g++ finds friend functions defined in class-definition but not declared in the enclosing namespace

[Bug c++/7884] Cast as lvalue extension does not always work as expected

[Bug c++/7906] Templated class with nested non-templated class having an operator() fails to compile

[Bug c++/7910] [3.3/3.4 regression] [cygwin] Seg fault when compiling OpenSceneGraph 0.9.1

[Bug c++/7939] [3.3/3.4 regression] ICE on function template specialization

[Bug c++/795] parse error in member template method

[Bug c++/7983] ICE for friend declaration using typedef in class template

[Bug c++/8046] ICE on illegal code involving destructor being treated as bit-not expression

[Bug c++/8057] [3.3/3.4 regression] Templates/non-templates and warnings about statements without effects

[Bug c++/8109] static member const used in non-type template parameter

[Bug c++/8164] [3.3 regression] ICE when using different const expressions as template parameter

[Bug c++/8171] Cannot compare pointer to member function of base and derived class

[Bug c++/8222] Keyword 'template' required to access member templates in non-dependent postifx expressions

[Bug c++/8277] g++ 3.2 is confused by operators and namespaces

[Bug c++/8327] In definition of template static member value of static const member isn't known

[Bug c++/8442] [3.4 regression] rejects nested template classes

[Bug c++/8488] invalid reference cast being accepted with -pedantic on

[Bug c++/8549] --pedantic-errors problems on RedHat 6.1

[Bug c++/8806] gcc accepts bad argument for template template parameter

[Bug c++/8856] [3.3/3.4 regression] g++ accepts invalid conversion-function-id

[Bug c++/8876] [3.4 regression] ICE in resolve_offset_ref, at cp/init.c:1824

[Bug c++/8895] ICE on invalid template default value specification

[Bug c++/8921] Trouble with member templates

[Bug c++/8986] [3.3 regression] ICE with segfault on include inside namespace

[Bug c++/8991] [solaris] g++ 3.2.1 with -frepo on templates - puts collect2 into an infinite loop

[Bug c++/8991] g++ with -frepo on templates - puts collect2 into an infinite loop

[Bug c++/8] friend template function declaration within template class

[Bug c++/9067] vectors of vectors break with -ftrapv

[Bug c++/9126] g++ incorrectly prefers non-template user-defined conversion operator

[Bug c++/9154] [3.4 regression] poor error message for ">>" vs. "> >" for nested template args

[Bug c++/9162] [3.4 regression][New parser] Problem with default argument in a friend function

[Bug c++/9282] compiler rejects to get function pointers to static member functions in template arguments

[Bug c++/9338] ICE in peculiar templated constructors

[Bug c++/9374] [3.4 regression] ICE in make_decl_rtl, at varasm.c:790

[Bug c++/9411] [3.4 regression] [New parser] Template function lookup problem

[Bug c++/9435] [Sparc] internal compiler error: in simplify_gen_subreg, at simplify-rtx.c

[Bug c++/9436] passing a class template followed by a template value of this class

[Bug c++/9447] [3.4 regression] using Base<T>::member does not work

[Bug c++/9452] segfault in convert_from_reference using a dependent expression as argument for the template-id in the return type

[Bug c++/9454] [3.4 regression][New parser] ICE in lookup_member, at cp/search.c:1503

[Bug c++/9457] [3.4 regression] ICE in tsubst_copy, at cp/pt.c:7124

[Bug c++/9460] parse error on template member function

[Bug c++/9483] [3.4 regression] Member with same name as class allowed

[Bug c++/9486] [3.4 regression] can't find a matching member template function

[Bug c++/9487] [3.4 regression] ICE in build_over_call, at cp/call.c:4463

[Bug c++/9488] [3.4 regression][New parser] ICE in regenerate_decl_from_template

[Bug c++/9510] Compilation fails when calling member function templated on integer

[Bug c++/9543] Syntax error on calling a template method from a template function

[Bug c++/9549] [3.4 regression] [New parser] ICE in regenerate_decl_from_template

[Bug c++/9559] [3.3/3.4 regression] ICE with invalid initialization of a static const member

[Bug c++/9574] [3.4 regression] Error accessing static member with custom operator []

[Bug c++/9634] [3.4 regression] [DR224] Injected class name as qualifier should not make the name dependent

[Bug c++/9737] [DR184] Partial template specialisation selection failure involving template parameter defaults

[Bug c++/9738] [3.3 regression] [mingw] Internal compiler error in rest_of_compilation, at toplev.c: 3491

[Bug c++/9744] Explicit parameterization of templated return value fails within templated function

[Bug c++/9779] [3.4 regression] ICE in type_unknown_p when casting in static member

[Bug c++/9844] Segmentation fault using function with return value with attribute for mode

[Bug c++/9907] [3.4 regression] sizeof considered as non constant

[Bug c++/9941] [non-weak] typeinfo not generated correctly when #pragmas are involved

[Bug c/10143] -Wsequence-point missing warnings

[Bug c/10148] [3.3 regression] [MingW/CygWin] Compiler dumps core

[Bug c/10151] int x asm("y") only gives x new name if "x" != "y"

[Bug c/10170] No warning for "if(foo)" instead of "if(foo())"

[Bug c/10290] Segmentation fault

[Bug c/10320] [3.4 regression] gcc 3.4 gets rid of static inline function that does not get inlined

[Bug c/10355] i386 regparm doco note on shlib use

[Bug c/10382] GCC 3.2.1: internal error

[Bug c/10460] optimization switch causes read( ) gcc stdlib function to fail.

[Bug c/10602] [3.3/3.4 regression] ICE in c-typeck.c (tree check failure)

[Bug c/10719] invalid code generated (x86, "int $5") with __builtin_va_arg(va, char);

[Bug c/10855] extern __inline__ does not compile at -O0

[Bug c/10962] [3.3 regression] lookup_field is a linear search on a linked list (can be slow if large struct)

[Bug c/10962] [3.3/3.4 regression] lookup_field is a linear search on a linked list (can be slow if large struct)

[Bug c/11207] [3.3/3.4 regression] ICE with negative index in array element designator

[Bug c/11218] [tree-ssa] symbol already defined

[Bug c/11234] -pedantic accepts function pointer <-> void*

[Bug c/11244] pipe hang when program compiled with -maix64 and -static

[Bug c/11245] [3.4 Regression] __asm__ use generates bad code with current CVS gcc

[Bug c/11250] -pedantic accepts `char a[] = ("x");'

[Bug c/11319] [3.3/3.4 regression] loop miscompiled on ppc32

[Bug c/11358] complex-6.c:40: internal compiler error: in subreg_hard_regno, at emit-rtl.c:1087

[Bug c/11369] too relaxed checking with -Wstrict-prototypes

[Bug c/11370] [3.3 Regression] -Wunreachable-code gives false complaints

[Bug c/11370] [3.3/3.4 Regression] -Wunreachable-code gives false complaints

[Bug c/11377] fault or warn modifiable static in extern inline definition

[Bug c/11380] [ia64] stack frame > 2 GB and no optimization results in SEGV

[Bug c/11386] GNU Emacs 21.3 failed to install using GCC 3.3, but GCC 3.2.3 works.

[Bug c/11392] [3.3/3.4 Regression]Generalisation of 8730 bug

[Bug c/11392] [3.3/3.4 Regression]More trouble with nested functions

[Bug c/11392] Generalisation of 8730 bug

[Bug c/11392] New: Generalisation of 8730 bug

[Bug c/11395] New: problem with asm inserts used as immediate arguments

[Bug c/11397] New: weak aliases broken on Tru64 UNIX

[Bug c/11397] weak aliases broken on Tru64 UNIX

[Bug c/11399] gcc 3.3.1 miscompiles an if - else if - else statement with O1 on ia64

[Bug c/11399] New: gcc 3.3.1 miscompiles an if - else if - else statement with O1 on ia64

[Bug c/11413] -ffixed registers on powerpc optimized incorrectly

[Bug c/11413] New: -ffixed registers on powerpc optimized incorrectly

[Bug c/11420] [3.3 regression][x86_64] gcc generates invalid asm code when "-O -fPIC" is used (suffix or operands invalid for `movabs')

[Bug c/11420] [3.3/3.4 regression][x86_64] gcc generates invalid asm code when "-O -fPIC" is used (suffix or operands invalid for `movabs')

[Bug c/11420] [x86_64] gcc generates invalid asm code when "-O -fPIC" is used (suffix or operands invalid for `movabs')

[Bug c/11420] New: [x86_64] gcc generates invalid asm code when "-O -fPIC" is used (suffix or operands invalid for `movabs')

[Bug c/11424] Asm broken on IA64 ?

[Bug c/11424] New: Asm broken on IA64 ?

[Bug c/11426] internal compiler error: Segmentation Fault

[Bug c/11426] New: internal compiler error: Segmentation Fault

[Bug c/11427] New: Problem with conditional expressions as l-values

[Bug c/11427] Problem with conditional expressions as l-values

[Bug c/11428] [3.4 regression] gcc aborts in compiling Linux 2.5.74 reiserfs driver

[Bug c/11428] gcc aborts in compiling Linux 2.5.74 reiserfs driver

[Bug c/11428] New: gcc aborts in compiling Linux 2.5.74 reiserfs driver

[Bug c/11430] gcc 3.3 on SunOS 5.8: internal compiler error: Segmentation Fault

[Bug c/11430] New: gcc 3.3 on SunOS 5.8: internal compiler error: Segmentation Fault

[Bug c/11445] false positive warning with -Wunreachable-code

[Bug c/11445] New: false positive warning with -Wunreachable-code

[Bug c/11446] [3.4] Incompatibilty with alignment of structures between 3.3 and 3.4 CVS

[Bug c/11446] New: Incompatibilty with alignment of structures between 3.3 and 3.4 CVS

[Bug c/11448] New: wprintf and similar functions set errno with no apparent reason

[Bug c/11448] wprintf and similar functions set errno with no apparent reason

[Bug c/11449] [3.4 Regression] ICE in invert_truthvalue called on AND operation

[Bug c/11449] New: gcc mainline aborts, invert_truthvalue called on AND operation

[Bug c/11451] New: [m32r-elf] wrong code with -O at cmp_ne_small_const_insns

[Bug c/11452] [tree-ssa] ICE with variable-sized arrays

[Bug c/11452] New: [tree-ssa] ICE with variable-sized arrays

[Bug c/11453] gcc > 3.3 ICE

[Bug c/11453] New: gcc > 3.3 ICE

[Bug c/11459] -ansi -std=c99 -pedantic warns about C90's non long-long support when in C99 mode

[Bug c/11459] -stdc=c90 -pedantic -ansi warns about C90's non long-long support when in C99 mode

[Bug c/11459] -stdc=c99 -pedantic -ansi warns about C90's non long-long support when in C99 mode

[Bug c/11459] New: -stdc=c90 -pedantic warns about C90's non long-long support when in C99 mode

[Bug c/11464] New: vararg function assembled into int $0x5

[Bug c/11464] vararg function assembled into int $0x5

[Bug c/11469] Code compiles and runs correctly without optimisation but causes a bus error if -O is used on Solaris 2.8

[Bug c/11469] New: Code compiles and runs correctly without optimisation but causes a bus error if -O is used on Solaris 2.8

[Bug c/11475] New: [SPARC] -O1: internal compiler error: in find_reloads, at reload.c:3629

[Bug c/11491] New: Problem with optimized inline caller of alloca()

[Bug c/11494] invalid suffix "T" on integer cuased internal Segsigv

[Bug c/11494] New: invalid suffix "T" on integer cuased internal Segsigv

[Bug c/11499] ICE in simplify_gen_subreg, at simplify-rtx.c on ia64.

[Bug c/11499] New: ICE in simplify_gen_subreg, at simplify-rtx.c on ia64.

[Bug c/11520] New: code generator bug for avr mega8

[Bug c/11527] [3.3/3.4 Regression] If an array "designated intializer" in a struct causes a segv.

[Bug c/11527] If an array "designated intializer" in a struct causes a segv.

[Bug c/11527] New: If an array "designated intializer" in a struct causes a segv.

[Bug c/11536] New: -O2 optimalization produces wrong code

[Bug c/11537] internal error when compiling pine on alpha

[Bug c/11537] New: internal error when compiling pine on alpha

[Bug c/11555] ICE in verify_loop_structure, at cfgloop.c:1270

[Bug c/11555] New: ICE in verify_loop_structure, at cfgloop.c:1270

[Bug c/11560] [3.4 regression] -fprofile-arcs no longer creates {.da,.gcda} files

[Bug c/11560] New: [3.4 regression] -fprofile-arcs no longer creates {.da,.gcda} files

[Bug c/11576] [3.3 only] internal error at emit-rtl.c:2017

[Bug c/11576] [3.3 regression] internal error at emit-rtl.c:2017

[Bug c/11576] New: internal error at emit-rtl.c:2017

[Bug c/11577] Gcc doesn't handle pointer subtraction right

[Bug c/11577] New: Gcc doesn't handle pointer subtraction right

[Bug c/11579] New: segmentation fault during ORACLE Driver for perl

[Bug c/11579] segmentation fault during ORACLE Driver for perl

[Bug c/11586] after call sigaction, system() return wrong status

[Bug c/11586] New: after call sigaction

[Bug c/11587] New: SH ICE in reload_cse_simplify_operand, postreload.c

[Bug c/11607] New: [3.3.1 regression] Segmentation fault in gen-protos in stage2

[Bug c/11627] internal compiler error: in push_reload, at reload.c:1282

[Bug c/11627] New: internal compiler error: in push_reload, at reload.c:1282

[Bug c/11628] New: movd support for _mm_cvtsi32_si64 and _mm_cvtsi64_si32

[Bug c/11639] -Os produces unrecognizable insn

[Bug c/11639] New: -Os produces unrecognizable insn

[Bug c/11641] Arts 1.1.2 compilation error with gcc over IA64

[Bug c/11641] New: Arts 1.1.2 compilation error with gcc over IA64

[Bug c/11643] inline ASM; gcc choses same registers for differrent variables set to "r" (variable)

[Bug c/11643] New: inline ASM; gcc choses same registers for differrent variables set to "r" (variable)

[Bug c/11647] ice on __builtin_ia32_psllq

[Bug c/11647] New: ice on __builtin_ia32_psllq

[Bug c/11654] gcc seg fault when using pre-compiled headers and -gstabs

[Bug c/11654] New: gcc seg fault when using pre-compiled headers and -gstabs

[Bug c/11657] erroneous syntax of extern static const array reference

[Bug c/11657] New: erroneous syntax of extern static const array reference

[Bug c/11658] New: Wrong error message

[Bug c/11658] Wrong error message

[Bug c/11663] gcc ignores the cast and emits a warning

[Bug c/11663] New: gcc ignores the cast and emits a warning

[Bug c/11665] ICE in struct initializer

[Bug c/11665] New: ICE in struct initializer

[Bug c/11718] [new-ra] ICE on valid code with SSE

[Bug c/11718] ICE on valid code with SSE and -fnew-ra

[Bug c/11718] New: ICE on valid code with SSE and -fnew-ra

[Bug c/11726] compiling programs with -static -fPIC produces code that will not run

[Bug c/11726] New: compiling programs with -static -fPIC produces code that will not run

[Bug c/11730] ICE building libiberty/regex for thumb

[Bug c/11730] New: ICE building libiberty/regex for thumb

[Bug c/11734] New: Optimization errors using -m64 above -O1

[Bug c/11734] Optimization errors using -m64 above -O1

[Bug c/11741] internal compiler error at gcse.c:5318

[Bug c/11741] New: internal compiler error at gcse.c:5318

[Bug c/11747] Insufficient compiler warnings issued.

[Bug c/11747] New: Insufficient compiler warnings issued.

[Bug c/11751] New: wrong evaluation of an expression

[Bug c/11751] wrong evaluation of an expression

[Bug c/1687] [3.4 regression] Exponential time behavior with -O -finline-functions (compile time regression from 3.2, 3.3)

[Bug c/2511] -pedantic not warning about bitfield overflow

[Bug c/2582] implicit cast assignment from int to float problem with x86

[Bug c/2803] g++ fails where gcc succeeds

[Bug c/3325] cast of bit-field to same type gets discarded

[Bug c/3347] Too large bitfields should be errors

[Bug c/448] <stdint.h>-related issues

[Bug c/545] -std=c89 defines macros it shouldn't

[Bug c/6346] sign extension missing after cast down and up on long long bitfield

[Bug c/6515] incorrect bitfield promotion

[Bug c/6900] Floating point behaviour of gcc on pentium

[Bug c/7284] incorrectly simplifies leftshift followed by signed power-of-2 division

[Bug c/7651] Define -Wextra strictly in terms of other warning flags

[Bug c/7654] -Wenum-assignment : Warn if an enum is being assigned a non enum value

[Bug c/7655] -W name compatible, -W strict pointer compatible

[Bug c/7696] [64bit] Spurious shift warning and wrong code

[Bug c/772] Statement expressions issues

[Bug c/7733] Segmentation Fault with -ftest-coverage

[Bug c/8081] ICE with variably sized types and nested functions

[Bug c/8559] [Tru64] Excessive memory usage with -O3

[Bug c/8743] receiving result from __builtin_return_address() beyond stack top causes segfault

[Bug c/8859] [CygWin] Initializer element allegedly not constant

[Bug c/8960] [3.3 regression] Segfault with __attribute__ ((mode (...))) in start_function:5702

[Bug c/9049] No support for selective enabling/disabling of warnings

[Bug c/9088] c code aborts with -ftrapv

[Bug c/9163] [3.3/3.4 regression] ICE in genrtl_compound_stmt at c-semantics.c:776 with c99 mode and checking enabled

[Bug c/9390] [translation] Segmentation Fault when compiling for athlon with LANG=es_ES@euro or LC_ALL=es_ES@euro

[Bug c/9469] [3.3/3.4 regression] initializer element is (allegedly) not constant

[Bug c/9539] [Windows] builtin [long/set]jmp not working properly with signals

[Bug c/9860] ICE in emit_move_insn_1, at expr.c:3114

[Bug c/9862] [3.3/3.4 regression] spurious warnings with -W -finline-functions

[Bug c/9862] [3.3/3.4 regression] spurious warnings with -W -O3

[Bug c/9890] __builtin_apply generates incorrect reference to arguments

[Bug debug/10001] gcc -g puts labels before function prologue

[Bug debug/10002] gcc -g sometimes places labels beyond the end of the function

[Bug debug/10055] [3.4 regression] g++ emits "<internal>" as source filename with -gstabs+

[Bug debug/10156] [3.3/3.4 Regression] g++ 3.2 fails to emit debug location info for a local variable inside a class constructor

[Bug debug/10220] attribute DW_AT_calling_convention not correct in f77

[Bug debug/10249] [ppc] -gxcoff switch causes parser to abort

[Bug debug/10466] Can't debug the first function in a C file that is included in another C file

[Bug debug/10493] error in dwarf2out_finish

[Bug debug/10499] [3.3, 3.4] Debug information for some C++ headers is missing classes (template specific?)

[Bug debug/10718] nested locals with same name broken with gcc HEAD 2003-04-11

[Bug debug/11098] [3.3./3.4 regression] [dwarf2] g++ doesn't emit complete debugging information for local variables in destructors

[Bug debug/11195] Gcc ELF file format NOT compatible with AXD *.axf

[Bug debug/11231] [3.3/3.4 regression] undefined array size inside struct cause segfault with -g

[Bug debug/11279] [3.3/3.4 Regression] DWARF-2 output mishandles large enums

[Bug debug/11325] [3.4 regression] nested class debug info missing

[Bug debug/11353] Still problems with namespaces

[Bug debug/11473] [3.3/3.4 Regression] ICE with -gstabs when empty struct inheits from an empty struct

[Bug debug/11500] [3.4 regression] gcc HEAD emits an extraneous "line 0" debug line at the start of each function

[Bug debug/11500] New: [3.4 regression] gcc HEAD emits an extraneous "line 0" debug line at the start of each function

[Bug debug/11508] gcc does not output correct debuging file information for #included variables

[Bug debug/11508] New: gcc does not output correct debuging file information for #included variables

[Bug debug/11522] [3.3/3.4 Regression] g77 dwarf-2 ICE in add_abstract_origin_attribute

[Bug debug/11522] g77 3.3.1: ICE in add_abstract_origin_attribute

[Bug debug/11608] New: testcase gcc.dg/debug/20020327-1.c fails with -gstabs1 etc.

[Bug debug/11608] testcase gcc.dg/debug/20020327-1.c fails with -gstabs1 etc.

[Bug debug/11675] gstabs

[Bug debug/3524] Source can not be comiled using option -gdwarf

[Bug debug/7511] objdump / gdb doesn't handle local labels

[Bug debug/7853] gcc reports multiple symbol definitions on the wrong line

[Bug debug/8446] stabs generation crashes when class inherits from typedef struct

[Bug debug/8664] [PPC linux] ICE in dwarf2out_frame_debug_expr, at dwarf2out.c:1538

[Bug debug/9957] gcc -g does not seem to produce the correct stabs for source file

[Bug debug/9963] [CygWin] g++ -gcoff report "C_EFCN symbol out of scope"

[Bug driver/10590] [sparc][solaris] "-static -shared" unsupported using solaris linker

[Bug driver/11417] [3.4 regression] fortran options warned about in cc1 when *.F or -x f77-cpp-input

[Bug driver/11417] [3.4 regresson] fortran options warned about in cc1 when *.F or -x f77-cpp-input

[Bug driver/11561] New: PCH driver incorrectly adding TARGET_EXECUTABLE_SUFFIX when -o specified

[Bug driver/11561] PCH driver incorrectly adding TARGET_EXECUTABLE_SUFFIX when -o specified

[Bug driver/9362] solaris 'as' dies when fed .s and "-gstabs"

[Bug fortran/10726] Documentation for function "IDate Intrinsic (Unix)" is wrong

[Bug fortran/11139] Non-standard code in test 980519-2.f

[Bug fortran/11301] [3.3/3.4 Regression] ICE with -fno-globals

[Bug fortran/11387] New: using stop without any argument

[Bug fortran/11387] using stop without any argument

[Bug fortran/11417] New: 3.4 regresson

[Bug fortran/11496] [3.3 only] error in flow_loops_find when -funroll-loops active

[Bug fortran/11496] error in flow_loops_find when -funroll-loops active

[Bug fortran/11496] New: error in flow_loops_find when -funroll-loops active

[Bug fortran/11522] [3.3/3.4 Regression] g77 dwarf-2 ICE in add_abstract_origin_attribute

[Bug fortran/11522] New: g77 3.3.1: ICE in add_abstract_origin_attribute

[Bug fortran/11687] New: xstormy16-elf build fails in libf2c

[Bug fortran/11687] xstormy16-elf build fails in libf2c

[Bug fortran/11688] New: xstormy16-elf build fails in libf2c

[Bug fortran/11688] xstormy16-elf build fails in libf2c

[Bug fortran/5156] non-buildable with FORTRAN90

[Bug fortran/5900] Lapack regressions for g77 3.1

[Bug inline-asm/10396] Constraint alternatives cause error " `asm' operand requires impossible reload"

[Bug inline-asm/10857] Inlining a function with inline-asm: "error: impossible constraint in `asm'"

[Bug inline-asm/11203] source doesn't compile with -O0 but they compile with -O3

[Bug inline-asm/11395] problem with asm inserts used as immediate arguments

[Bug inline-asm/11563] ia64 gcc won't save b0 when inline asm clobbers it

[Bug inline-asm/11563] New: ia64 gcc won't save b0 when inline asm clobbers it

[Bug inline-asm/11564] [3.3/3.4 regression] no longer compilable inline asm breaks linux kernel compile

[Bug inline-asm/11564] New: [3.3 regression] no longer compilable inline asm breaks linux kernel compile

[Bug inline-asm/11580] gcc seems to generate wrong-code for some inline-assembly

[Bug inline-asm/11580] New: gcc seems to generate wrong-code for some inline-assembly

[Bug inline-asm/11676] New: operand to volatile asm incorrectly removed

[Bug inline-asm/11676] operand to volatile asm incorrectly removed

[Bug inline-asm/6162] [3.3/3.4 regression] i386 asm reloader ice in reload_cse_simplify_operands

[Bug inline-asm/8788] [3.3/3.4 Regression]ICE in emit_move_insn, at expr.c:3089

[Bug inline-asm/9233] ICE for inline asm call to function taking a reference parameter

[Bug inline-asm/9637] arguments passed/return to asm block via mmx registers trigger failure

[Bug inline-asm/9860] ICE in emit_move_insn_1, at expr.c:3114

[Bug inline-asm/9915] Failed to compile a c file with inline asm instructions.

[Bug inline-asm/9981] attempt to read 64 bit pentium timestamp failure

[Bug java/10292] evaluation order of arguments when invoking native method

[Bug java/10293] incorrect evaluation order for final class method arguments

[Bug java/10490] Missing #include in gcjh output

[Bug java/10507] ICE generating object code.

[Bug java/10632] Numerical result differs from Sun JDK

[Bug java/11075] ICE compiling cross-package inherited constants

[Bug java/11117] internal error on compilation of java code

[Bug java/1111] Order matters for inline candidates

[Bug java/11336] ICE: bytecode-to-native compiler cannot find interface methods on abstract implementing classes

[Bug java/11443] gdb fails to show the source for main() in java programs

[Bug java/11443] New: gdb fails to show the source for main() in java programs

[Bug java/11470] bytecode created with gcj -C doesn't cache lookup from synthetic class$ member

[Bug java/11470] New: bytecode created with gcj -C doesn't cache lookup from synthetic class$ member

[Bug java/11478] fields marked 'transient' are being written out

[Bug java/11478] New: fields marked 'transient' are being written out

[Bug java/11502] fastjar error: "Error in JAR file format. zip-style comment?"

[Bug java/11502] New: fastjar error: "Error in JAR file format. zip-style comment?"

[Bug java/11521] New: Can install server socket on same port twice

[Bug java/11533] Inlining drops static initialization of inner class

[Bug java/11533] New: Inlining drops static initialization of inner class

[Bug java/11575] New: Problem with RandomAccessFile

[Bug java/11575] Problem with RandomAccessFile

[Bug java/11597] java/libjava fails to build in gcc-3.3

[Bug java/11597] New: java/libjava fails to build in gcc-3.3

[Bug java/11600] New: CloneNotSupportedException not checked on super.clone()

[Bug java/11623] New: wrong debug file name info when compiling from .class

[Bug java/11623] wrong debug file name info when compiling from .class (lacks directories)

[Bug java/11629] Disable RTL Inliner in gcj

[Bug java/11629] New: Disable RTL Inliner in gcj

[Bug java/11656] New: Win32 garabage collector crashes

[Bug java/11656] Win32 garabage collector crashes

[Bug java/11714] assert in static member class crashes gcj

[Bug java/11714] New: assert in static member class crashes gcj

[Bug java/3695] Verification error building OpenORB-1.1.0

[Bug java/4066] gcj -fjni generates thread-unsafe code

[Bug java/4105] gcj doesn't generate enough reflection info

[Bug java/4467] Ambiguous name resolution problem

[Bug java/4695] Error calling method from enclosing context in constructor

[Bug java/5519] add some dummy checking to compilation phase

[Bug java/5537] Error compiling simple bytecode with jsr

[Bug java/6391] Constant float to int conversions don't use ieee_real_to_integer when compiled to byte-code

[Bug java/6587] gcj generates incorrect debug output

[Bug java/7283] ICE on recursive import of inner classes

[Bug java/7304] gcj ICE on non-public class

[Bug java/7739] compile with -findirect-dispatch by default

[Bug java/8709] class init optimization should check subclasses

[Bug java/8791] compling from source produces the wrong answer

[Bug java/8923] gcj 3.2.1 - ICE when modifying a variable decleared "final static"

[Bug java/9351] Cannot compile kaffe core classes (foreign java.lang.Object)

[Bug java/9369] wrong bytecode generated for static inner class with private constructor

[Bug java/9461] -fno-assume-compiled and source compilation

[Bug java/9532] jar -C flag is incompatible with Sun's (fastjar uses nonportable feature of getcwd)

[Bug java/9685] Illegal access to package-private method is allowed

[Bug java/9943] field reference of enclosing class in an inner class cannot be compiled.

[Bug libf2c/10885] On 64-bit targets one can write >2Gb records in sequential files, but not in direct access files

[Bug libf2c/11671] make install: install-sh: not found

[Bug libgcj/10351] sparc-sun-solaris2.7 java testsuite failure in "linking cxxtest"

[Bug libgcj/10353] [3.3/3.4 regression] sparc-sun-solaris2.7 java testsuite failures Array_3, TLtest, Thread_Join, Thread_Wait_Interrupt & Throw_2

[Bug libgcj/10403] [win32] FileInputStream(File.toUrl().getFile()) does not work

[Bug libgcj/10596] Reference and String.intern don't work together

[Bug libgcj/10597] core classes must not have observable synchronization

[Bug libgcj/10598] dispatch tables and other Class structures not GCd

[Bug libgcj/10609] --enable-debug: different meanings for libstdc++v3 and libffi

[Bug libgcj/10653] is_assignable_from_slow bug

[Bug libgcj/10683] ffitest fails on sparc-sun-solaris2.8

[Bug libgcj/10746] [3.3 regression] [win32] garbage collection crash in GCJ

[Bug libgcj/10746] [3.3 regression] garbage collection crash in GCJ

[Bug libgcj/10746] [3.3/3.4 regression] [win32] garbage collection crash in GCJ

[Bug libgcj/10838] GCC 3.3 [libjava]: java.io.ObjectInputStream syntax error

[Bug libgcj/10868] java.net.ServerSocket's constructors create and leak extra sockets

[Bug libgcj/10886] The RMI registry that comes with GCJ does not work correctly

[Bug libgcj/11085] SimpleDateFormat fails to parse valid dates

[Bug libgcj/11330] java.lang.ClassLoader() does not set parent classloader

[Bug libgcj/11349] JNDI URL context factories not located correctly

[Bug libgcj/11502] fastjar error: "Error in JAR file format. zip-style comment?"

[Bug libgcj/11521] [win32] can install server socket on same port twice

[Bug libgcj/11521] Can install server socket on same port twice

[Bug libgcj/11575] [win32] Problem with RandomAccessFile

[Bug libgcj/11597] java/libjava fails to build in gcc-3.3

[Bug libgcj/11600] CloneNotSupportedException not checked on super.clone()

[Bug libgcj/11666] GCJ generates 0 instead of the maximum integer

[Bug libgcj/11666] New: GCJ generates 0 instead of the maximum integer

[Bug libgcj/11728] [3.4 regression] HashMap serialization does not work

[Bug libgcj/11728] HashMap serialization does not work

[Bug libgcj/11728] New: HashMap serialization does not work

[Bug libgcj/11737] [3.4 Regression] java.io.ObjectOutputStream.writeObject does not work with HashMap

[Bug libgcj/11737] New: [3.4 Regression] java.io.ObjectOutputStream.writeObject does not work with HashMap

[Bug libgcj/2382] libjava's testsuite returns error case

[Bug libgcj/4485] DecimalFormat not spec compliant

[Bug libgcj/5385] Program objects randomly changed. GCC failure

[Bug libgcj/5641] Verifier ICE on reference to inherited method

[Bug libgcj/6459] sparc-sun-solaris2.7 gcc-3.1 libjava testsuite failure in Throw_2

[Bug libgcj/7482] gij verify error

[Bug libgcj/7938] java-rmi-problem

[Bug libgcj/8027] SharedLibLoader is prematurely finalized, causing a core dump

[Bug libgcj/8170] jni.cc needs stack trace handling

[Bug libgcj/9077] gij is unable to run some programs in the NBIO test suite

[Bug libgcj/9124] [win32] URLClassLoader.getResource() should return canonicalized file URLs

[Bug libgcj/9250] runtime should only use non-visible locks

[Bug libgcj/9462] clean up class preparation

[Bug libgcj/9463] add native methods for file name encoding

[Bug libgcj/9645] url.openConnection() will request by default a http GET, while the jdk requests a POST

[Bug libgcj/9696] read fail on gij or compiled when object contains user objects

[Bug libobjc/11433] Crash due to dereferencing null pointer when querying protocol

[Bug libobjc/11433] New: Crash due to dereferencing null pointer when querying protocol

[Bug libobjc/11572] [regression]: GNU libobjc no longer compiled on Darwin

[Bug libobjc/11572] New: [regression]: GNU libobjc no longer compiled on Darwin

[Bug libobjc/9969] objc_msg_lookup is not thread safe

[Bug libstdc++/10063] [3.4 Regression] stdio_filebuf broken

[Bug libstdc++/10093] Regression: Setting failbit in exceptions doesn't work

[Bug libstdc++/10183] std::string - memory leak

[Bug libstdc++/10246] [3.4 regression] libsupc++ needs to be independent (again) of libstdc++

[Bug libstdc++/10276] [3.4 regression] ABI, memory issues with __locale_cache

[Bug libstdc++/10378] cannot add object with inplace new into STL collections

[Bug libstdc++/10529] C++ front-end troubles with uninitialized_fill_n

[Bug libstdc++/10689] pow(std::complex(0),1/3) returns (nan, nan) instead of 0.

[Bug libstdc++/10703] [3.3 regression] [Solaris] 27_io/istream_unformatted.cc fails on Sparc/Solaris 2.5.1 and 2.6

[Bug libstdc++/10797] filebuf.open() locks when using -lpthread on MIPS

[Bug libstdc++/10943] ext/hash_map causes namespace issues with abs

[Bug libstdc++/10975] incorrect initial ostringstream::tellp()

[Bug libstdc++/11062] Please avoid __attribute__ ((unused))

[Bug libstdc++/11153] bad build directory references in libstdc++.la and libsupc++.la

[Bug libstdc++/11171] Wrong ctype/OS include files when using Newlib

[Bug libstdc++/11240] operator-() fails for reverse_iterator<const char*>

[Bug libstdc++/11281] C++ support on alpha is no more

[Bug libstdc++/11313] [3.3 only] #pragma weak and static inline functions

[Bug libstdc++/11337] GCC Bootstraping STOP on "/libstdc++-v3/"

[Bug libstdc++/11346] Regressions from 3.3.0

[Bug libstdc++/11352] crash while internal padding numeric 0

[Bug libstdc++/11365] initializer problem in stl_threads.h

[Bug libstdc++/11378] Unbuffered sputn is slow

[Bug libstdc++/11389] New: Unbuffered wfilebuf fails to read single-byte UTF-8 characters.

[Bug libstdc++/11389] Unbuffered wfilebuf fails to read single-byte UTF-8 characters.

[Bug libstdc++/11400] New: std::search_n() makes assumptions about Size parameter

[Bug libstdc++/11400] std::search_n() makes assumptions about Size parameter

[Bug libstdc++/11409] 26_numerics/fabs_inline.cc failure

[Bug libstdc++/11409] New: 26_numerics/fabs_inline.cc failure

[Bug libstdc++/11425] New: sys/param.h contains macro defines in lowercase (isset setbit clrbit isclr howmany roundup powerof2)

[Bug libstdc++/11425] sys/param.h contains macro defines in lowercase (isset setbit clrbit isclr howmany roundup powerof2)

[Bug libstdc++/11436] ios::app bug on RedHat 7.3 with gcc 3.3

[Bug libstdc++/11450] [3.4 Regression] fpos problems

[Bug libstdc++/11450] fpos problems

[Bug libstdc++/11450] New: fpos problems

[Bug libstdc++/11460] Incorrect use of int_type in strstreambuf::pbackfail

[Bug libstdc++/11460] New: Incorrect use of int_type in strstreambuf::pbackfail

[Bug libstdc++/11472] [3.4 regression] abs not found if <iostream> is included

[Bug libstdc++/11472] New: [3.4 regression] abs not found if <iostream> is included

[Bug libstdc++/11480] New: std::unique calls predicate too many times

[Bug libstdc++/11480] std::unique calls predicate too many times

[Bug libstdc++/11504] -Wcast-qual vs. stl_tree

[Bug libstdc++/11504] New: -Wcast-qual vs. stl_tree

[Bug libstdc++/11528] money_get does not get "$.00"

[Bug libstdc++/11543] basic_filebuf with custom state_type fails to compile

[Bug libstdc++/11543] New: basic_filebuf with custom state_type fails to compile

[Bug libstdc++/11544] New: wifstream conversion errors result in wrong rdstate()

[Bug libstdc++/11544] wifstream conversion errors result in wrong rdstate()

[Bug libstdc++/11550] Support for Locales and Facets Appears to be Missing or Unsupported

[Bug libstdc++/11583] Cannot reopen file using ifstream

[Bug libstdc++/11584] ios::iword() fails to zero-initialize storage on failure

[Bug libstdc++/11584] New: ios::iword() fails to zero-initialize storage on failure

[Bug libstdc++/11602] codecvt<wchar_t, char, mbstate_t> is slow.

[Bug libstdc++/11602] New: codecvt<wchar_t, char, mbstate_t> is slow.

[Bug libstdc++/11603] Bad interaction between showmanyc and underflow on corrupt files.

[Bug libstdc++/11603] New: Bad interaction between showmanyc and underflow on corrupt files.

[Bug libstdc++/11610] New: testcase 27_io/filebuf_members.cc Assertion `fb_01.is_open()' failed

[Bug libstdc++/11612] abi_check not finding correct libgcc_s.so.1

[Bug libstdc++/11612] New: abi_check not finding correct libgcc_s.so.1

[Bug libstdc++/11619] Improper warning when calling string::begin() on const string

[Bug libstdc++/11619] New: Improper warning when calling string::begin() on const string

[Bug libstdc++/11626] abi_check fails to compile during make bootstrap

[Bug libstdc++/11626] New: abi_check fails to compile during make bootstrap

[Bug libstdc++/11638] [3.3.1 prerelease] std::vector assign problem with null pointer constant

[Bug libstdc++/11638] New: [3.3.1 prerelease] std::vector assign problem with null pointer constant

[Bug libstdc++/11653] [3.4 Regression] can no longer include iostream

[Bug libstdc++/11653] New: [3.4 Regression] can no longer include iostream

[Bug libstdc++/11691] New: stdio_filebuf leaks FILE buffer when "no close" is requested

[Bug libstdc++/11691] stdio_filebuf leaks FILE buffer when "no close" is requested

[Bug libstdc++/11692] New: vector<A::X<T> > operator== does not find operator== of A::X

[Bug libstdc++/11692] vector<A::X<T> > operator== does not find operator== of A::X

[Bug libstdc++/11696] building basic C++ application fails with -fmudflap

[Bug libstdc++/11696] New: building basic C++ application fails with -fmudflap

[Bug libstdc++/11705] Bad interaction between cin and wcin after sync_with_stdio(false)

[Bug libstdc++/11705] New: Bad interaction between cin and wcin after sync_with_stdio(false)

[Bug libstdc++/11706] New: std::pow(T, int) implementation pessimizes code

[Bug libstdc++/11706] std::pow(T, int) implementation pessimizes code

[Bug libstdc++/11722] New: Unbuffered filebuf::sgetn is slow

[Bug libstdc++/11722] Unbuffered filebuf::sgetn is slow

[Bug libstdc++/11723] ctype<wchar_t>::do_is(mask, wchar_t) is slow

[Bug libstdc++/11723] New: ctype<wchar_t>::do_is(mask, wchar_t) is slow

[Bug libstdc++/11729] no operator!= for const_reverse_iterator

[Bug libstdc++/11740] ctype<wchar_t>::do_is(mask, wchar_t) doesn't handle multiple bits in mask.

[Bug libstdc++/11740] New: ctype<wchar_t>::do_is(mask, wchar_t) doesn't handle multiple bits in mask.

[Bug libstdc++/5291] Bad reference to build directory in libstdc++.la

[Bug libstdc++/6020] [hpux 11.00] _FILE_OFFSET_BITS token error

[Bug libstdc++/6257] C-library symbols enter global namespace

[Bug libstdc++/8295] problem with method name log2

[Bug libstdc++/8307] libstdc++ fails to compile because of fixincludes headers

[Bug libstdc++/9076] Call Frame Instructions are not handled correctly during unwind operation..

[Bug libstdc++/9370] Bad exception handling in formatted I/O functions

[Bug libstdc++/9396] [3.4 regression] ambiguities with abs()

[Bug libstdc++/9590] [Cygwin] ifstream (inherited?) destructor overwrites memory causing segfault

[Bug libstdc++/9635] time_get<>::date_order unimplemented

[Bug libstdc++/9815] atomicity.h - fails to compile with -O3 -masm=intel

[Bug libstdc++/9828] [3.4 Regression] Segmentation fault in num_put::put

[Bug middle-end/10003] gcc -g mis-places low_pc of inlined functions

[Bug middle-end/10060] ICE (stack overflow) on huge file (300k lines) due to recursive behaviour of copy_rtx_if_shared, in emit_rtl.c

[Bug middle-end/10540] [3.3 regression] mips-sgi-irix6.5 testsuite failure in gcc.c-torture/execute/20020227-1.c with checking enabled

[Bug middle-end/10776] [3.3/3.4 regression] Large aggregate initializers with a single relocated entry causes excessive compile time regression

[Bug middle-end/10795] [3.4 regression] ICE in extract_insn, at recog.c:2188

[Bug middle-end/11042] /usr/include/g++/stl_uninitialized.h:71: Internal compiler error in `emit_move_insn_1', at expr.c:2831 while trying to compile aspell-.33.7.1 with openbsd 3.3 on sparc64

[Bug middle-end/11135] It ought to be possible to make PIC_OFFSET_TABLE_REGNUM a pseudo

[Bug middle-end/11185] [tree-ssa] ICE with "Vars Conflict across an abnormal edge"

[Bug middle-end/11264] LROTATE_EXPR/RROTATE_EXPR misexpanded by middle-end/back-end for bitfields

[Bug middle-end/11313] [3.3 only] #pragma weak and static inline functions

[Bug middle-end/11414] [3.4 Regression] Segementation fault compiling csets.adb

[Bug middle-end/11414] [Regression 3.4] Segementation fault compiling csets.adb

[Bug middle-end/11414] New: [Regression 3.4] Segementation fault compiling csets.adb

[Bug middle-end/11491] Problem with optimized inline caller of alloca()

[Bug middle-end/11492] Unsigned char promoted to signed int in for loop test for gpp but not gcc

[Bug middle-end/11498] [3.3/3.4 Regression] asm can't be used to give a variable its own name

[Bug middle-end/11498] asm can't be used to give a variable its own name

[Bug middle-end/11498] New: asm can't be used to give a variable its own name

[Bug middle-end/11514] [tree-ssa] ICE on bootstrap with ada in sem_util.adb --- walk_tree does not know about PLACEHOLDER_EXPR

[Bug middle-end/11514] [tree-ssa] ICE on bootstrap with ada in sem_util.c --- walk_tree does not know about PLACEHOLDER_EXPR

[Bug middle-end/11545] [3.4 regression] Segmentation fault whem marking cgraph_node in unit-at-a-time mode

[Bug middle-end/11545] [3.4 regression] Segmentation fault when marking cgraph_node in unit-at-a-time mode

[Bug middle-end/11545] New: [mainline regression] Segmentation fault whem marking cgraph_node in unit-at-a-time mode

[Bug middle-end/11700] [3.3/3.4 regression] [M68K] ICE in subreg_hard_regno

[Bug middle-end/11700] New: [3.3/3.4 regression] [M68K] ICE in subreg_hard_regno

[Bug middle-end/6578] -ftrapv doesn't catch multiplication overflow

[Bug middle-end/8306] [3.3/3.4 regression] ICE for bitfield7_y.C in C++ compatibility tests

[Bug middle-end/9636] [3.4 regression] ICE when building newlib for v850-elf

[Bug middle-end/9997] Coelesce stack slots for disjoint scopes.

[Bug objc/10925] make -k check returns non zero

[Bug objc/11649] New: symlinks do not work with #import

[Bug objc/11650] Hardlinks not work with #import

[Bug objc/11650] New: Hardlinks not work with #import

[Bug objc/11661] [objc-improvements-branch] function pointers as ivars

[Bug objc/11661] [objc-improvements-branch] ICE on function pointers as ivars

[Bug objc/11661] New: [objc-improvements-branch] function pointers as ivars

[Bug objc/11754] [objc-improvements-branch] receiver is evaluated twice when passing messages with the gnu runtime

[Bug objc/11754] New: [objc-improvements-branch] receiver is evaluated twice when passing messages with the gnu runtime

[Bug objc/7993] [3.3/3.4 regression] private variables cannot be shadowed in subclasses

[Bug optimization/10080] [3.4 Regression] Loop unroller nearly useless

[Bug optimization/10155] [3.4 regression] gcc uses excessive amount of memory with -funit-at-a-time

[Bug optimization/10160] [3.3/3.4 regression] compile time regression; inordinate time spent in "scheduling"

[Bug optimization/10221] gcc -O9 will introduce wrong asembler?

[Bug optimization/10312] [3.4 regression] [sparc] optimizer creates wrong code for loop

[Bug optimization/10339] [3.2/3.3/3.4 regression] [sparc,ppc,ppc64] Invalid optimization: replacing strncmp by memcmp

[Bug optimization/10392] [3.3/3.4 regression] [SH] optimizer generates faulty array indexing

[Bug optimization/10463] -fssa-ccp ICE

[Bug optimization/10469] [3.3, 3.4] constant V4SF loads get moved inside loop

[Bug optimization/1046] gcc less efficient than jdk for recursion!

[Bug optimization/10482] Optimized and debug binaries of same application give different results.

[Bug optimization/10494] [3.4 regression] optimization based on SSA "-O2 -fssa" removes needed code

[Bug optimization/10519] optimization based on SSA "-O2 -fssa" uses wrong register

[Bug optimization/10536] [3.4 regression] Linux kernel miscompiled on s390

[Bug optimization/10644] float calculation exceeds representation max, only when optimizer is turned on

[Bug optimization/10679] [3.3/3.4] --param min-inline-insns not honoured

[Bug optimization/10817] gcc does not optimize result=0;if(t!=0)result=t; to result=t;

[Bug optimization/10823] [3.3/3.4 regression] wrong code after first cse pass

[Bug optimization/10876] [3.3/3.4 regression] [Sparc] ICE in calculate_giv_inc at unroll.c:1588 on FP code

[Bug optimization/10876] [3.3/3.4 regression] Segfault when compiling KDE 3.1.2

[Bug optimization/10877] [3.3/3.4 regression] documentation for a newer binutils: miscompilation with -O3 -fPIC on x86

[Bug optimization/10914] unswitch loops does not work on powerpc

[Bug optimization/11001] ICE in spill_failure, at reload1.c:1915: unable to find a register in class `DIREG'

[Bug optimization/11059] [3.3 regression] empty union optimization ice

[Bug optimization/11059] [3.3/3.4 regression] empty union optimization ice

[Bug optimization/11083] [3.3 regression] ICE in commit_one_edge_insertion, at cfgrtl.c:1438 with -O2 -fnon-call-exceptions

[Bug optimization/11121] [3.4 regression] [unit-at-a-time] function prototypes, function pointers and -O3

[Bug optimization/11180] [avr-gcc] Optimization decrease performance of struct assignment.

[Bug optimization/11180] New: [avr-gcc] Optimization decrease performance of struct assignment.

[Bug optimization/11181] [3.3 only][avr-gcc] Optimization of "uchar/xor/and/single_bit" produced wrong code.

[Bug optimization/11181] [avr-gcc] Optimization of "uchar/xor/and/single_bit" produced wrong code.

[Bug optimization/11198] [3.3 regression] -O2 -frename-registers generates wrong code

[Bug optimization/11202] [3.4 regression] incorrectly ordered rtl after emit_libcall_block

[Bug optimization/11210] optimizer drops conditional with typecast from signed to unsigned char

[Bug optimization/11222] arm/thumb __Unwind_SjLj_Register prologue optimization causes crash on interrupts

[Bug optimization/11245] [3.4 Regression] __asm__ use generates bad code with current CVS gcc

[Bug optimization/11259] [avr] gcc Double 'andi' missed optimization

[Bug optimization/11263] [SPARC] wrong code with -O2 -fnew-ra : undefined content of output register o3 was used

[Bug optimization/11269] [tree-ssa] wrong-code

[Bug optimization/11304] [3.3 Regression] Wrong code production with -fomit-frame-pointer

[Bug optimization/11319] [3.3/3.4 regression] loop miscompiled on ppc32

[Bug optimization/11320] [3.3 regression] [ia64] Reload bug

[Bug optimization/11320] [3.3 regression] Scheduler bug

[Bug optimization/11350] [3.3/3.4 regression] undefined labels with -Os -fPIC

[Bug optimization/11366] [3.3 regression] miscompiles XDM-AUTHORIZATION-1 key generation and/or validation in XFree86 at -O2

[Bug optimization/11368] -falign-* has no effect on i386

[Bug optimization/11372] [3.4 regression] verify_flow_info: Wrong frequency of block at -O3

[Bug optimization/11373] [tree-ssa] asm generated lhs expressions are discarded

[Bug optimization/11379] ICE with optimization option -fnew-ra

[Bug optimization/11381] [3.3/3.4 regression] volatile memory access optimized away

[Bug optimization/11386] GNU Emacs 21.3 failed to install using GCC 3.3, but GCC 3.2.3 works.

[Bug optimization/11394] New: optimization leads to broken double comparison

[Bug optimization/11394] optimization leads to broken double comparison

[Bug optimization/11403] [3.4 regression] ICE in cgraph_remove_edge with -O3 (unit-at-a-time problem)

[Bug optimization/11403] ICE in cgraph_remove_edge, at cgraph.c:182 when compiling with -O3

[Bug optimization/11403] New: ICE in cgraph_remove_edge, at cgraph.c:182 when compiling with -O3

[Bug optimization/11421] [3.4 regression] vtables are not emitted in unit-at-a-time mode

[Bug optimization/11421] New: [3.4 regression] vtables are not emitted in unit-at-a-time mode

[Bug optimization/11438] New: optmization bug with -fPIC

[Bug optimization/11438] optmization bug with -fPIC

[Bug optimization/11440] [3.3 regression] gcc-3.3.1 miscompiles c++ code with -O2, -fno-gcse cures it

[Bug optimization/11440] gcc-3.3.1 miscompiles c++ code with -O2, -fno-gcse cures it

[Bug optimization/11440] New: gcc-3.3.1 miscompiles c++ code with -O2, -fno-gcse cures it

[Bug optimization/11457] New:

[Bug optimization/11477] New: writing 0 to memory-location leads to incorrect optimization

[Bug optimization/11483] ICE in invert_truthvalue, at fold-const.c:2359

[Bug optimization/11483] New: ICE in invert_truthvalue, at fold-const.c:2359

[Bug optimization/11488] New: Scheduling severely worsens performance

[Bug optimization/11488] Pre-regalloc Scheduling severely worsens performance

[Bug optimization/11488] Pre-regalloc scheduling severely worsens performance

[Bug optimization/11488] Scheduling severely worsens performance

[Bug optimization/11496] [3.3 Regression] error in flow_loops_find when -funroll-loops active

[Bug optimization/11505] New: Runtime segfault: C++ heap-allocated object loses/changes 'this' address at -O3 when calling virtual inline const function

[Bug optimization/11505] Runtime segfault: C++ heap-allocated object loses/changes 'this' address at -O3 when calling virtual inline const function

[Bug optimization/11523] Intermodule Optimisation handles duplicate names wrong

[Bug optimization/11523] New: Intermodule Optimisation handles duplicate names wrong

[Bug optimization/11536] [3.3/3.4 Regression] [strength-reduce] -O2 optimalization produces wrong code

[Bug optimization/11555] [3.4 Regression] ICE in verify_loop_structure, at cfgloop.c:1270

[Bug optimization/11557] [3.3 regression] constant folding

[Bug optimization/11557] New: [3.3 regression] constant folding

[Bug optimization/11559] [hammer-3.3 regression] Infinite loop while compiling kernel with VRP

[Bug optimization/11559] New: [hammer-3.3 regression] Infinite loop while compiling kernel with VRP

[Bug optimization/11587] SH ICE in reload_cse_simplify_operand, postreload.c

[Bug optimization/11592] [3.3 Regression] gcc.dg/duff-2.c fails with "warning: unreachable code at beginning of switch statement"

[Bug optimization/11592] gcc.dg/duff-2.c fails with "warning: unreachable code at beginning of switch statement"

[Bug optimization/11592] New: "make check-gcc" fails on gcc.dg/duff-2.c with "warning: unreachable code at beginning of switch statement"

[Bug optimization/11599] gcc generates wrong code when builtins are used

[Bug optimization/11599] gcc generates wrong code when predicate are used

[Bug optimization/11599] gcc generates wrong code when predicate is used

[Bug optimization/11601] New: if-conversion2 gets rid of branch and return when used with builtins

[Bug optimization/11604] Internal compiler error in subst_stack_regs_pat, at reg-stack.c:1441 (using -march=pentium4)

[Bug optimization/11604] Internal compiler error in subst_stack_regs_pat, at reg-stack.c:1441 (using -march=pentium4)

[Bug optimization/11604] New: Internal compiler error in subst_stack_regs_pat, at reg-stack.c:1441 (using -march=pentium4)

[Bug optimization/11627] internal compiler error: in push_reload, at reload.c:1282

[Bug optimization/11631] [3.3-hammer regression] zsh miscompilation

[Bug optimization/11631] [3.3-hammer regression] zsh/kernel miscompilation

Re: [Bug optimization/11631] [3.3-hammer regression] zsh/kernelmiscompilation

[Bug optimization/11631] [3.4/3.3-hammer regression] zsh/kernel miscompilation

[Bug optimization/11631] New: [3.3-hammer regression] zsh/kernel miscompilation

[Bug optimization/11635] [3.3/3.4 regression] Unnecessary store onto stack

[Bug optimization/11635] New: [3.3/3.4 regression] Unnecessary store onto stack

[Bug optimization/11646] [3.3 regression] ICE with -fnon-call-exceptions -fgcse -O

[Bug optimization/11646] [3.3/3.4 regression] ICE in commit_one_edge_insertion with -fnon-call-exceptions -fgcse -O

[Bug optimization/11646] New: [3.3 regression] ICE with -fnon-call-exceptions -fgcse -O

[Bug optimization/11655] [3.3 regression] long long/double -O0 produces incorrect code

[Bug optimization/11655] New: [3.3 regression] long long/double -O0 produces incorrect code

[Bug optimization/11662] [3.3 only][SPARC] -O1: wrong code for expr. with cast to long long and exclusive or

[Bug optimization/11662] [3.3 regression][SPARC] -O1: wrong code for expr. with cast to long long and exclusive or

[Bug optimization/11662] [SPARC] -O1: wrong code for expr. with cast to long long and exclusive or

[Bug optimization/11662] New: [SPARC] -O1: wrong code for expr. with cast to long long and exclusive or

[Bug optimization/11680] member access of C++ class with all methods inline should be optimized better

[Bug optimization/11683] New: SH Optimizer creates incorrect code

[Bug optimization/11683] SH Optimizer creates incorrect code

[Bug optimization/11687] [3.3 only] xstormy16-elf build fails in libf2c

[Bug optimization/11687] xstormy16-elf build fails in libf2c

[Bug optimization/11700] [3.3/3.4 regression] [M68K] ICE in subreg_hard_regno

[Bug optimization/11707] [3.4 Regression] [new unroller] constants not propagated in unrolled loop iterations with a conditional

[Bug optimization/11707] constants not propagated in unrolled loop iterations with a conditional

[Bug optimization/11707] New: constants not propagated in unrolled loop iterations with a conditional

[Bug optimization/11708] [sh4-elf-gcc] Non-Optimal jump code generation.

[Bug optimization/11708] New: Non-Optimal jump code generation.

[Bug optimization/11708] Non-Optimal jump code generation.

[Bug optimization/11710] loop optimizer cannot figure out # iterations for shift and / * "increments"

[Bug optimization/11710] New: loop optimizer cannot figure out # iterations for shift and / * "increments"

[Bug optimization/11741] internal compiler error at gcse.c:5318

[Bug optimization/11753] %o7 register being used immediately in the delay slot before a call with -O2

[Bug optimization/11753] New: %o7 register being used immediately in the delay slot before a call with -O2

[Bug optimization/1532] -O3 generates (obviously) redundant tests and jumps

[Bug optimization/1823] -ftrapv aborts with pointer difference due to division optimization

[Bug optimization/2692] excessive compile time with optimization

[Bug optimization/2806] if's are not combined together

[Bug optimization/3041] [3.3/3.4 regression] Stepanov Abstraction Penalty regression for powerpc-ibm-aix

[Bug optimization/323] optimized code gives strange floating point results

[Bug optimization/3329] optimization large memory copies uses kernel memcpy function without user's knowledge.

[Bug optimization/3713] Pointers to functions or member functions are not folded or inlined

[Bug optimization/4251] Bug in optimization of floating-point code

[Bug optimization/4490] ICE with -m128bit-long-double

[Bug optimization/5738] GCSE missed optimization

[Bug optimization/6585] Reduntant store/load instruction pairs on ix86

[Bug optimization/6585] useless memory store instructions on x86

[Bug optimization/6824] Wrong optimized fp code

[Bug optimization/6860] [3.3/3.4 regression] [arm-thumb] ICE in pre_insert_copy_insn

[Bug optimization/6883] Fails to optimize temporary objects.

[Bug optimization/705] Performance regression with glibc's strcpy macro

[Bug optimization/7270] Redundant compares not eliminated on x86.

[Bug optimization/7563] g77 3.1.1 internal error: Segmentation Fault at -O2 -funroll-loops -m64

[Bug optimization/7857] Different behaviour if compiled with optimization due to sqrt being inlined

[Bug optimization/8092] [3.3/3.4 regression] cross-jump triggers too often

[Bug optimization/8126] [3.3/3.4 regression] Floating point computation far slower in 3.2 than in 2.95

[Bug optimization/8178] [3.4 regression] __builtin_ffs broken with -march=k6

[Bug optimization/8361] [3.3/3.4 regression] C++ compile-time performance regression

[Bug optimization/8530] toplev.c: Close of _DFI lreg dump file guarded with different condition than open

[Bug optimization/8681] Generates unneeded test

[Bug optimization/8776] loop invariants are not removed (most likely)

[Bug optimization/8878] [3.3 only] miscompilation with -O and SSE

[Bug optimization/9059] unused arrays not optimized away

[Bug optimization/9079] Inline constant function pointers

[Bug optimization/9196] [3.4 regression] Inlining of function with void * arithmetic is misoptimized

[Bug optimization/9357] [3.3 regression] SegFault with -fssa -funroll-loops -fprofile-arcs

[Bug optimization/9412] [3.4 regression] incorrect code with -O2 flag, but not -O

[Bug optimization/9435] [Sparc] internal compiler error: in simplify_gen_subreg, at simplify-rtx.c

[Bug optimization/9540] C99 initializers generate lots of code

[Bug optimization/9566] Inline function produces much worse code than manual inlining.

[Bug optimization/9567] Using struct fields produces worse code than stand-alone vars.

[Bug optimization/9624] Stack space allocation too gratuitious

[Bug optimization/9735] [IA-64] GCC doesn't honor trapping math when doing final schedule

[Bug optimization/9745] [3.3/3.4 regression][powerpc] miscompiles libmcrypt (alias problem during loop)

[Bug optimization/9767] explicit instantiation of class members unoptimized?

[Bug optimization/9786] [3.3/3.4 regression] Ice in fixup_abnormal_edges with -fnon-call-exceptions -O2

[Bug optimization/9812] [3.3/3.4 regression] [m68k] ICE in extract_insn, at recog.c:2148

[Bug optimization/9859] excessive memory consumption on GTK file

[Bug optimization/9900] [3.4 Regression] [new-ra] -O2 and ICE in verify_flow_info

[Bug other/10109] documentation of target macro LIBCALL_VALUE

[Bug other/10417] Inconsistent results in floating point comparison.

[Bug other/10584] [3.4 regression] ICE in copy_insn_list with __inline__ and -finstrument-functions

[Bug other/10799] [powerpc-eabi] Constructors of static classes are not called

[Bug other/10819] testsuite creates CR+LF on compiler version lines in test summary files

[Bug other/10879] don't know

[Bug other/10925] make -k check returns non zero

[Bug other/11123] Some option names are truncated in gcc --help -v

[Bug other/11146] [3.3 regression] Bad characters in cpp.1, gcc.1 man pages

[Bug other/11375] rtl_dump_file problems in rest_of_compilation

[Bug other/11411] New: libffi testing problems

[Bug other/11412] New: boehm-gc testing problems

[Bug other/11422] Locale for Uzbekistan

[Bug other/11422] New: Locale for Uzbekistan

[Bug other/11465] "make install" fails on Solaris 2.8

[Bug other/11465] New: "make install" fails on Solaris 2.8

[Bug other/11466] '-mlittle-endian' doesn't work with GCC3.2.3 under Solaris 2.x

[Bug other/11484] GNU AS bug

[Bug other/11484] New: GNU AS bug

[Bug other/11489] [3.4 Regression] ICE/segfault on legal code

[Bug other/11571] New: objdir/intl not cleaned up by 'make distclean'

[Bug other/11571] objdir/intl not cleaned up by 'make distclean'

[Bug other/11615] make install crashes on libtool install of files in libffi and libjava

[Bug other/11615] New: make install crashes on libtool install of files in libffi and libjava

[Bug other/11651] gcov aborts if empty .da files (patch attached)

[Bug other/11651] New: gcov aborts if empty .da files (patch attached)

[Bug other/11669] [3.4 regression] Calling of static functions does not work (build of glibc broken)

[Bug other/11669] New: [3.4 regression] Calling of static functions does not work (build of glibc broken)

[Bug other/11673] libmudflap does not compile on freebsd

[Bug other/11673] libmudflap does not compile on other than *-*-linux-gnu

[Bug other/11673] New: libmudflap does not compile

[Bug other/1963] collect2 interprets "-oldstyle_liblookup" as "-o ldstyle_liblookup"

[Bug other/1] Test of new GCC GNATS db.

[Bug other/2873] [3.3 only][fixinclude] Bogus fixinclude of stdio.h from glibc 2.2.3

[Bug other/3386] [3.3/3.4 Regression] Undocumented target macros in 3.0

[Bug other/3415] [sparc] symlink libgcc_s_sparcv9.so not cleaned up

[Bug other/3985] AIX -mcpu=630 -maix64 does not use ppc64 multilib

[Bug other/5267] invoke.texi "RS/6000 and PowerPC Options" list needs cleanup

[Bug other/5301] Cross-compiler docs problems

[Bug other/5390] [3.3 only?] Libiberty fails to demangle multi-digit template parameters.

[Bug other/5762] collect2 passes o_file too soon if -soname option is passed early.

[Bug other/6737] feature request: stack realignment attribute

[Bug other/704] --help and --version

[Bug other/7088] host-x-host builds install broken limits.h

[Bug other/7671] RH7.3 gnu ld (version 2.11.93.0.2 20020207) problem w/ gnu.linkonce.*

[Bug other/7771] Build on AIX fails

[Bug other/8540] libgcc: execute_cfa_program() doesn`t handle 2 DWARF instructions properly

[Bug other/864] --program-suffix is ignored (for ada)

[Bug other/8897] Demangling of template conversion operators

[Bug other/9219] [SunOS 5.5] gcc-3.2.1/binutils-2.13.1 problem with perl-5.8.0

[Bug other/9326] [sparc-solaris]fixincludes generates wrong sys/types.h under Solaris

[Bug other/951] Documentation of compiler passes and sources very out of date

[Bug pch/10591] Members of anonymous namespaces get name mangled with header name

[Bug pch/10935] PCH causing ICE during building of libstc++-v3

[Bug pch/11324] unimplemented, had to relocate pch

[Bug pch/11654] gcc seg fault when using pre-compiled headers and -gstabs

[Bug pch/9391] when trying to compile header files, gcc emits an error, then compiles everything, and only then bails out

[Bug preprocessor/10532] include-path broken for cross-gccs (PREFIX_INCLUDE_DIR)

[Bug preprocessor/10743] Build error for CPP when building Cross compiler and host and target have diff character sets (i370)

[Bug preprocessor/11166] Incorrect dependencies file under es_ES

[Bug preprocessor/11361] [3.4 regression] ICE (segfault) in c-lex.c with one-liner

[Bug preprocessor/11402] behavior of -I option, for default search locations, is potentially problematic

[Bug preprocessor/11402] New: behavior of -I option, for default search locations, is potentially problematic

[Bug preprocessor/11439] CPP insists on UTF-8 input files

[Bug preprocessor/11439] New: CPP insists on UTF-8 input files

[Bug preprocessor/11534] New: preprocessor warns about defined without -pedantic

[Bug preprocessor/11534] preprocessor warns about defined without -pedantic

[Bug preprocessor/11569] there's no substitute for #pragma once

[Bug preprocessor/11649] Links do not work with #import

[Bug preprocessor/11649] symlinks do not work with #import

[Bug preprocessor/3744] Wide string literals not interpreted according to locale

[Bug target/10021] [3.3/3.4 regression] [m68k] alias problem during loop pass

[Bug target/10058] [darwin] gcc-3.2.2 crashes while building a cross compiler

[Bug target/10129] Ada bootstrap fails on PPC-Darwin - invalid assembler emitted - PIC related

[Bug target/10135] Uncaught exceptions with --disable-sjlj-exceptions configured GCC

[Bug target/10190] [IRIX] building gcc 3.2.2 on irix 5.3 fails

[Bug target/10236] [SH] Failure in gcc/testsuite/gcc.c-torture/execute/va-arg-10.c

[Bug target/10331] [x86 -> SH] can't compile c++ crosscompiler part of gcc crosscompiler for sh-elf

[Bug target/10344] [cygwin] Internal compiler error on large struct

[Bug target/10348] [Sparc] testsuite failure in execute/20020720-1.c with -mcpu=v9 -fpic/-fPIC

[Bug target/10365] [sparc] bug in code generator

[Bug target/10383] sparc-sun-solaris2.7 G++ testsuite failures in g++.dg/eh/simd-1.C & g++.dg/eh/simd-2.C

[Bug target/10397] powerpc64 aggregate pass by value

[Bug target/10413] [3.3 Regression] SH ICE 3.3 branch

[Bug target/10467] [arm] [3.3/3.4 regression] ICE in pre_insert_copy_insn,

[Bug target/10467] [arm] ICE in pre_insert_copy_insn,

[Bug target/10504] [3.3] ICE with SSE2 code and -O3 -mcpu=pentium4 -msse2

[Bug target/10589] For Hitachi SH target, GCC craches when both -fomit-frame-pointer and -mdalign options are specified

[Bug target/10595] [ia64] use of register variables creates stop bits

[Bug target/10673] [3.3] ICE for x86-64 on freebsd libc vfprintf.c source

[Bug target/10681] [3.3 regression] [IA64] ICE in ia64_expand_epilogue

[Bug target/10692] [3.3/3.4 regression] [m68k] miscompilation of perl with -O2 -fPIC

[Bug target/10700] [3.3/3.4 regression] ICE in copy_to_mode_reg on 64-bit targets

[Bug target/10730] [3.3 regression] [arm] -O2 generates invalid asm

[Bug target/10795] [3.4 regression] ICE in extract_insn, at recog.c:2188

[Bug target/10865] [ia64] gcc -pthread does not add -D_REENTRANT

[Bug target/10900] [darwin] trampolines crash

[Bug target/10900] [mac os x] trampolines crash

[Bug target/10901] [ppc-darwin] non-local goto's (still) don't work

[Bug target/10907] [IA64] gcc violates the ia64 ABI

[Bug target/10913] [3.3 regression] mips-elf ICE in text_section at varasm.c: 241

[Bug target/10922] [Darwin] Internal error: Illegal instruction (program cc1plus)

[Bug target/10979] [3.4 regression] ICE in subst_stack_regs_pat with -O -ffast-math and atan2

[Bug target/10984] x86/sse2 ICEs on vector intrinsics with constant argument

[Bug target/11008] improper multiply optimization for pentium4

[Bug target/11012] [m32r-elf] wrong code with -O at branch of conditional

[Bug target/11015] [PPC] -finstrument-functions and variable size with sizes > 17 and -fPIC

[Bug target/11044] [3.3 regression] [x86] out of range loop instructions for FP code on K6

[Bug target/11057] ice in extract_constrain_insn_cached with -fcall-saved-mm0

[Bug target/11087] gcc miscompiles raid1.c from linux kernel

[Bug target/11096] i686-linux to sh-linux cross compiler fails to compile C++ files

[Bug target/11144] g++.dg/eh/simd-2.C fails on x86

[Bug target/11184] [3.3/3.4 regression] [ia64 hpux] ICE on __builtin_apply building libobjc

[Bug target/11194] [3.3.1 regression] ICE in simplify_gen_subreg, at simplify-rtx.c

[Bug target/11226] [3.3/3.4 regression] [ia64] ICE passing struct arg with two floats

[Bug target/11229] pure-1.c fails on powerpc64-linux with -O1

[Bug target/11271] [3.3.1/3.4 regression] [arm-elf] regex.c ICEs for thumb multilib

[Bug target/11271] [3.4 regression] [arm-elf] regex.c ICEs for thumb multilib

[Bug target/11292] [3.4 Regression] -fnew-ra causes sibcalling to go wrong.

[Bug target/11303] [3.3/3.4 regression] ICE in stor-layout.c:304 in int_mode_for_mode

[Bug target/11322] SH profiler outputs multiple definitions of symbol

[Bug target/11331] [Regression 3.4] ld: BFD 2.14.90 20030602 internal error

[Bug target/11358] complex-6.c:40: internal compiler error: in subreg_hard_regno, at emit-rtl.c:1087

[Bug target/11398] libffi doesn't support 128-bit long double on Tru64 UNIX V5

[Bug target/11398] New: libffi doesn't support 128-bit long double on Tru64 UNIX V5

[Bug target/11399] [3.3 regression] gcc miscompiles an if - else if - else statement with -O2 on ia64

[Bug target/11410] ffitest failures on Solaris 8/SPARC

[Bug target/11410] New: ffitest failures on Solaris 8/SPARC

[Bug target/11413] -ffixed registers on powerpc optimized incorrectly

[Bug target/11419] libstdc++ basic_file.cc compile fails with ioctl redeclaration

[Bug target/11419] New: libstdc++ basic_file.cc compile fails with ioctl redeclaration

[Bug target/11420] [3.3/3.4 regression][x86_64] gcc generates invalid asm code when "-O -fPIC" is used (suffix or operands invalid for `movabs')

[Bug target/11442] [3.3 regression] [arm] invalid assembler on arm

[Bug target/11442] New: [3.3 regression] [arm] invalid assembler on arm

[Bug target/11451] [m32r-elf] wrong code with -O at cmp_ne_small_const_insns

[Bug target/11453] gcc > 3.3 ICE

[Bug target/11457] [3.3/3.4 Regression] redundant compare

[Bug target/11475] [SPARC] -O1: internal compiler error: in find_reloads, at reload.c:3629

[Bug target/11476] gcc ICE on newlib's vfprintf.c

[Bug target/11476] New: gcc ICE on newlib's vfprintf.c

[Bug target/11516] [3.4 regression] miscompiled of genattrtab.c

[Bug target/11516] [3.4 regression] miscompiled of genattrtab.c in stage2

[Bug target/11519] When Building m68hc11: Internal compiler error: in print_operand_address

[Bug target/11520] code generator bug for avr mega8

[Bug target/11535] __builtin_return_address may not work on ia64

[Bug target/11535] New: __builtin_return_address may not work on ia64

[Bug target/11538] New: when trying to execute make (when installing gcc), I failed because of Segmentation fault in gzio.c

[Bug target/11538] when trying to execute make (when installing gcc), I failed because of Segmentation fault in gzio.c

[Bug target/11539] New: when trying to execute make (when installing gcc), I failed because of Segmentation fault in gzio.c

[Bug target/11539] when trying to execute make (when installing gcc), I failed because of Segmentation fault in gzio.c

[Bug target/11556] ICE in gen_reg_rtx() while compiling 2.6.x Linux kernel

[Bug target/11556] New: ICE in gen_reg_rtx() while compiling 2.6.x Linux kernel

[Bug target/11565] gcc.dg/i386-387-1.c test flawed due to assumptions made about arch

[Bug target/11565] New: gcc.dg/i386-387-1.c test flawed due to assumptions made about arch

[Bug target/11591] ICE in gcc.dg/altivec-5.c

[Bug target/11591] ICE in gcc.dg/altivec-5.c in 3.3 branch

[Bug target/11591] ICE in gcc.dg/altivec-5.c in 3.3 branch for non-Altivec powerpc

[Bug target/11591] New: ICE in gcc.dg/altivec-5.c in 3.3 branch for non-Altivec powerpc

[Bug target/11594] New: testcase gcc.dg/2020103-1.c faiils with "scan-assembler-not LC"

[Bug target/11594] testcase gcc.dg/2020103-1.c faiils with "scan-assembler-not LC"

[Bug target/11594] testcase gcc.dg/2020103-1.c fails with "scan-assembler-not LC"

[Bug target/11598] New: testcase gcc.dg/20020118-1.c fails runtime check of __attribute__((aligned(16)))

[Bug target/11598] testcase gcc.dg/20020118-1.c fails runtime check of __attribute__((aligned(16)))

[Bug target/11599] ia64: gcc generates wrong code when predicate is used

[Bug target/11599] New: ia64: gcc generates wrong code when predicate is used

[Bug target/11606] New: testcases gcc.dg/pack-test-1.c, gcc.dg/pack-test-2.c fail

[Bug target/11606] testcases gcc.dg/pack-test-1.c, gcc.dg/pack-test-2.c fail

[Bug target/11607] [3.3.1 regression] Segmentation fault in gen-protos in stage2

[Bug target/11609] New: testcase gcc.dg/cleanup-5.c fails to link, undefined reference to `__gcc_personality_sj0'

[Bug target/11609] testcase gcc.dg/cleanup-5.c fails to link, undefined reference to `__gcc_personality_sj0'

[Bug target/11628] movd support for _mm_cvtsi32_si64 and _mm_cvtsi64_si32

[Bug target/11634] [3.3/3.4 regression] [hppa] ICE in verify_local_live_at_start, at flow.c:555

[Bug target/11634] New: [3.3/3.4 regression] [hppa] ICE in verify_local_live_at_start, at flow.c:555

[Bug target/11637] [3.3/3.4 Regression]g++ invalid assembly with -fnon-call-exceptions

[Bug target/11641] [3.3 only] Arts 1.1.2 compilation error with gcc over IA64

[Bug target/11641] [3.3 regression] Arts 1.1.2 compilation error with gcc over IA64

[Bug target/11660] New: libffi only builds when java is selected as language

[Bug target/11674] [3.3/3.4 regression] ICE in emit_move_insn, at expr.c:3207

[Bug target/11674] [3.4/3.3-hammer regression] ICE in emit_move_insn, at expr.c:3207

[Bug target/11674] New: [3.4/3.3-hammer regression] ICE in emit_move_insn, at expr.c:3207

[Bug target/11687] xstormy16-elf build fails in libf2c

[Bug target/11689] g++3.3 emmits un-assembleable code for k6 architecture

[Bug target/11693] [3.1/3.2/3.3 regression] [ia64] ICE in gen_nop_type

[Bug target/11693] [3.1/3.2/3.3/3.4 regression] [ia64] ICE in gen_nop_type

[Bug target/11693] [3.3 regression] [ia64] ICE in gen_nop_type

[Bug target/11693] [ia64] ICE in gen_nop_type

[Bug target/11693] New: [ia64] ICE in gen_nop_type

[Bug target/11699] [3.4 Regression] internal compiler error, unrecognized instruction.

[Bug target/11699] internal compiler error, unrecognized instruction.

[Bug target/11699] New: internal compiler error, unrecognized instruction.

[Bug target/11709] [3.3 only] g77 does not work with new dev tools

[Bug target/11709] New: g77 does not work with new dev tools

[Bug target/11716] [mips] branch out of range when building fold-const.c

[Bug target/11716] New: [mips] branch out of range when building fold-const.c

[Bug target/11717] [3.3 regression] [alpha] unrecognizable insn compiling for.c of kernel 2.4.22-pre8

[Bug target/11717] New: [3.3 regression] [alpha] unrecognizable insn compiling for.c of kernel 2.4.22-pre8

[Bug target/11732] [3.3 regression] [alpha] ICE in extract_insn

[Bug target/11732] New: [3.3 regression] [alpha] ICE in extract_insn

[Bug target/11736] New: Stackpointer messed up on SuperH

[Bug target/11736] Stackpointer messed up on SuperH

[Bug target/11739] New: prefetch tests need to made smarter

[Bug target/11739] prefetch tests need to made smarter

[Bug target/4264] [sco3.2v5] native assembler errors for gcc output

[Bug target/4790] [sco3.2v5] LANG=C rejects-legal

[Bug target/5212] [Hurd] profiling support for i386-gnu specs file

[Bug target/5287] [3.3/3.4 regression] [mingw/cygwin] ICE with dllimport (two other testcases)

[Bug target/5362] Undocumented target options

[Bug target/5714] [ColdFire] Invalid use of dbra

[Bug target/5974] gcc 3.0.4 generates bad code to reference ((packed)) struct

[Bug target/6056] [ia-64] ICE on legal code with when optimizations higher that -O (ia64 only)

[Bug target/6191] [HP-PA] ICE doing pointer math with -fPIC

[Bug target/6221] mips-irix6 gcc-3.1 testsuite failure in gcc.c-torture/execute/20020227-1.c

[Bug target/6522] [3.3 regression] [x86] incorrect struct offset for unaligned 64-bit fields in debug information

[Bug target/7297] [irix6 o32] sjlj exceptions fail

[Bug target/7451] [IA64] Internal compiler error in output_206, at insn-output.c:289

[Bug target/7513] [ARM/Thumb] cross-compiler -mthumb -O2 trashes link register

[Bug target/7525] [ARM/Thumb] long calls stubs only in one code section, cannot branch to them from other section

[Bug target/7832] [Sparc -> PPC] libc not found when linking libgcc.so

[Bug target/7940] [3.3 regression] [Cygwin] Test gcc.dg/nest.c fails

[Bug target/8309] [3.3/3.4 regression][m68k] m68k-elf-gcc -m5200 produces erroneous SImode set of short varaible on stack

[Bug target/8336] [3.3 only] [SCO5] bootstrap config still tries to use COFF options

[Bug target/8407] [IA-64] ICE in simplify_gen_subreg, at simplify-rtx.c:2711 with very simple code

[Bug target/8507] [Cygwin] -fno-leading-underscore has no effect

[Bug target/8606] GNAT floating point optimization bug

[Bug target/8664] [PPC linux] ICE in dwarf2out_frame_debug_expr, at dwarf2out.c:1538

[Bug target/8795] [PPC] Altivec related bugs concerning gcc 3.3 and mainline

[Bug target/8869] [x86 MMX] ICE with const variable optimization and MMX builtins

[Bug target/8871] [x86 MMX] Inefficient zero_ for MMX

[Bug target/8871] [x86 MMX] Inefficient zero_extendsidi2 for MMX

[Bug target/8871] [x86 MMX] Inefficient zero_extendsidi2 for MMX

[Bug target/8972] [arc-7-elf] the c code ' x << i' causes infinite loop when i = 0

[Bug target/8973] [arc-7-elf] the interupt handler does not return properly, uses j.d insted of j.d.f

[Bug target/9201] [3.3/3.4 regression] ICE in instantiate_virtual_regs_1 compiling octave-2.1 on m68k-linux

[Bug target/9365] [3.3 regression] [SH] segfault in gen_far_branch (config/sh/sh.c)

[Bug target/9511] [Cygwin] Can't detect whether threading enabled

Re: [Bug target/9511] [cygwin] Can't detect whether threading enabled

[Bug target/9511] [Cygwin] Can't detect whether threading enabled

[Bug target/9552] [3.3/3.4 regression] ICE in named_section_flags, at varasm.c

[Bug target/9571] [PPC] problems with 'const', -msdata=eabi and sections.

[Bug target/9601] [i386] -mrtd switch/stdcall attribute raises warnings for __buitltin functions

[Bug target/9620] [ia64] left-shift of bit field of 64-bit long truncated to 32 bits.

[Bug target/9633] [i386 SSE] SSE intrinsics generate wrong code when spilling xmm registers to stack

[Bug target/9691] Shared libraries don't work with g++

[Bug target/9835] [mips-elf] Internal Compiler Error (segfault) with -msoft-float

[Bug target/9883] [mipsel] segfault while compiling libgcc2.c

[Bug target/9929] [3.3/3.4 regression] Can't find spill register in GENERAL_REGS

[Bug web/11335] cvsweb shows incomplete logs for some files

Re: [GCC] gcc vs. indentation

arm-elf snafu? can't mix default-soft-float, explicit -msoft-float

Re: arm-elf snafu? can't mix default-soft-float, explicit-msoft-float

att ressources humaines merci

Bootstrap broken because of missing intl routines

bootstrap error on arm in libstdc++

bootstrap failure (hppa2.0w-hp-hpux11.11/libiberty/config.h)

BUG REPORT FOR GCC 3.2: Conditional expressions as L-Values

bug va_arg(ap, long long)??

Re: c/8730: [3.2/3.3/3.4 regression] Cannot compile C function inside other C function

Can you ehlp me on this?

cannot pass objects of non-POD type [] through '...'

Could somebody close PR c/11428 for me?

cross compiler bug ? (ia64,asm)

cvs: ctime / doubled expl. inst. of __Atomicity_lock<0>::_S_atomicity_lock;

default parameters, virtual functions

Dependent base class and CVS head

error building gcc-3.2.2 under solaris 2.8

Error in gcc configure files

Error while building GCC-3.3 for sh-elf target

Exception allocation bug?

fabs(0.0) < 0 optimization not working on gcc-3.3 on sh4?

Failure of test g++.dg/init/array10.C

Failure to bootstrap for trunk on athlon_mp-pc-linux-gnu

floating point exception problem on x86

g++ 3.3: ICE for source file with more than 524347 lines

GCC not awre of MMU

gcc 3.2.3 / IA-32 optimization bug w/ 64 bit parameters

Re: GCC 3.3 build on AIX 5.2, done

Re: GCC 3.3 build on AIX 5.2, ICE

GCC version 2 on SunOS 4.1.4

GNAT bug candidate

ia64-linux binutils requirements?

Inline ASM bug

large arrays crashing gcc on some arch's

Re: Last data page not being filled

Re: Loop optimizer issues

Message deleted by Sjomailgate8

missing gmon.out

New bootstrap failures with remaining clk_* uses

new-ra weirdness

Nuera Communications Holiday Notice

PCH is not being found any more???

possible bug with gcc

Possible optimizer bug on sparc-solaris?

problem building gcc 3.4 20030705 with gcc-3.3

Problem compiling C++ program using olog function

Problem with conversion operator from template class >>Text und Anhang sindVIRENFREI !!<<

Re: Problems building 64-bit version of GCC on AIX (Power 4) 5.1 SP.

Request to mailing list Ietf-types rejected

sh-elf build failure: libc_name_p

State of djgpp support?

this_input_filename patch introduced bug

Tru64 5.1 bootstrap fails with missing symbols: libiconv et al.

Why must the build system always be broken?

Wir suchen neue Kooperationspartner.

Your mail to Firewalls

Your message to Course Technology Re : "Re: Application" was infected with a virus .


Indexes: [Date Index] [Subject Index] [Author Index] [Thread Index]
Site Nav: [Browse other archives for this mailing list]
[Browse other mailing lists at this site]
Search: Limit to:

Mail converted by MHonArc 2.6.3