gcc-bugs archive
date index for October, 2001

This is the mail archive of the gcc-bugs@gcc.gnu.org mailing list for the GCC project.

Indexes: [Date Index] [Subject Index] [Author Index] [Thread Index]
Site Nav: [Browse other archives for this mailing list]
[Browse other mailing lists at this site]
Search: Limit to:

October 31, 2001
22:29 Re: target/702: SPARC-Solaris compiler should be bi-arch rodrigc
22:26 Re: target/723: Bootstrap failure on sparc64-redhat-linux rodrigc
22:23 Re: target/4045: Error compiling gcc on BSD/OS 4.2 rodrigc
21:46 Re: bootstrap/3355: Build of gcc3.0 fails rodrigc
21:36 Re: pending/4721: Internal compiler error when compiling libDSP for i686/athlon rodrigc
21:19 Re: libstdc++/4742: missing method rodrigc
21:04 Re: c++/4758: When compiling kvirc from source, an internal compiler error ensues and c++ aborts rodrigc
21:03 Re: libstdc++/4741: missing method rodrigc
20:46 Re: c++/4740: internal error rodrigc
20:44 Re: target/4756: Internal compiler error : Unrecognizable insn rodrigc
20:41 Re: c/4736: gcc internal error in reload_cse_simplify_operands compiling linux 2.4.13 rodrigc
20:37 Re: bootstrap/4759: Cannot build gcc-3.0.2 rodrigc
20:35 Re: optimization/4745: ICE on linux kernel compilation with gcc 3.0.2 rodrigc
20:34 Re: middle-end/4744: Internal compiler error in reload_cse_simplify_operands, at reload1.c:8355 rodrigc
20:33 Re: c/4743: upgrade gcc-2.96 to gcc3.02 failed rodrigc
20:30 Re: pending/4760: bug #4711 seems solved rodrigc
17:50 Re: SH-ELF: SFmode calling convention bug with -m4/-m4-single-only -ml Joern Rennecke
17:15 SH-ELF: SFmode calling convention bug with -m4/-m4-single-only -ml tm
14:38 bug #4711 seems solved Aaron Lehmann
14:26 Bug report c++/4597 Cameron Smith
13:56 bootstrap/4759: Cannot build gcc-3.0.2 tkoeller
12:56 Re: fortran/4752: g77 -v -c -xf77-version /dev/null -xnone causes ice toon
11:26 c++/4758: When compiling kvirc from source, an internal compiler error ensues and c++ aborts robin
10:13 Re: gengenrtl needs to link with libintl John David Anglin
09:56 c/4757: GCC 3.0.1 fails to compile when -fschedule-insns option is specified Matt.Rhodes
09:16 target/4756: Internal compiler error : Unrecognizable insn palf
09:05 problem with double numbers Cedric Roux
08:21 Re: c++/4755: virtual abstract member function neil
07:56 c++/4755: virtual abstract member function petridis
05:46 c++/4754: problem with nested extern "C" markus
04:16 other/4753: Gcc fails to build libgcc for mips target on linux host Frederic.Petrot
00:40 Re: libstdc++/4354: string::assign behaving unexpectedly when destination string == source string bkoz
00:36 Re: libstdc++/4622: incorrect implementation of complex operator/= bkoz

October 30, 2001
23:51 Re: java/4717: miscompiling class reference bryce
16:17 fortran/4752: g77 -v -c -xf77-version /dev/null -xnone causes ice Peter Schmid
15:46 optimization/4751: g++ -O producing incorrect code for ((global1&255)==255 || global2) keenan
15:36 libstdc++/4749: 22_local/codecvt.cc failure on cygwin David.Billinghurst
15:36 libstdc++/4750: 22_locale/ctype_members_char.cc fails on cygwin David.Billinghurst
15:12 Re: c/2707: gcc does not warn on truncate neil
13:58 Re: c/2547: GCC generate wrong size struct neil
13:53 Re: c/2243: Misplacement of label at start of function. neil
13:07 other/4748: compilation error czuma
12:29 Largefile problem with gcc3.0.2 wilf
11:47 bootstrap/4747: Encounter errors while building 2.95 gcc on i386-pc-interix (version 2.2) christopher.chan
11:36 Re: gengenrtl needs to link with libintl John David Anglin
11:06 bootstrap/4746: Segmentation fulat building gcc-3.0.2 on Linux (x86) tom.williams
10:47 optimization/4745: ICE on linux kernel compilation with gcc 3.0.2 Johny Dog
09:16 middle-end/4744: Internal compiler error in reload_cse_simplify_operands, at reload1.c:8355 makleske
09:15 Re: gengenrtl needs to link with libintl Zack Weinberg
08:58 gengenrtl needs to link with libintl John David Anglin
06:58 Re: fortran/3777: g77 -msse2 ICE in extract_insn toon
06:56 c/4743: upgrade gcc-2.96 to gcc3.02 failed p.c.m.chiu
06:28 Re: c++/959: Problems with template specialisation and namespaces lerdsuwa
06:19 Re: c++/175: Internal compiler error in GCC snapshot for syntactically-incorrect input lerdsuwa
06:14 Re: c++/1049: Compiler egcs-2.91.66 crashes on template class fcn. defn. lerdsuwa
06:11 Re: c++/2268: g++ 2.95.2/3 gives ICE, today's online compilation SegFaults. lerdsuwa
06:08 Re: c++/3560: Problem with template enum lerdsuwa
05:45 Compiling kernel Paulo J. Matos aka PDestroy
05:44 Re: fortran/3777: g77 -msse2 ICE in extract_insn Tim Prince
05:16 libstdc++/4742: missing method jccosta
05:07 libstdc++/4741: missing method jccosta
05:07 gcc 3.0.2: Internal compiler error in reload_cse_simplify_operands, at reload1.c:8364 Gert Wollny
04:56 c++/4740: internal error jccosta
04:56 c++/4739: gcc version 2.95.3 20010315 (SuSE) produces internal error hinkelma
02:26 middle-end/4738: There is no FreeBSD IA-64, sparc64, or PowerPC support obrien
02:06 c++/4737: Exception handling on AIX 4.3.3 does not catch cj
00:11 Re: bootstrap/3542: building gcc-3.0 fails on SuSE-7.1 Daniel Rohe
00:10 Re: fortran/3777: g77 -msse2 ICE in extract_insn toon

October 29, 2001
23:42 Re: fortran/4123: gcc 3.0.1 'g77 -v' seg fault toon
23:40 Re: fortran/4730: ICE on valid input using CALL EXIT(%VAL(...)) toon
23:38 Re: fortran/4398: float c subroutine returns bad value to FORTRAN main toon
22:35 Re: c++/1752: libiberty/demangle testsuite failures on i686-pc-cygwin billingd
20:29 Re: c/4685: Generating "Compiler Internal Error" rodrigc
20:27 Re: optimization/4718: Internal compiler error in file drivers/net/8139too.c while compiling linux kernel 2.4.13 rodrigc
14:16 RE: gcc 3.0.2 preprocessor token stringization fails David Thompson
13:51 Re: libgcj/4728: java.util.zip.GZIPOutputStream.write(int) doesn't update CRC tromey
13:26 Re: gcc 3.0.2 preprocessor token stringization fails Neil Booth
13:23 Re: gcc 3.0.2 preprocessor token stringization fails Neil Booth
13:21 Re: gcc 3.0.2 preprocessor token stringization fails Zack Weinberg
12:49 gcc 3.0.2 preprocessor token stringization fails David Thompson
12:47 c/4734: internal compiler error, change_address scf
11:33 gcc-3.0.1 winfried szukalski
11:14 Re: libstdc++/3647: in_avail() is not working according to the ISO standard bkoz
10:52 Re: c/2466: Testsuite failure gcc.c-torture/execute/loop-2b.c -O2 neil
10:31 Re: bootstrap/3442: followup to PR3440 rodrigc
10:29 Re: c/3440: pointer to a struct changes when no assignment has been made to it rodrigc
10:25 Re: libstdc++/4146: input, num_get, regression from 2.95 bkoz
09:35 Re: bootstrap/3090: compile fails on linux-m68k in dwarf2out.c rodrigc
09:26 optimization/4733: Incorrect code when aliasing double and struct on ARM -O2 bjh21
09:22 Re: bootstrap/1079: When compiling the gcc package, terminates with an error rodrigc
09:20 Re: bootstrap/3847: GCC 3.0 SEGVs while bootstrapping (-fexceptions only) rodrigc
09:15 Re: bootstrap/4211: segmentation fault compiling tmp-dum.c for ia64 cross-compiler rodrigc
09:09 Re: bootstrap/3641: can not bootstrap on i386-linux and others without glibc - MD_FALLBACK_FRAME_STATE_FOR Daniel Jacobowitz
08:46 c++/4732: g++-3.0.1 has internal error #108 on compiling templates jeeny
08:34 Re: bootstrap/3641: can not bootstrap on i386-linux and others without glibc - MD_FALLBACK_FRAME_STATE_FOR Craig Rodrigues
08:34 Re: libstdc++/4458 Phil Edwards
08:06 target/4731: SPARC gives wrong output on simple combination of Fortran main program and C functions toon
08:05 Re: debug/3164: gcc-ss-20010611 ICE on ia64-linux rodrigc
08:03 Re: optimization/3122: ICE with RTL checking on i686-linux rodrigc
08:00 Re: bootstrap/3641: can not bootstrap on i386-linux and others without glibc - MD_FALLBACK_FRAME_STATE_FOR Daniel Jacobowitz
07:58 Re: c++/3389: gcc-3.0 doesn't build shared C++ library on i386-pc-gnu rodrigc
07:51 Re: c/4148: GCC 3.0.1 produces ICE on Linux kernel build. rodrigc
07:48 Re: c/4282: bug in isdn4k-utils/capi20capi20/capi20.c rodrigc
07:17 fortran/4730: ICE on valid input using CALL EXIT(%VAL(...)) toon
07:10 Re: fortran/4722: f77 0.5.26 handles EOF in scratch files incorrectly, f77 0.5.25 is OK toon
07:01 Re: Fortran ICE Toon Moene
06:18 Re: Fortran ICE Jakub Jelinek
06:15 Re: Fortran ICE Tim Prince
06:07 problem installing gcc Valerio Filippini
04:27 Re: c/4725: Cannot compile 8139too.c from Linux kernel 2.4.13 neil
04:26 Re: c/4726: Cannot compile 8139too.c from Linux kernel 2.4.13 neil
04:26 java/4729: Segfault with circular inheritance bryce
03:50 Code generation problem in gcc 2.95.x with -g Dominik Strasser
03:46 libgcj/4728: java.util.zip.GZIPOutputStream.write(int) doesn't update CRC roman.kagan
03:26 bootstrap/4727: dwarf2 debugging crashes cc1plus building libstdc++ brendan
03:25 Problems using gcc 2.95.2 Jordi Castro
03:23 Fortran ICE Jakub Jelinek
03:16 Re: ld trapped in endless loop (was Re: config? bootstrap on hppa64-hp-hpux11.0 with --enable-shared still fails) Markus Werle
02:05 Re: ada/4719: Error building Ada tools with srcdir and objdir on different filesystems Lutz Donnerhacke
01:36 c++/4724: Internal Error - Segmentation Fault on template code anthwil

October 28, 2001
23:51 Re: c/4400: RE: Failure of gcc.c-torture/execute/20010924-1.c on irix6.5 neil
23:50 Re: c/4397: Re: Failure of gcc.c-torture/execute/20010924-1.c on irix6.5 neil
21:19 Re: bootstrap/2838: Installation error rodrigc
21:17 Re: bootstrap/1950: GCC cross build fails rodrigc
21:16 Re: bootstrap/1979: GCC-20010122 not compiled on alpha osf5.1 rodrigc
21:13 Re: bootstrap/2073: cannot configure the fortran compiler on my platform rodrigc
21:04 Re: bootstrap/3185: Build failure of prerelease snapshot 20010613 on RS6000 AIX 4.2.1 rodrigc
21:01 Re: bootstrap/4469: bootstrap fails in config for libstdc++-v3; using gcc-3.0 but config says use gcc-3.0 rodrigc
20:35 Re: bootstrap/3641: can not bootstrap on i386-linux and others without glibc - MD_FALLBACK_FRAME_STATE_FOR rodrigc
20:28 Re: bootstrap/3401: Critical problems with Gcc-3.0 rodrigc
20:18 Re: bootstrap/3334: fails to bootstrap with gcc-3.0 rodrigc
20:16 Re: bootstrap/4010: ICE in const_hash rodrigc
20:08 3.1 20011027 ICE at sched-rgn.c:2942 compiling complex_io.cc on hppa2.0-hp-hpux10.20 rbrown64
19:15 Re: bootstrap/3542: building gcc-3.0 fails on SuSE-7.1 rodrigc
19:04 Re: bootstrap/3102: GCC 3.0 CVS bootstrap failure for alpha-dec-osf4.0d rodrigc
19:02 Re: bootstrap/3327: Make bootstrap on GCC 3.0 fails on AIX 4.2.1 rodrigc
18:52 Re: bootstrap/3355: Build of gcc3.0 fails rodrigc
18:46 Re: middle-end/3214: ICE in eliminate_regs at relaod1.c:2595 rodrigc
13:18 Re: c++/4629 Jens Maurer
12:56 fortran/4722: f77 0.5.26 handles EOF in scratch files incorrectly, f77 0.5.25 is OK arends
10:56 ada/4720: GNAT programs do not support --help and --version Joseph Myers
10:52 Re: other/980: Unified contributing instructions jsm28
10:24 gcc 3.0.2: improper compilation of attached exception example Jay Berkenbilt
09:00 Re: bootstrap/4699: Internal compiler error when compiling capi.c rodrigc
08:59 Re: c/4635: 8139too.c:2419: Internal compiler error in reload_cse_simplify_operands, at reload1.c:8355 rodrigc
08:58 Re: c/4585: GCC exitss with an Internal Compiler error when compiling the included code with -O2 -fomit-frame-pointer. rodrigc
08:57 Re: c/4673: ICE compiling Linux/i86 kernel 2.4.13 drivers/net/8139too.c rodrigc
08:56 Re: c/4667: Compiling kernel 2.4.13 with -O2 causes internal compiler error rodrigc
08:56 Re: c/4658: Linux Kernel 2.4.13pre6 fail to compil with gcc-3.0 rodrigc
08:55 Re: c/4647: Internal compiler error in 8139too.c when compiling linux 2.4.12 rodrigc
08:54 Re: c/4689: Internal compiler error in file drivers/net/8139too.c while compiling linux kernel 2.4.13 rodrigc
08:36 ada/4719: Error building Ada tools with srcdir and objdir on different filesystems mattheww
08:27 long long divisors george anzinger
08:18 "C" internal error, segmentation fault kens
07:46 optimization/4718: Internal compiler error in file drivers/net/8139too.c while compiling linux kernel 2.4.13 nevermore
06:01 Re: c++/4425: parse error/scope resolution operator in template parameter lerdsuwa
05:13 Re: java/4366: java class initialization bug green
04:59 Re: java/4716: gcj miscompiled class reference green
04:56 java/4717: miscompiling class reference Anthony Green
04:46 Re: Yours (Richard Kenner's) patch to genrecog Jan Hubicka
04:46 java/4716: gcj miscompiled class reference Anthony Green
04:26 java/4715: Tree check failure in check_inner_circular_reference bryce
04:04 RE: libstdc++/4563: [cygwin] `::acosf' undeclared (first use here) Billinghurst, David (CRTS)
03:47 optimization/4714: Haney's real matrix performance regression pcarlini
02:12 Re: libstdc++/4458 James Kanze
01:47 GCC-3.0.2 internal compiler error Rus V. Brushkoff
00:35 Re: c/4713: syntax error on #include commands Zack Weinberg

October 27, 2001
21:33 Re: c/4529 Luben Tuikov
14:29 Re: c/4713: syntax error on #include commands neil
14:16 c/4713: syntax error on #include commands dllau
12:46 optimization/4712: Internal compiler error in reachable_next_level, at except.c:2723 dlux
12:26 bootstrap/4710: Cannot Build 3.0.2 on Linux 2.4.5 using 2.95.2 georgek
12:26 optimization/4711: ICE in eliminate_regs, at reload1.c:2576 aaronl
11:06 ada/4709: Ada files not in gcc_update Joseph Myers
10:53 Re: java/2791 Mark Wielaard
10:16 Re: gcc2.95 Bug? Tim Prince
09:22 Re: Mindless ABI adherence Linus Torvalds
08:29 Re: Mindless ABI adherence Florian Weimer
07:08 Re: c++/4498: Using "using" in a namespace with namespace as name (sort of infinite recursion ?!) lerdsuwa
07:07 Re: c++/1787: ICE on using ::std; lerdsuwa
06:28 gcc2.95 Bug? kiyoko
05:07 Re: c++/4654: gcc 2.95 does not report error correctly lerdsuwa
05:05 Re: c++/4655: ICE on small-ish test code lerdsuwa
04:59 Re: c++/4661: g++ recognize a c++ header file (.hpp) as c header file lerdsuwa
04:57 Re: c++/4708: Internal compiler error in lookup_template_class, at cp/pt.c:3961 lerdsuwa
04:52 Re: c++/4708: Internal compiler error in lookup_template_class, at cp/pt.c:3961 lerdsuwa
04:46 Re: c++/4707: g++ complains about a "typedef", but no typedefs are there lerdsuwa
04:45 Re: c++/4672: Template parameter deduction fails for overloaded template functions. lerdsuwa
04:31 Re: c++/4649: Internal Compiler Error on some template code lerdsuwa

October 26, 2001
22:16 c++/4708: Internal compiler error in lookup_template_class, at cp/pt.c:3961 weidai
16:19 Re: libstdc++/4686: Output disappearing after operator<<( streambuf* ) Carlo Wood
16:13 Re: libstdc++/4701: imbue(locale("de_DE")) not working Benjamin Kosnik
15:37 c++/4707: Misleading error message on compilation dLux
14:56 c++/4706: ICE with -O2{3} -funroll-loops -ffast-math pcarlini
13:49 Re: c/137: Inconsistency in -Wconversion neil
13:34 ice bug while building Linux kernel Paul E Condon
13:31 Re: libstdc++/4703: filebuf::in_avail() not correct pme
13:27 c/4704: ss-20011023 i686 ICE with dwarf2 default tmwg-gcc
13:16 libstdc++/4703: filebuf::in_avail() not correct David Rasmussen <pinkfloydhome
13:12 Re: libstdc++/4701: imbue(locale("de_DE")) not working Peter Schmid
12:57 Re: c/2896: -std=foo gives error message twice neil
12:56 Re: c/545: -std=c89 defines macros it shouldn't neil
12:54 Re: c/1609: -funsigned-char -fsigned-char defines __CHAR_UNSIGNED__ neil
12:01 Re: warning: decimal constant is so large that it is unsigned 'Neil Booth'
11:46 RE: warning: decimal constant is so large that it is unsigned Pergola, Michael
11:44 Re: ld trapped in endless loop (was Re: config? bootstrap on hppa64-hp-hpux11.0 with --enable-shared still fails) Ian Lance Taylor
11:40 Re: warning: decimal constant is so large that it is unsigned Neil Booth
11:32 Re: libstdc++/4701: imbue(locale("de_DE")) not working bkoz
11:17 warning: decimal constant is so large that it is unsigned Pergola, Michael
11:16 c++/4702: arm-elf-gcc generates undefined for __gxx_personality_sj0 rslaughter
11:16 libstdc++/4701: imbue(locale("de_DE")) not working Peter Schmid
11:14 Re: c/4697: Warning 'value computed is not used' missing neil
11:00 Re: libstdc++/4168: overloading problem with std::binder2nd bkoz
10:56 c/4700: GCC not honoring asm clobbered regesters for -fPIC on i386 ddaney
10:12 Re: c/4697: Warning 'value computed is not used' missing Herman ten Brugge
10:05 Re: libstdc++/4563: [cygwin] `::acosf' undeclared (first use here) bkoz
09:56 bootstrap/4699: Internal compiler error when compiling capi.c Florian Mueller
09:18 RE: c/4691: Incorrect warning that statement has no effect Donald Gillies
09:16 RE: c/4691: Incorrect warning that statement has no effect Donald Gillies
08:21 Re: c/4698: constant beginning with 0 as array index Martin Kahlert
07:48 Re: c/4698: constant beginning with 0 as array index does not compile neil
07:46 c/4698: constant beginning with 0 as array index bonnaud
04:50 ld trapped in endless loop (was Re: config? bootstrap on hppa64-hp-hpux11.0 with --enable-shared still fails) Markus Werle
04:27 Unrecognizable insn: in reload_cse_simplify_operands reload1.c:8355 Gert Wollny
02:33 Re: c/4697: Warning 'value computed is not used' missing neil
01:16 c/4697: Warning 'value computed is not used' missing Haj.Ten.Brugge
00:52 Re: libstdc++/4622: incorrect implementation of complex operator/= Gabriel Dos Reis
00:35 Re: build failure solaris-2.6 c-lex Andreas Tobler

October 25, 2001
23:46 Re: libstdc++/4503: __enc_traits destructor crashes if initialisation failed bkoz
23:46 Re: c/3573: ICE in fixup_var_refs_1, at function.c:1922 neil
23:41 Re: c/4691: Incorrect warning that statement has no effect neil
23:39 Re: confirmed in gcc 3.0.2/x86: c/3573: Internal compiler error in fixup_var_refs_1, at function.c:1922 Neil Booth
23:35 Re: libstdc++/4686: Output disappearing after operator<<( streambuf* ) bkoz
23:31 Re: c/150: div-by-0 warnings neil
23:16 c++/4696: Casting operator creates bogus temporary sparker
23:15 Re: libstdc++/4622: incorrect implementation of complex operator/= bkoz
22:58 Re: libstdc++/4623: correct uses of _Bool in type-traits.h & instantiations bkoz
22:57 Re: libstdc++/4617: /usr/ccs/bin/ld: Duplicate symbol "std::__timepunct<char>::_M_put_helper(char*, unsigned, char const*, tm const*) const" in files .libs/locale-inst.o and .libs/time.o bkoz
22:54 Re: libstdc++/4586: math headers not up to current standards not sure if still a prob in 3.0+ bkoz
22:51 Re: libstdc++/4559: failing make check -- huge memory usage bkoz
22:45 Re: libstdc++/4548: When reserving a string to become smaller, program crashes bkoz
22:42 Re: libstdc++/4542: _M_construct_name in locale_facets.tcc uses variable array size bkoz
22:34 Re: libstdc++/4534: vector<bool>::_M_range_check should throw out_of_range bkoz
22:00 Re: confirmed in gcc 3.0.2/x86: c/3573: Internal compiler error infixup_var_refs_1, at function.c:1922 Steven G. Johnson
21:49 Re: libstdc++/4536: ostream seekp & istream seekg should scope failbit bkoz
21:37 Re: libstdc++/4545: basic_ostream op<< should set badbit, not failbit bkoz
21:19 Re: libgcj/4690: Process.exitValue returns incorrect value bryce
21:01 Re: c++/3956: ICE in genrtl_compound_stmt c-semantics.c:686 bryce
21:00 Re: c++/3972: ICE in genrtl_compound_stmt at c-semantics:680 compiling Mozilla's nsFontMetricsGTK.cpp bryce
20:58 Re: c++/3984: ICE in genrtl_compound_stmt c-semantics.c: 680 bryce
20:57 Re: c++/4009: ICE in genrtl_compound_stmt c-semantics.c:686 bryce
20:56 Re: c++/4347: internal compiler error in genrtl_compoundstmt at c-semantics.c:673 bryce
20:55 Re: c++/4430: ICE with current cvs 3.1 bryce
20:54 Re: c++/4572: internal compiler error in mozilla 0.9.5 source bryce
20:53 Re: c++/3166: ICE in genrtl_compound_stmt at c-semantics.c:678 bryce
20:47 Re: other/4656: gcc3.0.1 building fails on MacOS X.1 bryce
20:16 java/4695: Error calling method from enclosing context in constructor bryce
20:11 Re: java/4694: ICE in check_final_variable_indirect_assignment() bryce
20:06 another example of bug reported yesterday (?) Paul E Condon
20:06 java/4693: ICE in check_final_variable_indirect_assignment() bryce
20:06 java/4694: ICE in check_final_variable_indirect_assignment() bryce
19:56 Re: confirmed in gcc 3.0.2/x86: c/3573: Internal compiler error in fixup_var_refs_1, at function.c:1922 Andrew Pinski
19:56 c/4692: Bug compiling wine fjleon
19:20 Re: build failure solaris-2.6 c-lex Kaveh R. Ghazi
19:16 c/4691: Incorrect warning that statement has no effect dgillies
16:46 libgcj/4690: Process.exitValue returns incorrect value shayne
16:28 c/4689: internal compiler error in rtl8139.c burian
16:28 c++/4688: g++ hangs on this file (no output) een
16:28 bootstrap/4687: gengenrtl corefiles george.goffe
16:28 libstdc++/4686: Output disappearing after operator<<( streambuf* ) kanze
16:28 c/4685: Generating "Compiler Internal Error" alireza
16:28 pending/4684: Internal compiler error in change_address fevrier
16:27 c++/4683: constructor executed at least twice Gerhard Wesp
16:27 bootstrap/4682: undefined reference to `target_flags' george.goffe
16:27 bootstrap/4681: segmentation fault during bootstrap (x-gcc) bp1
16:27 c++/4679: g++ gets internal compiler error celliott
16:27 c++/4678: Exception Handling Not Working on Large -fPIC Applications grendel
16:27 libstdc++/4675: __gthread_getspecific calls __terminate without parameters rhurst
16:27 c/4676: Warning when casting to a __stdcall function pointer benjamin.riefenstahl
16:27 c/4673: ICE compiling Linux/i86 kernel 2.4.13 drivers/net/8139too.c vladimir.kondratiev
16:26 c++/4672: Template parameter deduction fails for overloaded template functions sven
16:26 c++/4671: SegFault compiling qt qabstractlayout.cpp georg.wild
16:26 c++/4662: g++ recognize a c++ header file (.hpp) as c header file acss
16:26 c++/4661: g++ recognize a c++ header file (.hpp) as c header file acss
16:26 c/4658: Linux Kernel 2.4.13pre6 fail to compil with gcc-3.0 kilobug
16:26 c++/4657: comparing function pointer with int does not produce error andyc
16:26 c++/4654: gcc 2.95 does not report error correctly tcrhak
16:26 other/4656: gcc3.0.1 building fails on MacOS X.1 ablondel
16:26 c++/4653: template instantiation not in sync with Koenig's lookup gawrilow
16:26 c++/4655: ICE on small-ish test code mikec
16:26 c++/4652: anonymous struct names conflict with namespaces gawrilow
14:23 Re: confirmed in gcc 3.0.2/x86: c/3573: Internal compiler error infixup_var_refs_1, at function.c:1922 Steven G. Johnson
13:49 Re: confirmed in gcc 3.0.2/x86: c/3573: Internal compiler error in fixup_var_refs_1, at function.c:1922 Neil Booth
12:44 confirmed in gcc 3.0.2/x86: c/3573: Internal compiler error infixup_var_refs_1, at function.c:1922 Steven G. Johnson
11:02 Re: c++/4629: non-constant `sizeof (void*)' cannot be used as templateargument Peter Schmid
10:08 GCC bug - ICE on Linux kernel 2.4.12 Javier Pello
08:33 Re: c++/4376 Georg Wild
07:00 c++ 3.0.2 build on HP-UX 11.00 H.Merijn Brand
00:50 3.1 1024 ICE in alloc_aux_for_edge, at cfg.c:649 compiling cp/decl2.c onhppa2.0-hp-hpux10.20 rbrown64

October 24, 2001
23:12 Re: Fw: Bug in gcc Zack Weinberg
22:47 Fw: Bug in gcc Steffen Wendzel
22:30 ice bug while building kernel-2.4.12 Paul E Condon
22:07 Bootstrap failure 3.1 1024 on UnixWare7.1.0 compiling tmp-dum.c with stage2compiler rbrown64
21:20 Re: c++/4587: g++ -maix64 generates illeagal assembler code Kouichi Hashikawa
18:09 Recent bootstrap failure - irix and cygwin Billinghurst, David (CRTS)
16:35 lib/g77.exp rewrite doesn't work on irix Billinghurst, David (CRTS)
14:24 Re: gcc 3.01 on Solaris 2.7 Loren James Rittle
13:32 C++: Reading past the end of a file when using eof() Alexander Klein
13:32 C++: Strange behaviour with initialization of float arrays Alexander Klein
09:23 RE: Meenan Vishnu
07:33 Re: Yours (Richard Kenner's) patch to genrecog Jan Hubicka
07:32 Re: Yours (Richard Kenner's) patch to genrecog Jan Hubicka
07:02 Re: Can't compile gcc-20011023 on cygwin, interrupted system call on gencheck.exe Christian Jönsson
05:32 Re: c++/4256: Headers in CPLUS_INCLUDE_PATH treated as C code Jorgo Bakker
04:08 Can't compile network driver in the kernel. Gonzalo Aguilar
01:37 3.1 1022 libstdc++ FAIL:21_strings/{ctor_copy_dtor,insert} exec if arch == i686 rbrown64
01:36 Can't compile gcc-20011023 on cygwin, interrupted system call on gencheck.exe Christian Jönsson

October 23, 2001
21:58 Re: gcc 3.01 on Solaris 2.7 Loren James Rittle
13:59 Re: Yours (Richard Kenner's) patch to genrecog Richard Kenner
13:57 Re: Yours (Richard Kenner's) patch to genrecog Daniel Jacobowitz
13:41 Re: f77 - LIBU77_GETTIMEOFDAY: command not found Toon Moene
11:54 Re: GNATS... Joseph S. Myers
11:25 GNATS... Neil Booth
10:24 f77 - LIBU77_GETTIMEOFDAY: command not found Graham Stott
08:49 Re: Yours (Richard Kenner's) patch to genrecog Richard Kenner
07:51 gcc: signal 11 Andreas Bohne
05:52 Re: Yours (Richard Kenner's) patch to genrecog Jan Hubicka
03:05 Re: c++/4574: Internal compiler error in `expand_and', at expmed.c:4055 lerdsuwa
03:04 Fwd: c++/3947 (destructor is called twice) David Hanney
03:00 Re: c++/4592: ./../SrcShared/MetaMemory.cpp:428: Internal compiler error. lerdsuwa
02:51 Re: c++/4593: Internal compiler error lerdsuwa
02:40 Re: c++/4629: non-constant `sizeof (void*)' cannot be used as template argument lerdsuwa
02:38 Re: c++/4646: Internal compiler error when using bit field named 'identity' and #include <map> lerdsuwa
02:34 Re: c++/4649: Internal Compiler Error on some template code lerdsuwa
02:30 Re: c++/163: internal compiler error lerdsuwa
02:29 Re: c++/178: GCC Bug ? lerdsuwa
02:27 Re: c++/2604: Loki-related seg fault lerdsuwa
01:46 java/4650: * Philippe.Drauge
00:46 c++/4649: Internal Compiler Error on some template code anthwil

October 22, 2001
22:40 Bootstrap failure compiling config/pa/pa.c on hppa2.0-hp-hpux10.20 3.1 MonOct 22 22:46:06 UTC 2001 rbrown64
20:55 Bug Bob Bomar
17:36 c/4648: gcc generates bad code at -O2 for SPEC crafty pgm on HPPA 32 HP-UX sje
15:31 Re: c/4607: Optimization bug, (miscompilation of boehm-gc) bryce
14:16 c/4647: Internal compiler error in 8139too.c when compiling linux 2.4.12 thomas.degris
13:51 Re: bootstrap/4636: Error compiling java/net/URL.java:406: Internal error: Segmentation fault hp
13:50 Re: Bug in g77 frontend Toon Moene
10:02 Re: libjava bootstrap failure: URL.java segfault in integrate Andreas Jaeger
09:54 Re: c++/4544: templates, friends, namespaces lerdsuwa
09:52 Re: c++/4525: Can't construct member function of class template with pointer to member as argument, if the argument type is constructed out of the template argument lerdsuwa
09:49 Re: c++/4524: member of const instance can be modifies via non-const pointer to member lerdsuwa
09:44 Re: c++/4515: struct member not recognized although it exists and is accepted in a different context lerdsuwa
09:40 Re: c++/4477: sizeof on nested class members doesn't compile lerdsuwa
09:39 Re: c++/4430: ICE with current cvs 3.1 lerdsuwa
09:34 Re: c++/4595: internal compiler error in c_expand_expr [c-common.c:4121] lerdsuwa
09:26 c++/4646: Internal compiler error when using bit field named 'identity' and #include <map> rjackson
09:23 Re: c++/4598: "internal error #19990919" on duplicate constructor lerdsuwa
09:18 Re: c++/4633: g++ 3.0.1 bogus error on nested partial specialization lerdsuwa
09:15 Re: c++/4569: ICE on legal template code lerdsuwa
08:59 ARM structure returns Richard Sandiford
08:16 c++/4645: -Wall warning for -1 return on signed long does not make sense waratah
06:56 bootstrap/4644: stage2 g++ internal compiler error (#536854048) matthes
05:14 template parameter omission msg (not really a bug) Stephane.Conversy
04:46 c++/4643: multiple inheritance problem on arm using gcc 3.0.1 andy.parker
01:36 c++/4642: Very strange annoying warning about templates khlebnikov

October 21, 2001
23:46 optimization/4641: Temporary is not destructed when -O is used with recursive fn. b.bull
22:48 libjava bootstrap failure: URL.java segfault in integrate Bryce McKinlay
21:53 Bug in g77 frontend Dr. H. Ramachandran
20:32 Re: problems compiling gcc package on SunOS 4.1.4 Phil Edwards
20:12 problems compiling gcc package on SunOS 4.1.4 Robert Bonomi
17:08 Re: libstdc++/4561: [cygwin] multiple definition of `std::__timepunct<char>::_M_put_helper billingd
15:36 gcc 2.95.3 and pre-2.95.4 bug: ICE on good code with -march=i686 -mno-ieee-fp Jakub Bogusz
12:06 java/4639: gij HelloWorld segfaults if both HelloWorld.class and HelloWord executable is present otto
12:06 c/4640: unnamed enums inside struct typedef fnf
11:17 Re: Yours (Richard Kenner's) patch to genrecog Richard Kenner
10:45 Re: Yours (Richard Kenner's) patch to genrecog Jan Hubicka
10:19 Re: Yours (Richard Kenner's) patch to genrecog Richard Kenner
10:14 Re: Yours (Richard Kenner's) patch to genrecog Jan Hubicka
07:31 Re: c++/4637: GCC 3.0.1 gives compile error rodrigc
07:30 Re: c/4638: can't compile linux-2.4.12/drivers/net/8139too.c on atlon rodrigc
07:26 c/4638: can't compile linux-2.4.12/drivers/net/8139too.c on athlon petrch
05:56 c++/4637: GCC 3.0.1 gives compile error a.oosterveld
05:54 internal compiler error while compiling Linux-kernel Immo 'FaUl' Wehrenberg
04:26 java/4636: Error compiling java/net/URL.java:406: Internal error: Segmentation fault georg.wild

October 20, 2001
23:03 Re: c/4004: Segmentation fault when compiling perl 5.6.1 rodrigc
22:49 Re: libstdc++/3272: ostream::operator<<(streambuf*) sets EOFBIT to output stream rodrigc
22:47 Re: bootstrap/4443: Re: other/4441: can´t build "execvp: true: Permission rodrigc
22:42 Re: bootstrap/3321: "make bootstrap" fails on i686-pc-cygwin - #include nested too deeply rodrigc
22:37 Re: bootstrap/3262: Problem compiling GCC-3.0 on i586-pc-linux-gnu with gcc-2.95.2 rodrigc
22:35 Re: bootstrap/3271: rs6000 aix 4.2.1 bootstrap failure rodrigc
22:35 Re: bootstrap/3258: gcc does not correctly install into a target directory rodrigc
22:19 Re: c/4380: error compiling linux kernel source rodrigc
21:36 c/4635: 8139too.c:2419: Internal compiler error in reload_cse_simplify_operands, at reload1.c:8355 Andrew Bennetts
21:34 8139too.i for a bug submitted via the gccbug command Andrew Bennetts
21:32 Re: c++/4290: g++ 3.0.1 does not compile my file while 2.96 does rodrigc
21:20 Re: libstdc++/4523: regression: struct in namespace containing an ifstream defined outside rodrigc
21:11 Re: c/4567: Internal compiler error for GCC 3.0.1 rodrigc
21:00 Re: optimization/4565: Internal compiler error in extract_insn, at recog.c:2218 rodrigc
20:48 Re: c++/4626 Chris Rankin
20:32 Re: c++/4619: internal compiler error rodrigc
20:28 Re: c/4632: compilation of Linux kernel failed (file drivers/net/8139too.c) rodrigc
20:26 Re: c/4630: linux-2.4.12 and make bzImage, failed in drivers/net subdirectory rodrigc
20:25 Re: c/4628: won't compile a 2.4.12 kernel driver, returns an i_c_e rodrigc
20:23 Re: c++/4626: g++ 3.0.1 fails to find "stddef.h" when recompiling templates rodrigc
20:10 Re: target/4609: Using the `-mno-cygwin' gcc option causes an `Output filename specified twice' bug rodrigc
20:03 Re: c/4580: internal compiler error - 8139too.c from linux kernel 2.4.12 rodrigc
19:54 Re: libstdc++/4627: ios::ate open does not seek to EOF, it truncates rodrigc
19:06 Re: libstdc++/4532: typo in bits/stl_algo.h for partial_sort rodrigc
19:05 Re: libstdc++/4538: spurious semicolons in some headers rodrigc
19:04 Re: libstdc++/4539: locale::combine should be const rodrigc
19:03 Re: libstdc++/4537: reverse_iterator has a member called `current' available rodrigc
19:03 Re: libstdc++/4533: mistaken assumption in find_first_not_of and find_last_not_of rodrigc
19:00 Re: libstdc++/4541: raw_storage_iterator::operator= should call _Construct, not construct rodrigc
19:00 Re: libstdc++/4543: std_complex should give polar a default arg rodrigc
18:55 Java compiler crashes in integrate.c Zack Weinberg
17:36 other/4634: Internal compiler error when crosscompiling on x86 for m68k Benedikt Wildenhain
14:53 Re: c++/3747 Martin Sebor
14:46 c++/4633: g++ 3.0.1 bogus error on nested partial specialization sebor
13:11 Re: c++/4626 Chris Rankin
12:36 c/4632: compilation of Linux kernel failed (file drivers/net/8139too.c) mirco
08:44 Re: c++/3391: The compiler gives a Segmentation Fault when debug option is passed (-g) Kriang Lerdsuwanakij
07:26 c++/4629: non-constant `sizeof (void*)' cannot be used as template argument Peter Schmid
07:16 c/4628: won't compile a 2.4.12 kernel driver, returns an i_c_e mike
06:16 Re: c++/3565: boost: constructor called twice (gcc-3.0 regression) neil
03:55 Re: Yours (Richard Kenner's) patch to genrecog Richard Kenner
03:13 Yours (Richard Kenner's) patch to genrecog Jan Hubicka

October 19, 2001
21:46 libstdc++/4627: std::ofstream::open(ios::ate) does not seek to EOF tmwg-gcc
20:55 Re: c++/4626 Chris Rankin
20:20 Re: c++/4626 Chris Rankin
20:06 c++/4626: g++ 3.0.1 fails to find "stddef.h" when recompiling templates rankincj
17:21 Gcc 2.91.6x, 2.95.2, 2.95.3 for armlinux: wrong switch alternative taken after r/o comparison with selector variable Klaus Borchers
15:42 Re: Probable g77 compiler bug Toon Moene
15:12 Please close PR c++/3565 Peter Schmid
15:06 c++/4624: Bogus warning (private in aggregate types) Peter Schmid
14:56 libstdc++/4623: correct uses of _Bool in type-traits.h & instantiations brendan
14:44 Re: c++/3747 Neil Booth
14:23 Re: c++/3747 Jan van Dijk
13:56 libstdc++/4622: incorrect implementation of complex operator/= Edward E Meyer
13:28 Re: c++/3747 Rosen, Hyman
11:41 Re: Probable g77 compiler bug Jonathan Ravens
10:52 Re: Behaviors of `gcc -E -C' Neil Booth
10:43 Re: Your change to final.c Richard Earnshaw
10:41 Re: Your change to final.c Richard Kenner
10:31 Re: Your change to final.c Richard Earnshaw
10:29 Re: Mindless ABI adherence Linus Torvalds
10:27 Re: Your change to final.c Richard Kenner
10:26 bootstrap/4621: --program-suffix is ignored in configure neph
10:18 Re: Mindless ABI adherence Florian Weimer
10:16 Re: web/4615: got error trying to search gcc web pages hp
10:07 Re: CC bug report - following your instructions Zack Weinberg
10:02 Re: Mindless ABI adherence Joseph S. Myers
09:36 optimization/4620: Wrong code generated with -O2 for sparc-sun-solaris2.5.1 christophe.guillon
09:32 Your change to final.c Richard Earnshaw
09:26 Re: Mindless ABI adherence Linus Torvalds
09:10 CC bug report - following your instructions David Greaves
08:37 Re: gcc 3.0.1 generates bad code Graham Stott
08:10 Re: Mindless ABI adherence Florian Weimer
08:10 gcc 3.0.1 generates bad code Kenneth Gole
08:09 Re: Mindless ABI adherence Florian Weimer
05:11 Re: c++/4619 Paolo Carlini
04:26 c++/4619: internal compiler error sawa
02:51 Re: Duplicate symbol "std::__timepunct<char>::_M_put_helper(char*, unsigned, char const*, tm const*) const" Benjamin Kosnik
01:08 Re: Behaviors of `gcc -E -C' Roberto Bagnara

October 18, 2001
23:56 Re: Mindless ABI adherence Neil Booth
23:38 Re: Mindless ABI adherence D. J. Bernstein
23:19 Re: Mindless ABI adherence Neil Booth
22:27 Re: Probable g77 compiler bug Tim Prince
21:07 Mindless ABI adherence D. J. Bernstein
20:46 libstdc++/4617: /usr/ccs/bin/ld: Duplicate symbol "std::__timepunct<char>::_M_put_helper(char*, unsigned, char const*, tm const*) const" in files .libs/locale-inst.o and .libs/time.o dave.anglin
20:06 libgcj/4616: Floating Point Math class problem on Tru64 Alpha v 5.1 ake
18:10 Re: XEPX Richard Kenner
17:59 Probable g77 compiler bug Jonathan Ravens
17:23 Re: web/4615: got error trying to search gcc web pages hp
17:18 Re: irix bootstrap failure in gcc/integrate.c Andrew Pinski
17:16 Re: XEPX Andrew Pinski
17:13 irix bootstrap failure in gcc/integrate.c Billinghurst, David (CRTS)
16:56 web/4615: got error trying to search gcc web pages bko
16:56 c++/4614: "c:/dos/pub/djgpp/lang/cxx/stl_vector.h:95: Internal compiler error in `layout_decl', at stor-layout.c:247" junkmacc
16:46 c/4613: A.c:53: Internal compiler error in change_address, at emit-rtl.c:1635 Lyall.Pearce
16:36 c/4612: gcc 3.0.1 fails to compile ImageMagick carndt
16:06 c/4611: Internal compiler error in change_address, at emit-rtl.c:1635 (Solaris 2.5.1) Lyall.Pearce
15:41 RE: g77 bug: int(log10(x)) Billinghurst, David (CRTS)
15:23 XEPX Neil Booth
14:32 g77 bug: int(log10(x)) Patrick Lamb
14:27 bootstrap/4610: CC and gcc fail with OOM compiling combine.c on OSF1 (DEC Unix) acbell
11:56 target/4609: Using the `-mno-cygwin' gcc option causes an `Output filename specified twice' bug sergey_gromov
09:16 c/4608: --save-temps breaks location information in dwarf1 output ms
02:06 c/4607: Optimization bug, (miscompilation of boehm-gc) Martin Kahlert
01:56 Re: ada/4604: foo, yadda neil
01:36 target/4606: config.gcc refers to non-existant va-clipper.h Patrick.Mackinlay
01:30 Re: c++/4602: error message suggests use of typename in /usr/include/g++-3/stl_iterator.h ljrittle
01:16 c/4605: mips-tfile & spaced directory names Andrae.Behrens
00:05 Re: web/4599: gnats suggests sending to addresses that are restricted gerald

October 17, 2001
23:46 ada/4604: foo, yadda smcpeak
23:46 c/4603: ICE when mode attrib applied to fn return type smcpeak
23:43 Re: preprocessor/4600: gcc 2.95.2 dies after reporing source code errors neil
23:26 c++/4602: error message suggests use of typename in /usr/include/g++-3/stl_iterator.h magarwal
20:46 ada/4601: printf() arg checking doesn't work with merged strings dgillies
20:26 c/4600: gcc 2.95.2 dies after reporing source code errors admin
17:38 Re: web/4599: gnats suggests sending to addresses that are restricted Joseph S. Myers
16:09 Re: c++/4598 Paolo Carlini
15:36 web/4599: gnats suggests sending to addresses that are restricted sandra
15:36 c++/4598: "internal error #19990919" on duplicate constructor cbg
15:07 Re: bootstrap/3577 Sandra Wambold
14:48 Re: c++/4594: g++ warning with strings and threads Phil Edwards
14:38 Re: c++/4594: g++ warning with strings and threads ljrittle
13:56 c++/4597: Overload resolution involving using declarations is broken in g++ version 3.01. cameron
13:56 c/4596: GCC 3.0.1 optimization causes segmentation violation in executable Matt.Rhodes
13:34 Re: std::map fails if given bad hint in insert(iterator, value) Phil Edwards
13:08 std::map fails if given bad hint in insert(iterator, value) Trevor Spiteri
11:36 c++/4594: g++ warning with strings and threads ufm
11:16 c++/4592: ./../SrcShared/MetaMemory.cpp:428: Internal compiler error. alga
10:55 Re: libstdc++/4591: bug in Makefile generated in sparc-sun-solaris2.8/libstdc++-v3/include pme
09:00 Re: java/4295: Install problem for fastjar on Cygwin tromey
08:06 other/4591: bug in Makefile generated in sparc-sun-solaris2.8/libstdc++-v3/include alan.schwarzenberger
07:36 optimization/4590: GCC 3.0.1 can't do -O3 Gabor NemethI
07:21 Re: c++/3391: The compiler gives a Segmentation Fault when debug option is passed (-g) Kriang Lerdsuwanakij
06:42 Re: c++/4572: internal compiler error in mozilla 0.9.5 source Eric Buddington
02:25 Re: c++/4351 Harri Pasanen
00:56 c++/4588: bogus warning concerning bit field limits ben

October 16, 2001
23:56 c++/4587: g++ -maix64 generates illeagal assembler code hashikaw
20:56 libstdc++/4586: math headers not up to current standards not sure if still a prob in 3.0+ emt3734
15:38 Re: c++/4356: Exception handling does not work at all for NetBSD/i386 ELF target Richard Henderson
14:31 Re: c++/4356: Exception handling does not work at all for NetBSD/i386ELF target Krister Walfridsson
14:21 Re: x86-64 related patch breaks cygwin bootstrap Richard Henderson
14:07 Bootstrap problems w/ 3.0.1 on Solaris-2.8 (fully-patched) Auteria Wally Winzer Jr.
13:56 c++/4584: g++ 3.0.1 fails to allow access to member field address calvin.austin
13:53 Re: c++/4356: Exception handling does not work at all for NetBSD/i386 ELF target Richard Henderson
13:26 libgcj/4583: problems BigDecimal(double) ctor. apbianco
13:16 Re: gcc 3.0.2 prerelease; Solaris SPARC 2.7.1; Parse error Phil Edwards
12:40 gcc 3.0.2 prerelease; Solaris SPARC 2.7.1; Parse error mckelvey
10:56 Re: packing on arm Richard Earnshaw
10:45 packing on arm mike stump
08:27 Re: Another bootstrap failure on vax: TImodes John David Anglin
07:49 Re: x86-64 related patch breaks cygwin bootstrap Jan Hubicka
07:11 Re: Another bootstrap failure on vax: TImodes Jan Hubicka
05:49 Re: c++/3747 ambiguity between `T operator[](unsigned)` and `T* operator` Billinghurst, David (CRTS)
05:34 Re: c++/3830: compile error, if a class has operator[] and operator char*() billingd
05:31 Re: c++/3391: The compiler gives a Segmentation Fault when debug option is passed (-g) Rafael Jesus Alcantara Perez
05:31 Re: c++/4556: g++ reports an error for operator[] related conversions billingd
05:16 objc/4582: All objc tests fail on cygwin with gcc-3.1 (regression from 3.0) David.Billinghurst
02:45 Duplicate reports 3830, 4556 and 3747. Jan van Dijk
01:10 Re: No bootstrap on Solaris Martin Kahlert
01:06 bootstrap/4581: ICE in change_address_1, at emit-rtl.c:1757 ask
00:34 Re: other/4518: GCC 3.0 fails to install on win32/cygwin billingd

October 15, 2001
23:36 c/4580: internal compiler error - 8139too.c from linux kernel 2.4.12 brian
18:16 optimization/4579: MMX : : Optimazation does not work Daniel
18:16 optimization/4578: Bug Daniel Jungmann
14:25 Re: c++/4356: Exception handling does not work at all for NetBSD/i386ELF target Krister Walfridsson
12:49 Re: c++/4572: internal compiler error in mozilla 0.9.5 source rodrigc
12:44 Re: c/4575: internal error during 2.4.12 kernel compilation (8139too.c) rodrigc
12:16 c/4577: Internal error: Segmentation fault CharlesShuller
12:02 Re: java/1391: ICE on bogus this.OuterClass.method() construct mark
11:49 Re: java/2956: gcj does not terminate on invalid class definition mark
11:46 c/4576: empty attribute line causes gcc to segfault leitner
11:39 Re: libgcj/1685: class java.lang.ThreadLocal is missing mark
08:26 c++/4574: Internal compiler error in `expand_and', at expmed.c:4055 andreas.krakowczyk
08:26 c/4573: Test of NOT with Logical*1 inbetween (IEEE) fails andreas.krakowczyk
08:10 Re: c/4104: structure misalignment problem causing kernel failures rodrigc
07:26 c++/4572: internal compiler error in mozilla 0.9.5 source ebuddington
06:32 Re: c/4104: structure misalignment problem causing kernel failures Paul Clements
05:26 middle-end/4571: compiler segfault while processing java source olivier
04:18 Errors while porting for a new processor sivashankar nagappan
03:01 compiler segfault Olivier
02:09 Possible bug with gcc 3.0 and 3.0.1 on RedHat 7.0 Bill Bland
02:06 optimization/4570: error reading bytes from double variable philippe_ribet

October 14, 2001
23:32 Re: No bootstrap on Solaris Martin Kahlert
22:03 Re: fortran/4514: Internal compiler error in `calculate_giv_inc', at unroll.c:1604 billingd
15:29 Re: bootstrap/2639: genattrtab segv rodrigc
15:26 c++/4569: ICE on legal template code bitti
15:15 Re: bootstrap/3966: 'make bootstrap' fails when compiling gcc rodrigc
15:10 Re: bootstrap/3519: Compile error during build of libstdc++v3 rodrigc
15:06 Re: bootstrap/3517: duno probably glibc is mangled rodrigc
15:03 Re: bootstrap/1768: CVS bootstrap fails rodrigc
15:00 Re: libstdc++/3404: Re: [libstdc++/3052] 3.0 unresolved ref to sqrtf rodrigc
14:57 Re: libstdc++/1858: -fcheck-memory-usage cannot be used with basic_string<> rodrigc
14:55 Re: libstdc++/1658: -O0 -g -fcheck-memory-usage rodrigc
14:51 Re: c++/1729: Internal compiler error rodrigc
13:55 Re: libstdc++/4458 Martin Sebor
13:07 java/4568: static inner classes fails s.nicolas
09:22 Re: c++/4535: Internal compiler error (unknwn.h) rodrigc
08:15 Re: c/4566: gcc: Internal compiler error. neil
07:59 Re: gcc cvs bootstrup broken (libintl.h: No such file or directory) Richard Earnshaw
05:07 c/4566: gcc: Internal compiler error. yoda
03:47 optimization/4565: Internal compiler error in extract_insn, at recog.c:2218 at

October 13, 2001
22:55 Re: c/4519: make bzlilo rodrigc
22:45 Re: c/4488: Internal compiler error in extract_insn rodrigc
22:35 Re: c/4157: space missing in gcc-3.0.1/gcc/config/i386/cygwin.h rodrigc
22:31 Re: bootstrap/1719: make bootstrap fails in local-alloc.c for ns32k port rodrigc
22:30 Re: bootstrap/4300: File gthr-pthreads.h missing rodrigc
21:30 Re: c/4157 Christopher Faylor
21:20 Re: c/4531: Internal compiler error with linux/drivers/net/8139too.c from Linux 2.4.11 rodrigc
21:16 Re: c/4540: Bug founded compiling linux kernel 2.4.11 in file 8139too.c:2419 rodrigc
21:02 Re: c++/4530: Can't use #include <map> with map directory in include path rodrigc
20:53 Re: c/4104: structure misalignment problem causing kernel failures rodrigc
20:48 Re: c/4157 Craig Rodrigues
20:29 Re: c/4528: gcc produces an "Unrecognizable insn" internal error when compling the Linux kernel rodrigc
20:24 Re: c/4517: Gcc 3.0.1 failes compiling kernel 2.4.11 rodrigc
19:57 Re: c/4550: Internal compiler error rodrigc
19:52 Re: c++/4557: Compiler error. rodrigc
17:17 libstdc++/4563: [cygwin] `::acosf' undeclared (first use here) David.Billinghurst
17:14 Re: other/4562: [cygwin] Cannot install fastjar billingd
17:07 other/4562: [cygwin] Cannot install fastjar David.Billinghurst
16:57 libstdc++/4561: [cygwin] multiple definition of `std::__timepunct<char>::_M_put_helper David.Billinghurst
13:54 Bug report Dirk
11:33 Re: gcc cvs bootstrup broken (libintl.h: No such file or directory) Zack Weinberg
11:13 gcc cvs bootstrup broken (libintl.h: No such file or directory) Vladimir A Merzliakov
06:30 Re: c++/2809: ice on illegal template specialisation lerdsuwa
06:24 Re: c++/3391: The compiler gives a Segmentation Fault when debug option is passed (-g) lerdsuwa
04:00 Re: Internal compiler error in expand_end_loop, at stmt.c:2563 Gerald Pfeifer
03:57 middle-end/4560: C++: Internal compiler error in expand_end_loop, at stmt.c:2730 pfeifer

October 12, 2001
22:17 libstdc++/4559: failing make check -- huge memory usage karmak
17:47 c/4558: -Wall option waring for -2147483648 waratah
15:33 static variable placed in text section Wade Jensen
13:14 Re: No bootstrap on Solaris Jeff Sturm
12:51 Re: c/4529 (150 lines testcase) Ralf Berger
11:07 c++/4557: Compiler error. kcs6
09:34 Re: other/1537: Obvious typo in 2.95.3-test1 for mips-wrs-vxworks neil
09:31 gcc 2.7 and gcc 2.96 mikema
09:30 Re: c/805: gcc 2.95.2 reorders subexpressions of boolean operators neil
09:20 Re: c++/4512: New ICE in loop_iterations at unroll.c:3510, regression vs. 3.0.1 Diego Novillo
08:46 c++/4556: g++ reports an error for operator[] related conversions apataki
07:40 Re: No bootstrap on Solaris Martin Kahlert
05:03 Internal compiler error in eliminate_regs, at reload1.c:2571,w/minimal source file Jim Meyering
03:46 libstdc++/4554: Simple compile error under Solaris 8, works fine under Solaris 2.6 rhfreeman
03:46 c++/4553: Segmentation fault avolkov
02:25 Re: c++/3391 Rafael Jesus Alcantara Perez
02:07 Re: c++/4476: g++ does not parse the definition of friend function within a class properly nathan
01:36 c/4552: case statement "without range" causes gcc to quickly eat all memory david

October 11, 2001
23:59 Re: [Doxygen-users] Re: Behaviors of `gcc -E -C' Patrick Ohly
23:31 Re: Behaviors of `gcc -E -C' Neil Booth
20:55 Re: insn ICE with Linux 2.4.12 Josh McKinney
20:55 Re: c/4529 Luben Tuikov
20:48 Re: c/4529 Luben Tuikov
20:27 Re: Behaviors of `gcc -E -C' Zack Weinberg
20:16 c/4551: ICE in reg_overlap_mentioned_for_reload_p for sh-elf-gcc fnf
18:02 Re: c++/4547 George R. Goffe
17:48 Re: Fastjar extracts some file names incorrectly Bryce McKinlay
17:32 insn ICE with Linux 2.4.12 Risto A. Paju
16:46 c/4550: Internal compiler error twisti
15:43 Fastjar extracts some file names incorrectly Matthias Klose
14:16 c++/4549: inf. loop compiling bad code jdonner
14:12 Re: No bootstrap on Solaris Jeff Sturm
13:13 Re: array dimensions Toon Moene
12:26 libstdc++/4548: string::reserve method broken when shrinking bert hubert
12:04 Re: GCC Build for Power PC Geoff Keating
11:06 c++/4547: compile/assembly of cplus-dem.c fails; line 1433: error: unknown opcode ".subsection" george.goffe
10:46 c++/4546: g++ 2.95.4 ICE on Alpha at -O1 falk
09:19 Re: c++/4512: New ICE in loop_iterations at unroll.c:3510, regression vs. 3.0.1 Mark Mitchell
09:13 Hm, should I report this? Eric Sandeen
09:09 Re: c++/4535 Reichelt
09:08 Re: c++/4512: New ICE in loop_iterations at unroll.c:3510, regression vs. 3.0.1 Franz Sirl
09:03 Re: c++/4512: New ICE in loop_iterations at unroll.c:3510,regression vs. 3.0.1 Mark Mitchell
08:26 libstdc++/4545: basic_ostream op<< should set badbit, not failbit brendan
08:16 c++/4544: templates, friends, namespaces benko
08:16 libstdc++/4543: std_complex should give polar a default arg brendan
08:06 libstdc++/4542: _M_construct_name in locale_facets.tcc uses variable array size brendan
07:23 Re: c++/4512: New ICE in loop_iterations at unroll.c:3510, regressionvs. 3.0.1 Wolfgang Bangerth
07:16 libstdc++/4541: raw_storage_iterator::operator= should call _Construct, not construct brendan
07:16 c/4540: Bug founded compiling linux kernel 2.4.11 mono
07:16 libstdc++/4538: spurious semicolons in some headers brendan
07:16 libstdc++/4539: locale::combine should be const brendan
07:06 libstdc++/4537: reverse_iterator has a member called `current' available brendan
06:56 libstdc++/4536: ostream seekp & istream seekg should scope failbit brendan
06:46 c++/4535: Internal compiler error (unknwn.h) peter
06:32 insn problem (fwd) Andrea Barisani
06:31 insn problem Andrea Barisani
05:26 libstdc++/4534: vector<bool>::_M_range_check should throw out_of_range brendan
05:26 libstdc++/4533: mistaken assumption in find_first_not_of and find_last_not_of brendan
05:16 libstdc++/4532: typo in bits/stl_algo.h for partial_sort brendan
00:36 Re: No bootstrap on Solaris (is it a binutils problem?) Martin Kahlert

October 10, 2001
23:35 No bootstrap on Solaris Martin Kahlert
20:46 c++/4530: Can't use #include <map> with map directory in include path forsberg
16:49 Re: c++/4479: can't build under cygwin billingd
16:15 FW: Bug Report - Have anyone facd this before Nivethitha-Murugeson
16:06 objc/4527: Objc 3.0.1 segfaults on Linux i386 timo.savola
15:33 Re: c++/4351 Jessica Han
15:07 Re: libf2c/4521: libf2c shared library overflows command argument limits dje
14:35 Re: c++/4512: New ICE in loop_iterations at unroll.c:3510, regression vs. 3.0.1 sirl
13:56 Re: c++/1848: g++ cannot compile std::ostream_iterator<std::pair<int, int> > pme
13:46 Re: libstdc++/3593: link error when using ofstream pme
13:44 Re: libstdc++/3269: Inefficient stream output, one 'write' call per character pme
13:40 Re: libstdc++/4071: "make install" installs .../include/g++-v3/Makefile pme
13:33 Re: libstdc++/3528: Including iostream.h doesn't bring all referenced symbols into global scope. pme
11:59 Re: dwarf2 bug. Was Re: reorder bug in 3.0 Richard Henderson
11:26 c++/4526: ICE in g++ 3.0.1 when using typeof() as template parameter Raphael Poss
10:47 Re: dwarf2 bug. Was Re: reorder bug in 3.0 Andrew Macleod
10:16 c++/4525: Can't construct member function of class template with pointer to member as argument, if the argument type is constructed out of the template argument philipp.bachmann
10:06 c++/4524: member of const instance can be modifies via non-const pointer to member philipp.bachmann
09:58 Re: dwarf2 bug. Was Re: reorder bug in 3.0 Richard Henderson
09:26 libstdc++/4523: regression: struct in namespace containing an ifstream defined outside benko
08:36 libstdc++/4522: Improperly set eofbit in __copy_streambufs howes
08:34 Re: Compiling Ada - confused about nmake.{adb,ads} Florian Weimer
08:00 dwarf2 bug. Was Re: reorder bug in 3.0 Andrew Macleod
07:56 other/4520: cselib.c hash_rtx incorrectly hashes based on rtx address dje
07:56 libf2c/4521: libf2c shared library overflows command argument limits dje
06:45 RE: other/4518: GCC 3.0 fails to install on win32/cygwin Billinghurst, David (CRTS)
06:39 Compiling Ada - confused about nmake.{adb,ads} Billinghurst, David (CRTS)
06:26 other/4518: GCC 3.0 fails to install on win32/cygwin swbg20234
05:42 internat compiler error Erik Meusel
05:36 c/4517: Gcc 3.0.1 failes compiling kernel 2.4.11 connyosis
03:56 c/4516: sh-unknown-linux-gnu: big jump table NIIBE Yutaka
02:46 c++/4515: struct member not recognized although it exists and is accepted in a different context theo
01:51 Bootstrap problem on IA64 Thomas Hiller
01:18 Re: c/4513: Preprocessor appears broken for the '#' operator neil

October 09, 2001
20:46 fortran/4514: Internal compiler error in `calculate_giv_inc', at unroll.c:1604 ddb
18:56 c/4513: Preprocessor appears broken for the '#' operator dgillies
17:25 [BUGREPORT] gcc 3.1 Axel Siebenwirth
13:07 Re: reorder bug in 3.0 Andrew Macleod
11:22 Re: java/4510: Compiler seg fault on '(String) ((long) d + "d")' apbianco
08:45 Re: c++/4512: New ICE in loop_iterations at unroll.c:3510, regression vs. 3.0.1 sirl
08:26 c++/4512: New ICE in loop_iterations at unroll.c:3510, regression vs. 3.0.1 wolfgang.bangerth
08:19 Re: reorder bug in 3.0 Daniel Berlin
07:57 Re: reorder bug in 3.0 Andrew Macleod
07:48 Re: const bugs Kaveh R. Ghazi
05:16 c++/4511: Link option -shared-libgcc option REQUIRED on Solaris? david.keegan
04:35 Re: c++/4476: g++ does not parse the definition of friend function within a class properly nathan
02:52 Re: c++/4500 Reichelt
00:26 java/4510: Compiler seg fault on '(String) ((long) d + "d")' jsperri

October 08, 2001
23:45 Re: Is this a SPARC target bug ? Dan Nicolaescu
19:36 java/4509: gcj -C can generate dead bytecode tromey
18:24 Failure compiling langhooks.c on irix6.5 Billinghurst, David (CRTS)
17:23 Re: const bugs Martin Sebor
17:17 const bugs Richard Henderson
16:50 RE: 3.1 20011006 (experimental) (i686-unknown-sysv5UnixWare7.1.0) -O3 -g testsuite ICEs Billinghurst, David (CRTS)
16:46 c/4508: gcc 3.0, ARM/thumb target, generates invalid asm ted
16:14 Re: c++/4479 Christopher Faylor
15:56 Problem with preproccesor John Wiegley
15:41 SCSI commands Losasso, David M (Dave)
14:46 Re: bootstrap/4506: recursive error ljrittle
14:08 RE: c++/2892: array addresses corrupted when using template classes Joe Goyette
13:50 Re: error compiling gcc 3.01 Phil Edwards
13:44 Re: libgcj/4481: java.io.File.getParent not working properly tromey
13:43 Re: is this an error ?? Florian Weimer
13:39 Re: error compiling gcc 3.01 guerby
13:38 Re: java/4489: bytecode generation endless loop with certain switch() exprs tromey
13:32 Re: error compiling gcc 3.01 Phil Edwards
13:23 Re: web/4491: libstdc++-prs list archives gerald
13:08 Re: preprocessor/4353: gcc 2.96, 3.0 break -E -C define line comment processing neil
13:02 Re: reorder bug in 3.0 Mark Mitchell
12:26 c++/4507: __attribute__((stdcall)) is ignored on methods defined inside the class declaration malte.starostik
12:18 Re: Is CPP broken? (Re: Strange gcc error message) Zack Weinberg
12:12 Re: execute/20001024-1.c Richard Kenner
11:56 bootstrap/4506: recursive error dport113
11:37 Re: Is CPP broken? (Re: Strange gcc error message) Neil Booth
11:33 Re: java/3965: predecrement operator does not work correctly with array values (See PR# 3096) apbianco
11:31 Re: java/3803: buggy code generation apbianco
11:29 Re: java/3096: GCJ does not increment apbianco
11:27 Re: Is CPP broken? (Re: Strange gcc error message) Zack Weinberg
11:20 array dimensions onno
11:10 Re: Behaviors of `gcc -E -C' Neil Booth
10:52 Re: Is CPP broken? (Re: Strange gcc error message) Neil Booth
10:34 Re: reorder bug in 3.0 Andreas Schwab
10:22 is this an error ?? fabiosmoker
10:06 GCC optimization bug 4504 Basile STARYNKEVITCH
10:02 execute/20001024-1.c Richard Henderson
09:36 optimization/4504: C bug [compiler error] with -O -fvolatile (on x86 Linux) basile
09:36 Re: libstdc++/4499: during make, make install, make bootstrap rodrigc
09:07 Re: libstdc++/4502: c_strings test code is broken rodrigc
08:56 libstdc++/4503: __enc_traits destructor crashes if initialisation failed ben.hutchings
06:30 Re: optimization/4490 Reichelt
05:06 libstdc++/4502: c_strings test code is broken ben.hutchings
04:56 c++/4501: Function argument passed in wrong register ben.hutchings
04:50 Extern global variable and shared library. Hans van Leeuwen
04:46 c++/4500: Internal compiler error in add_abstract_origin_attribute Ulrich.Hagen
03:28 Re: c++/4479 David Abrahams
02:58 3.1 20011006 (experimental) (i686-unknown-sysv5UnixWare7.1.0) -O3 -gtestsuite ICEs rbrown64
01:34 Behaviors of `gcc -E -C' Roberto Bagnara

October 07, 2001
23:39 Re: bug report in gcc 2.96 Florian Weimer
23:23 Re: preprocessor/4492: cpp incorrectly omits whitespace in output (affects linux build) neil
21:55 Re: c++/4479: can't build under cygwin billingd
21:53 bug report in gcc 2.96 Nino Antonio Bozzi Alvarez
21:46 libstdc++/4499: during make, make install, make bootstrap jkolb
21:39 error compiling gcc 3.01 Jeremy Allen Kolb
15:16 c++/4498: Using "using" in a namespace with namespace as name (sort of infinite recursion ?!) fjolliton
14:16 c++/4497: Constructor initializer list and -g cause internal compiler error srevilak
13:23 Re: c++/2200: -finstrument-functions doesn't work with exceptions? rodrigc
12:58 Re: c++/4067: mysqlbinlog.cc:473: Internal compiler error. rodrigc
12:57 Re: libstdc++/3740: typo in ostringstream constructor rodrigc
12:54 Re: c++/2503: Fatal signal comiling map template using -g on AIX rodrigc
12:52 Re: c++/2200: -finstrument-functions doesn't work with exceptions? rodrigc
12:47 Re: c/4472: Failed to compile linux kernel version 2.4.10 rodrigc
12:35 Re: Is CPP broken? (Re: Strange gcc error message) Neil Booth
11:34 Re: Is CPP broken? (Re: Strange gcc error message) H . J . Lu
10:23 Re: Is CPP broken? (Re: Strange gcc error message) Neil Booth
10:04 Is CPP broken? (Re: Strange gcc error message) H . J . Lu
07:46 c/4496: Internal compiler version dkmaster
06:16 gcc 2.95.4 Internal Compiler Error. Debian powerpc pjordan
05:05 Re: c++/4444: internal compiler error on invalid syntax lerdsuwa
05:03 Re: c++/4425: parse error/scope resolution operator in template parameter lerdsuwa
04:56 c/4495: GCC fails with an ICE compiling a mixed C/asm function which uses the FPU on an x86 alex-sly
04:19 Re: c++/4447: c++ ICE (segfault in mangle.c). Regression from 2.95.x! lerdsuwa
01:16 c++/4494: Possible problem with compiler warnings on main() dgillies

October 06, 2001
18:46 c/4493: gcc-3.0.1 compilation blows off with "Segmentation fault" sv
12:07 0-size malloc in frame_init() Kaido Karner
10:16 Strange gcc error message H . J . Lu
08:56 preprocessor/4492: cpp incorrectly omits whitespace in output (affects linux build) paul.stoeber
06:06 web/4491: libstdc++-prs list archives Joseph Myers
04:16 Is this a SPARC target bug ? Toon Moene
03:46 optimization/4490: gcc 3.0.1 segfaults while compiling pack_isam.c of mysql georg

October 05, 2001
20:03 Re: java/4466: GCJ Segfault: ambiguous name confusion apbianco
19:56 java/4489: bytecode generation endless loop with certain switch() exprs apbianco
17:06 c/4488: Internal compiler error in extract_insn connyosis
15:46 optimization/4487: -ffast-math fails to disable gradual underflow on Ultrasparc Peter van Hoof
15:06 c++/4486: incorrect evaluation of boolean expressions mvishnu
14:02 Re: libgcj/4439: CNI: would be nice to be able to create Java array with 'new' Jeff Sturm
13:56 libgcj/4485: DecimalFormat not spec compliant tromey
13:11 cvs -co gcc-core checks out ADA Danny Smith
12:57 Re: reorder bug in 3.0 Richard Henderson
12:44 Re: Internal compiler error in expand_end_loop, at stmt.c:2563 Mark Mitchell
12:06 ada/4484: Ada: Dead store elimination and scalar "out" parameters fw
11:47 Re: c/4257 Reichelt
11:42 Re: c/3580: __attribute__((aligned(2))) on a char array typedef affects unrelated char arrays. jsm28
11:39 Re: c/3481: function attributes should apply to function pointers too jsm28
11:36 optimization/4483: powerpc, -O2, ICE (affects building linux kernel) paul.stoeber
11:35 Re: c/3964: typo in ginclude/stddef.h (__SIZE__TYPE__) jsm28
11:33 Re: c/4080: GCC 3.0.1 doesn't give proper warnings on C++ style declarations jsm28
11:26 Re: c/4374: rejects repetition of compatible typedefs jsm28
11:06 ada/4482: Ada: /tmp race condition fixed only partially fw
10:43 Duplicate symbol "std::__timepunct<char>::_M_put_helper(char*, unsigned, char const*, tm const*) const" John David Anglin
10:27 Re: libgcj/4439: CNI: would be nice to be able to create Java array with 'new' Tom Tromey
08:20 Re: gcc inline keyword & inline assembler bug (FreeBSD i386 c-code) Florian Weimer
08:11 Re: Internal compiler error in expand_end_loop, at stmt.c:2563 Jan Hubicka
07:56 libgcj/4481: java.io.File.getParent not working properly larocca
07:46 bootstrap/4480: after aboute 40 minutes "installing" gcc 3.0.1 chrashed suddenly. igorleal
06:48 gcc inline keyword & inline assembler bug (FreeBSD i386 c-code) Kristofer Sandlund
06:46 c++/4479: can't build under cygwin david.abrahams
05:26 ada/4478: Scope of use_package_clause is wrong fw
03:56 c++/4477: sizeof on nested class members doesn't compile roman.kagan
03:06 c++/4476: g++ does not parse the definition of friend function within a class properly martin
02:31 C++ bug in mainline? Martin Reinecke
02:09 Segmentation fault when using dynamic library and virtual methods with Gcc 2.95.2 Jacques.Herry
01:56 c/4475: -Wswitch option not functional tim.vanholder
01:26 c++/4474: ICE with __attribute__ reichelt
01:12 mysql compilation error ferran

October 04, 2001
23:43 Internal compiler error Shura
22:51 Re: reorder bug in 3.0 Mark Mitchell
19:26 error detection of ; syntax J Grant
19:24 Re: bootstrap/4468: make[1]: *** [all-target-libstdc++-v3] Error Phil Edwards
19:16 c/4472: GCC3.0.1 bug dreurich
19:06 Re: c/4465 Paul Clarke
18:51 Re: c++/3069: ICE in extract_insn, at recog.c:2172 rodrigc
18:45 Re: bootstrap/4032: i386-rtems 3.0-cvs regression rodrigc
18:39 Re: c/4228: Error in insn_default_length, at insn-attrtab.c:223 rodrigc
18:38 Re: c/4167: Internal compiler error in insn_default_length, at insn-attrtab.c:223 rodrigc
18:35 Re: c/3991: Internal compiler error in insn_default_length rodrigc
18:33 Re: optimization/4018: Internal compiler error in extract_insn, at recog.c:2218 rodrigc
18:32 Re: c/4415: Compiler fails with message "Internal compiler error in extract_insn, at recog.c:2218" rodrigc
18:27 Re: optimization/4018: Internal compiler error in extract_insn, at recog.c:2218 rodrigc
18:22 Re: c/4118: internal compiler error when compiling linux kernel rodrigc
18:21 Re: c/4090: ??? rodrigc
18:20 Re: c/128: gcc 2.95.2 doesn't fully zero-initialize character arrays jsm28
18:19 Re: c/4399: gcc fails to recognize insn rodrigc
18:18 Re: c/4287: what? rodrigc
18:08 Re: c++/4460: g++ 3.0.1 seg faults instead of throwing in a complicated inheritance hierarchy jsm28
18:07 Re: target/2676: Illegal loop instruction when using -O2 -march=k6 rodrigc
18:06 Re: other/3161: Release tarball issues jsm28
18:06 c/4471: Bad code generation on Solaris 8 by gcc 3.0.1 gchamber
18:04 Re: other/2774: Missing PRs jsm28
18:02 Re: optimization/3861: K6 optimization broken when compiling libstdc++-v3 rodrigc
17:59 Re: optimization/4054: ICE with "-O2 and -march=k6" on i686-pc-linux-gnu/gcc 3.1 rodrigc
17:57 Re: optimization/4081: "-O2 -march=k6" cflags are broken with gcc 3.0.1 rodrigc
17:54 Re: c/4091: gcc-3.0.1 produces error "" for linux-2.4.9 kernel rodrigc
17:52 Re: c/4112: linux kernel 2.4.9 acct.c + GCC 3.0.1 => internal compiler error rodrigc
17:50 Re: c/4169: problem with option "-march=k6" rodrigc
17:47 Re: c/4268: -march=k6, Linux kernel 2.4.9, ICE in insn_default_length, at insn-attrtab.c:223 rodrigc
17:45 Re: c/4199: GCC 3.0.1, Linux 2.4.9, error with -march=k6 rodrigc
17:39 Re: c/4333: ICE on linux kernel rodrigc
17:36 Re: bootstrap/4349: gcc failed to bootstrap for k6-linux rodrigc
17:33 Re: optimization/4413: GCC 3.0.2 prerelease internal error when compiling linux-2.4.10 rodrigc
17:30 Re: optimization/4432: ICE when using -march=k6 -O2 rodrigc
15:49 Re: libstdc++/4470: Thousands of seeks per read from cin ljrittle
15:35 Re: bootstrap/4468: make[1]: *** [all-target-libstdc++-v3] Error ljrittle
15:12 Re: bootstrap/4422: stage1/xgcc:No such file or directory ljrittle
13:37 exception unwinding on MIPS and vxWorks Ken Faiczak
13:17 Re: libstdc++/4418: License is unclear pme
12:56 libstdc++/4470: Thousands of seeks per read from cin kw+gnats
12:51 Re: Severe problems running the g77 test suite on the main line Toon Moene
11:16 bootstrap/4469: bootstrap fails in config for libstdc++-v3; using gcc-3.0 but config says use gcc-3.0 george.goffe
11:06 bootstrap/4468: make[1]: *** [all-target-libstdc++-v3] Error bid
09:52 Miscompilation of Portable.NET release 0.18 glenn.chambers
09:26 Re: c++/4373 Golubev I. N.
06:43 reorder bug in 3.0 Andrew Macleod
05:04 Re: x86-64 related patch breaks cygwin bootstrap Jan Hubicka
04:51 Re: Internal compiler error in expand_end_loop, at stmt.c:2563 Jan Hubicka
02:44 initialization of non-integral member constants John Belmonte
02:01 Re: Severe problems running the g77 test suite on the main line Toon Moene
01:24 x86-64 related patch breaks cygwin bootstrap Billinghurst, David (CRTS)

October 03, 2001
23:46 java/4466: GCJ Segfault: ambiguous name confusion bryce
23:46 java/4467: Ambiguous name resolution problem bryce
22:36 c/4465: Segementation fault with h8300-hms-gcc paulc
20:49 RE: 3.0 branch: wrong CFLAGS for gen* Billinghurst, David (CRTS)
18:26 c++/4464: cpp dan
18:11 Re: Severe problems running the g77 test suite on the main line Peter Schmid
13:46 Re: Severe problems running the g77 test suite on the main line Toon Moene
13:31 internal compiation error with gcc 3.0.1 Joachim Schwender
12:30 REG_WAS_0 labels are wrong after bbro pass John David Anglin
11:56 debug/4461: Invalid dawrf2 debug code schwab
11:36 c++/4459: g++ 3.0.1 resolves to wrong const overload when using access adjustment yoder
10:57 Severe problems running the g77 test suite on the main line Peter Schmid
10:26 libstdc++/4458: std::ctype<char>::is doesn't call do_is as required by ISO 14882 kanze
10:16 libstdc++/4457: std::ctype< char >::is gives random results for chars with bit 7 set kanze
10:16 libstdc++/4456: Regression error in <locale.h> kanze
09:40 Re: Errors in the <locale> standard library (involving the ctype facet) Benjamin Kosnik
08:07 Re: libgcj/4439: CNI: would be nice to be able to create Java arraywith 'new' Jeff Sturm
07:25 Re: libgcj/4439: CNI: would be nice to be able to create Java array with 'new' Tom Tromey
07:16 libstdc++/4455: HP-UX - libstdc++.sl depends on libgcc.a david.keegan
06:56 c/4454: Suboptimal schedule following unroll of "reversed" loops in gcc gheorghe
06:15 Re: Internal compiler error in expand_end_loop, at stmt.c:2563 Gerald Pfeifer
04:35 Re: New libjava bootstrap failure: set_mem_alias_set() Richard Kenner
03:36 Errors in the <locale> standard library (involving the ctype facet) James.Kanze
03:33 Bug-Report Muehlebach Stefan
02:46 c++/4453: ICE (Tree check) when instantiating template containing HUGE_VAL Sylvain.Pion
00:06 optimization/4452: Internal compiler error.. pablo

October 02, 2001
23:09 Re: 3.0 bootstrap broken on irix6.5 Alexandre Oliva
23:01 Erroneous code using anonymous variables and constructors. Ludovic WALLE
22:46 Re: libgcj/4439: CNI: would be nice to be able to create Java array with 'new' Bryce McKinlay
22:35 Re: c/4445: Compilation of a C program fails aoliva
22:30 Re: c++/4440: Build of ddd-3.2.1 aoliva
22:24 Re: c++/4437: nested template and defines cause compiler seg fault aoliva
22:19 Re: c/4317: main() {return 0;} does not compile correctly aoliva
22:11 Re: libgcj/4439: CNI: would be nice to be able to create Java array with 'new' Bryce McKinlay
21:54 Re: libgcj/4439: CNI: would be nice to be able to create Java array with 'new' Ashley Yakeley
20:31 New libjava bootstrap failure: set_mem_alias_set() Bryce McKinlay
20:15 Re: libgcj/4439: CNI: would be nice to be able to create Java array with 'new' bryce
19:11 Re: Problem with operator Anjan Goswami
17:46 other/4451: install failed: Java install incorrect arthur_i_schwarz
17:36 other/4450: make install failed: /usr/include/win32api/windef.h redefined BOOL arthur_i_schwarz
17:35 Re: c++/4447: c++ ICE (segfault in mangle.c). Regression from 2.95.x! Joe Buck
17:26 bootstrap/4448: make bootstrap failed: gthr-win32.h erroneous arthur_i_schwarz
17:26 debug/4449: -fdump-translation-unit does not work Costin Iancu
16:16 c++/4447: c++ ICE (segfault in mangle.c). Regression from 2.95.x! jbuck
15:36 c++/4446: Internal crash using rtti on type 'double[][]' during compilation ayqazi
15:16 c/4445: Compilation of a C program fails santoshpendap
15:06 c++/4444: internal compiler error on invalid syntax tgke
14:48 Re: libstdc++/4435: Object file has undefined basic_string symbol as local. pme
14:36 Re: other/4441: can´t build "execvp: true: Permission denied" pme
13:38 Re: libstdc++/4442: bad fstream behavior pme
12:10 Re: Problem with operator Nathan Sidwell
11:56 libstdc++/4442: bad fstream behavior <synopsis of the problem (one line)> Andrew Haydn Grant
11:45 problem compiling MPlayer with gcc-3.0.1 Guillaume Rousse
11:29 gcc-3.0.1 Internal error: Segmentation fault nbecker
11:26 other/4441: can´t build "execvp: true: Permission denied" nwerneck
10:12 gcc version 3.0.1 Optimization bug under AIX 4.3.3 with -O2 -mcpu=604e options Damien Thibaud
06:23 gcc-3.0.1 Internal error: Segmentation fault nbecker
02:47 3.1 20010923 bootstrap comparison failure on rs6000-ibm-aix4.2.0.0 rbrown64
02:36 Re: Problems with shared libf2c Toon Moene
02:25 SH-LINUX: CC1 core dumps when compiling libf2c/libI77/wref.c (3.0.x) NIIBE Yutaka
01:33 Re: 3.0 bootstrap broken on irix6.5 Loren James Rittle
00:45 3.0 bootstrap broken on irix6.5 Billinghurst, David (CRTS)
00:31 Problems with shared libf2c Billinghurst, David (CRTS)
00:16 c++/4440: Build of ddd-3.2.1 nick_sam

October 01, 2001
23:16 c++/4439: extern "Java" support: Can't create array of primitive Java type with 'new' ashley
19:23 Re: bootstrap/4422: stage1/xgcc:No such file or directory ljrittle
18:26 c/4438: rect.c:370: Internal compiler error in change_address, at emit-rtl.c:1635 dkossack
14:19 A bug of gcc 3.0.1 with "-march=k6" Francesco Abbate
14:18 Re: bootstrap/4422: stage1/xgcc:No such file or directory ljrittle
14:09 gcc 2.95 (2,3) (freebsd 4.4) and squid optimization Nicolas Dehaine
12:56 c++/4437: nested template and defines cause compiler seg fault sallen
12:52 Re: Possible miscompilation of vim-6.0 with gcc 3.0.1 Groege Garvey
11:42 Possible miscompilation of vim-6.0 with gcc 3.0.1 Lawrence Gold
11:16 c++/4436: const_reverse_iterator rend()const; tyler
09:01 Re: c/4317: main() {return 0;} does not compile correctly Steffen Ryll
08:56 libstdc++/4435: undefined or misdefined symbol george
07:36 RE: debug/4350: Internal compiler error in `output_die', at dwarf2out.c:5433 Orion Poplawski
06:16 c++/4434: the value of float epsilon is wrong nejataydin
05:16 libstdc++/4433: strstream::{tellp,seekp} fail. ymedini
04:59 Re: c/3680: gcc 3.0 for mc68hc12 crashes when compiling libgcc2.c(__muldi3) ciceron
04:52 Re: bootstrap/2298: m68hc12 bootstrap ICEs ciceron
02:36 optimization/4432: ICE when using -march=k6 -O2 reichelt
01:01 Re: c++/4342 Lanzi Danilo
00:22 Re: Internal compiler error in eliminate_regs, at reload1.c:2580 [Re:can't build usable emacs/src/Makefile with recent gcc snapshots Eli Zaretskii


Indexes: [Date Index] [Subject Index] [Author Index] [Thread Index]
Site Nav: [Browse other archives for this mailing list]
[Browse other mailing lists at this site]
Search: Limit to:

Mail converted by MHonArc 2.4.9