gcc-bugs archive
date index for May, 2001

This is the mail archive of the gcc-bugs@gcc.gnu.org mailing list for the GCC project.

Indexes: [Date Index] [Subject Index] [Author Index] [Thread Index]
Site Nav: [Browse other archives for this mailing list]
[Browse other mailing lists at this site]
Search: Limit to:

May 31, 2001
22:26 target/3023: Failure of test gcc.dg/asm-fs-1.c on cygwin David.Billinghurst
21:56 c++/3021: Missing attachment from report c++/3020 mps
21:16 c++/3020: using operator-> within the class that defines it mps
17:38 re: c++/3008 - Test g++.dg/mangle1.C fails for irix6.5 -mabi=64 Billinghurst, David (CRTS)
16:06 c++/3019: Failure to "make" rbe
16:03 RE: [IRIX 6.2] Bootstrap failure when N64 libc isn't installed Billinghurst, David (CRTS)
15:47 Please close PR other/1737: Parallel make error with cygwin Billinghurst, David (CRTS)
15:39 Re: objc/2902: collect2 doesn't ...: libtool should use collect2? John David Anglin
15:06 libstdc++/3018: bug in std_bitset.h for bitset<>::test method brendan
15:06 libstdc++/3017: locale_facets.h is missing some methods brendan
14:56 libstdc++/3016: stl_queue.h bugs wrt compliance brendan
14:26 c++/3015: Internal compiler error on illegal code gjkaiser
13:40 [Solaris 8/Intel] Bootstrap failure with sjlj exceptions (take 2) Rainer Orth
13:15 Re: cannot convert `int (*)()' to `void*' in initialization - should not be an error DJ Delorie
12:54 Re: cannot convert `int (*)()' to `void*' in initialization - should not be an error Gabriel Dos Reis
12:50 Re: '0514 libstdc++ fails building powerpc/limitsMEMBERS.cc on rs6000-ibm-aix4.2.0.0 Gabriel Dos Reis
12:13 Re: cannot convert `int (*)()' to `void*' in initialization - should not be an error Carlo Wood
11:57 [Solaris 8/Intel] Bootstrap failure with sjlj exceptions Rainer Orth
11:49 Re: '0514 libstdc++ fails building powerpc/limitsMEMBERS.cc on rs6000-ibm-aix4.2.0.0 Benjamin Kosnik
11:43 [IRIX 6.2] Failed to bootstrap mips-sgi-irix5.3 configuration Rainer Orth
10:31 Re: cannot convert `int (*)()' to `void*' in initialization - should not be an error Gabriel Dos Reis
10:16 c++/3014: gcc3: cin problems with solaris 5.8 and >> extractors wavexx
10:16 c++/3013: templated inline function not inlined buschelm
08:26 c++/3012: c++ bug Robert B. Lowrie
07:56 c++/3011: g++ 2.95.3 hangs forever on syntactically eroneous code mtodorov
06:18 Re: cannot convert `int (*)()' to `void*' in initialization - should not be an error Alexandre Oliva
05:29 cannot convert `int (*)()' to `void*' in initialization - should not be an error Stuehlmeyer, Wolfgang
05:21 [IRIX 6.2] Bootstrap failure when N64 libc isn't installed Rainer Orth
02:44 how to remove the warning Sunil.M
00:05 Re: Failure of test gcc.dg/asm-fs-1.c on cygwin Alexandre Oliva

May 30, 2001
23:55 Failure of test gcc.dg/asm-fs-1.c on cygwin Billinghurst, David (CRTS)
19:56 Re: '0514 libstdc++ fails building powerpc/limitsMEMBERS.cc onrs6000-ibm-aix4.2.0.0 rbrown64
19:28 Re: exception bug shown by purify Alexandre Oliva
18:47 Re: need help Andrew Pinski
18:13 Re: need help Alexandre Oliva
17:36 other/3010: ld:libgcc.map: file format not recognized; treating as linker script george.goffe
17:06 c++/3009: Wrong name lookup in template zhegulev
16:06 c++/3008: Test g++.dg/mangle1.C fails for irix6.5 -mabi=64 David.Billinghurst
14:16 c++/3007: impossibility to discard "virtual" and/or to get to know, for which class(not instance) the method, currently being executed, has been called kaufman
13:36 c++/3006: bad code for complicated virtual inheritance (regression from 2.95) snyder
10:46 c++/3005: improper evaluation of mixed mode expressions involving long long mvishnu
09:26 c++/3004: g++ internal compiler error on "class Foo::Bar::Baz::Ptr" tjic
08:36 need help bala kumar
08:16 c++/3002: internal compiler error on ia64 itanium for orbacus 3. Theodore.E.Kubaska
08:16 c/3003: Incorrect coding in file gcc/cpphash.c Andreas.Krakowczyk
07:46 c/3001: option -fprofile-arcs does not work with my powerpc-linux-gcc haverkam
06:34 Re: GCC 3.0 branch: cc1plus: warning: -fvtable-thunks is no longer supported Tom Tromey
06:28 make check problem Theodore Papadopoulo
06:26 bootstrap problem for solaris2.6 Theodore Papadopoulo
04:36 libgcj/2999: Compilation error preverdy
00:51 exception bug shown by purify Jack LENZ
00:36 other/2998: "function.c: 7030: missing #endif" when building for SunOS 4.1.4 vannoy
00:25 inquiry Prem Kumar S (OCS-BLRHO-BMR)

May 29, 2001
23:42 RE: Failure of test g++.dg/mangle.C on cygwin. Billinghurst, David (CRTS)
22:36 libstdc++/2997: size_t missing std:: in bitset.cc theonetruekenny
22:30 Re: Failure of test g++.dg/mangle.C on cygwin. Zack Weinberg
21:28 Failure of test g++.dg/mangle.C on cygwin. Billinghurst, David (CRTS)
18:41 Re: Unsaved register? Erik Walthinsen
18:32 Re: Unsaved register? Geoff Keating
18:31 Re: Unsaved register? Michael Meissner
17:11 Re: Unsaved register? Erik Walthinsen
17:07 Re: Unsaved register? Michael Meissner
16:56 Re: Unsaved register? Erik Walthinsen
16:51 Re: Unsaved register? Michael Meissner
16:21 Re: Unsaved register? Erik Walthinsen
15:59 Re: Unsaved register? Geoff Keating
15:39 Unsaved register? Erik Walthinsen
14:28 Re: Cannot bootstrap irix6.5 with --enable-threads=posix Loren James Rittle
13:54 Re: ARM error with glibc (Illegal value for co-processor offset) Philip Blundell
13:49 ARM error with glibc (Illegal value for co-processor offset) Rod Stewart
12:46 c++/2996: Internal compiler error on typecast (T[][]...) tom
11:06 c/2995: __complex__ int typecasts maybe broken ee96090
10:37 Potential bug ? Theodore Papadopoulo
09:16 c++/2994: enum type may be defined but not DECLARED bertram.scharpf
09:16 c++/2993: confusing constants and const integers produces ICE bertram.scharpf
07:26 libstdc++/2992: 3.0: string functions not always accessible tot
06:26 other/2991: Bootstrap error (Forbidden identifiers: sparc sun unix) ask
06:16 c++/2990: Internal compiler error with member templates with syntax error bitti
05:56 libstdc++/2989: libstdc++ breaks compilation of strcpy dmuell
05:46 Fwd: Re: c++/2988: Incorrect error on assignment of const char[] to char * Richard Smith
05:16 c++/2988: Incorrect error on assignment of const char[] to char * ros
02:53 Internal compiler error Andrey Korotchenko A.
01:20 Re: alpha -> ppc cross compiler Simon A Watts
00:46 c/2987: gcc 3.0 0526 fails to build on mips rmurray
00:16 c++/2986: __builtin_frame_address broken for MIPS ronald.fischer.gp

May 28, 2001
19:08 Re: objc/2902: collect2 doesn't ...: libtool should use collect2? Alexandre Oliva
18:24 Re: error messages in windows Alexandre Oliva
17:58 error messages in windows Jonathan Milenko
15:18 arm failure in g++.other/eh2.C Philip Blundell
15:12 Re: objc/2902: collect2 doesn't ...: libtool should use collect2? John David Anglin
14:56 libstdc++/2985: inserter and extractor for std::complex can only be used on simple streams. theonetruekenny
14:32 Re: objc/2902: collect2 doesn't ...: libtool should use collect2? Alexandre Oliva
13:16 debug/2984: File name information is incorrect in debug output neil
13:00 Re: gcc i370 Alexandre Oliva
12:56 Re: gcc 3.0 missing __dso_handle in libstdc++ Alexandre Oliva
12:56 c++/2983: ICE on omission of colon before member initialiser list djeverett
12:56 c++/2982: ICE on omission of colon before member initialiser list djeverett
12:56 c++/2981: ICE on omission of colon before member initialiser list djeverett
12:56 c++/2980: ICE on omission of colon before member initialiser list djeverett
08:26 c/2979: Resulting prog crashes with segmentation fault galli
08:16 c/2978: won't compile wspivak
07:36 bug 2975, eh and renumber_insns Nathan Sidwell
06:19 snapshot 20010514: dllexport and C++ constructors Eberhard Mattes
06:15 [Solaris 8/Intel] Bootstrap failure compiling unwind-dw2.c Rainer Orth
05:54 xgcc internal error Fausto Saporito
05:33 gcc i370 Fausto Saporito
05:09 Re: gcc 3.0 missing __dso_handle in libstdc++ Artem Khodush
04:17 GNATS web submissions Nathan Sidwell
03:46 Re: GCC 3.0 branch: cc1plus: warning: -fvtable-thunks is no longer supported Carlo Wood
03:41 Re: c++/2957: -pedantic: parse error Artem Khodush
00:57 GCC 3.0 branch: cc1plus: warning: -fvtable-thunks is no longer supported Andreas Jaeger

May 27, 2001
23:05 Re: c++/2975: Compiler segfaults compiling Qt 2.3.0 RDBrown
22:13 Re: objc/2902: collect2 doesn't ...: libtool should use collect2? John David Anglin
22:06 libstdc++/2977: string.h doesn't always inject names into std:: snyder
21:56 libstdc++/2976: problem with compiling std::getline snyder
20:20 Re: objc/2902: collect2 doesn't ...: libtool should use collect2? Alexandre Oliva
19:59 Re: Bug with -Wall? (2.95.3) Alexandre Oliva
19:05 Re: BUG!! gcc-2.95.3 (`__builtin_va_alist' undeclared in snprintf()) on Solaris-2.5.1 Auteria Wally Winzer Jr.
18:49 Re: 3.0 sparc-sun-solaris2.8 Regression: c_math.cc Now Fails Jeffrey Oldham
18:11 Re: BUG!! gcc-2.95.3 (`__builtin_va_alist' undeclared in snprintf()) on Solaris-2.5.1 Auteria Wally Winzer Jr.
17:52 Re: RFA: c99-printf-1.c Modify Warning Messages Joseph S. Myers
17:40 RFA: c99-printf-1.c Modify Warning Messages Jeffrey Oldham
16:35 Bug with -Wall? (2.95.3) Tom Browder
16:18 Re: gcc 3.0 missing __dso_handle in libstdc++ Andi Kleen
15:42 A bug with exceptions and threads Iggy Veresov
15:03 Re: cygwin g++: undefined reference to `___deregister_frame_info_base s' Christopher Faylor
13:20 Re: gcc 3.0 missing __dso_handle in libstdc++ Alexandre Oliva
13:17 Re: BUG!! gcc-2.95.3 (`__builtin_va_alist' undeclared in snprintf()) on Solaris-2.5.1 Alexandre Oliva
13:06 c++/2975: Compiler segfaults compiling Qt 2.3.0 ral
11:24 Re: Bootstrap failure: fixtests.c fails to compile on solaris2 Bruce Korb
11:15 Re: Bootstrap failure: fixtests.c fails to compile on solaris2 Bruce Korb
09:56 java/2974: libgcj doesn't build for newlib targets (no sigaction function) green
09:56 java/2973: libgcj doesn't build on systems with no libffi port green
08:23 Bootstrap failure: fixtests.c fails to compile on solaris2 Kaveh R. Ghazi
04:56 c++/2972: Uninitialized member variables are not default initialized pere
03:26 debug/2971: Type of variable is wrong in dwarf2 debugging info kettenis
02:59 gcc 3.0 missing __dso_handle in libstdc++ Andi Kleen
02:35 cygwin g++: undefined reference to `___deregister_frame_info_bases' Billinghurst, David (CRTS)
02:04 Re: 3.0 sparc-sun-solaris2.8 Regression: c_math.cc Now Fails Gabriel Dos Reis

May 26, 2001
22:36 libstdc++/2970: complex inserter with extraneous 'ends' theonetruekenny
21:46 c++/2969: minor bug sektor
18:20 undefined symbol error in unwind2-dw2-fde.c Mark E.
17:53 Re: 3.0 sparc-sun-solaris2.8 Regression: c_math.cc Now Fails Carlo Wood
17:50 Re: BUG!! gcc-2.95.3 (`__builtin_va_alist' undeclared in snprintf()) on Solaris-2.5.1 Auteria Wally Winzer Jr.
17:46 optimization/2967: gcc-2.95.4 hits internal error on the Hurd source with -O3 marcus
17:38 Re: BUG!! gcc-2.95.3 (`__builtin_va_alist' undeclared in snprintf()) on Solaris-2.5.1 Carlo Wood
16:33 Re: target/2878: ARM: cannot use 3.0 to build stage 1 of bootstrap; bad code generated at -O0? Philip Blundell
16:24 Re: c++/1651 Large number of irix6.5/-mabi=64 testsuite failures Toon Moene
16:22 Re: other/2539 contrib/test_summary reports wrong version Toon Moene
16:18 Cannot bootstrap irix6.5 with --enable-threads=posix Billinghurst, David (CRTS)
16:13 re: other/2539 contrib/test_summary reports wrong version Billinghurst, David (CRTS)
16:13 re: c++/1651 Large number of irix6.5/-mabi=64 testsuite failures Billinghurst, David (CRTS)
15:02 3.0 sparc-sun-solaris2.8 Regression: c_math.cc Now Fails Jeffrey Oldham
14:20 Re: BUG!! gcc-2.95.3 (`__builtin_va_alist' undeclared in snprintf()) on Solaris-2.5.1 Auteria Wally Winzer Jr.
13:32 Re: BUG!! gcc-2.95.3 (`__builtin_va_alist' undeclared in snprintf()) on Solaris-2.5.1 Auteria Wally Winzer Jr.
13:00 Re: BUG!! gcc-2.95.3 (`__builtin_va_alist' undeclared in snprintf()) on Solaris-2.5.1 Auteria Wally Winzer Jr.
11:47 Re: BUG!! gcc-2.95.3 (`__builtin_va_alist' undeclared in snprintf()) on Solaris-2.5.1 Martin Sebor
11:46 optimization/2963: Pointless moving (optimization) Matthias Klose
11:46 optimization/2962: unnecessary instruction cwtl Matthias Klose
11:36 optimization/2960: Duplicate loop conditions even with -Os Matthias Klose
11:26 java/2959: gcj-3.0 does not know that interface members are public by default Matthias Klose
11:16 c++/2957: -pedantic: parse error Matthias Klose
08:56 java/2956: gcj does not terminate on invalid class definition mark
06:06 Re: BUG!! gcc-2.95.3 (`__builtin_va_alist' undeclared in snprintf()) on Solaris-2.5.1 Carlo Wood
05:26 java/2955: target configure-target-boehm-gc do not compile pere
03:06 preprocessor/2954: gcc -MM dir/file.c produces incorrect dependency rickr
02:40 BUG!! gcc-2.95.3 (`__builtin_va_alist' undeclared in snprintf()) on Solaris-2.5.1 Auteria Wally Winzer Jr.
01:52 Re: fixincl.x is older than prerequisite inclhack.def Michael Elizabeth Chastain
01:46 java/2953: ICE in inner class constructor. apbianco
00:50 Re: fixincl.x is older than prerequisite inclhack.def Alexandre Oliva
00:25 fixincl.x is older than prerequisite inclhack.def Michael Elizabeth Chastain

May 25, 2001
23:36 2.95.2 compiler bug on SGI IRIX 6.5 Charlie Zender
20:56 Possible Bug In Gcc Prerelease While Build KDELibs Luke Mauldin
20:16 Re: Compilation problems w/ 2.95.3 on Sun Solaris 2.5.1 (fully patched) Alexandre Oliva
20:15 Re: PATCH: sh-elf - only call __setup_argv_and_call_main if host OS exists Alexandre Oliva
18:36 c++/2952: ICE while compiling ddd-3.3-1mdk.src.rpm ryants
18:06 c/2951: --target=sh-elf fails to build due to missing patch tm2
17:53 SH-ELF: shift_cost[] indexed incorrectly and RTX_COST problems Toshi Morita
17:23 Re: PATCH: sh-elf - only call __setup_argv_and_call_main if host OS exists Toshi Morita
16:29 Re: Compilation problems w/ 2.95.3 on Sun Solaris 2.5.1 (fully patched) Auteria Wally Winzer Jr.
15:46 c++/2949: incorrect Koenig lookup of friend functions Jens.Maurer
15:46 preprocessor/2950: different behaviour directly to C++ vs. saving -E output sean
15:28 Re: sh-elf build failure: missing __setup_argv_and_call_main Toshi Morita
15:16 preprocessor/2948: different behaviour directly to C++ vs. saving -E output sean
15:16 preprocessor/2947: different behaviour directly to C++ vs. saving -E output sean
14:56 preprocessor/2946: different behaviour directly to C++ vs. saving -E output sean
14:51 Re: sh-elf build failure: missing __setup_argv_and_call_main Toshi Morita
14:37 %= for labels in asm blocks Kevin Ryde
14:32 Re: make error question Alexandre Oliva
14:29 Re: sh-elf build failure: missing __setup_argv_and_call_main Alexandre Oliva
14:25 Re: invalid jumps into binding contour??? Alexandre Oliva
14:05 Re: alpha -> ppc cross compiler Alexandre Oliva
13:56 libobjc/2945: xgcc: Internal compiler error: program cc1obj got fatal signal 11 audard
12:26 c++/2944: gcc 2.95.3 internal compiler error on koffice kabrianis
12:06 Re: objc/2902: collect2 doesn't ...: libtool should use collect2? John David Anglin
11:52 g++ differences compiled directly vs. compiled 2 steps with -E Sean McNeil
11:51 Re: objc/2902: collect2 doesn't ...: libtool should use collect2? John David Anglin
11:49 Re: PATCH for PR 2828: Testers needed! Philip Blundell
11:47 A bug with exceptions and threads in mainline compiler Iggy Veresov
08:10 Re: other/2857: i18n, translations does not work Zack Weinberg
08:04 Re: other/2857: i18n, translations does not work Zack Weinberg
07:06 preprocessor/2941: gcc/preprocessor bug Rolf Schaeuble
06:16 objc/2940: Installation problem with libgcc_s.so candida
05:57 3.0 bootstrap broken on sparc-sun-solaris2.7 Nathan Sidwell
04:26 c/2939: compiler crashes on nested functions returning variable size structures candida
04:13 RE: alpha -> ppc cross compiler David Korn
03:56 optimization/2938: [Regression vs 2.95] Optimization with -O1 causes near infinite time wolfgang.bangerth
03:56 Re: alpha -> ppc cross compiler Simon A Watts
03:36 Re: objc/2902: collect2 doesn't ...: libtool should use collect2? Nicola Pero
03:17 Re: other/2857: i18n, translations does not work Joseph S. Myers
03:16 c++/2937: Simple C++ programs do not link: undefined reference to `std::strchr(char const*, int)' us
03:13 RE: alpha -> ppc cross compiler David Korn
03:00 Re: other/2857: i18n, translations does not work Philipp Thomas
02:51 Re: other/2857: i18n, translations does not work Joseph S. Myers
02:50 Re: GCC 3.0: Bootstrap failure with current sources on powerpc-linux Andreas Jaeger
02:45 Re: other/2857: i18n, translations does not work Philipp Thomas
02:41 Re: other/2857: i18n, translations does not work Philipp Thomas
02:36 Re: other/2857: i18n, translations does not work Philipp Thomas
02:32 GCC 3.0: Bootstrap failure with current sources on powerpc-linux Andrew Haley
01:34 Re: alpha -> ppc cross compiler Simon A Watts
01:27 /target:458:alpha-dec-osf4: Denormal numbers work with -mieee rbrown64
01:16 c++/2935: internal compiler error gcc deepblur
00:17 Re: GNU ObjC runtime bug. Ovidiu Predescu
00:16 c/2934: error while compiling the kernel 2.4 on linux redhat 7.0 rshukla

May 24, 2001
20:36 c++/2933: GCC reports 'internal compiler error' (getting address of static template function) viisi
19:33 RE: LAPACK results for cygwin - one problem Billinghurst, David (CRTS)
18:47 make error question Gabriel Alvarez
16:56 libstdc++/2932: new operator segfaults for arrays using pthreads on hpux rob.renfrew
16:46 other/2931: Link errors (undef. __gxx_personality_v0) during libstdc++-v3/configure pcarlini
16:16 other/2930: Failure to compile/link when check_stack rule defined pauli
15:50 Re: objc/2902: collect2 doesn't ...: libtool should use collect2? John David Anglin
15:09 Re: [3.0 regression] File naming confusion Benjamin Kosnik
14:43 Re: [3.0 regression] File naming confusion Neil Booth
12:56 preprocessor/2928: out of memory during macros expansion yann.droneaud
12:08 sh-elf build failure: missing __setup_argv_and_call_main Toshi Morita
11:58 SH-ELF target build failure; missing ___setup_argv_and_call_main Toshi Morita
11:30 Re: h8300-hms: build failure Toshi Morita
10:36 optimization/2927: gcc build of xemacs 21.1.14 core dumps with -O3 but not with -O2 pdl
10:16 Re: other/2857: i18n, translations does not work Zack Weinberg
09:44 RE: alpha -> ppc cross compiler David Korn
09:38 Re: alpha -> ppc cross compiler Simon A Watts
09:30 Re: other/2857: i18n, translations does not work Joseph S. Myers
09:26 __deregister_frame_info_bases, and shared libgcc_s -> broken glibc Andreas Jaeger
09:22 Re: other/2857: i18n, translations does not work Dennis Bjorklund
09:12 Re: [critical libstdc++ regression]: Duplicate definitions with -On, n > 1 Gabriel Dos Reis
09:12 Re: java/lang/natObject.cc Difficulties Tom Tromey
09:07 Re: other/2857: i18n, translations does not work Joseph S. Myers
08:36 Re: invalid jumps into binding contour??? Denys Duchier
08:30 RE: alpha -> ppc cross compiler David Korn
08:26 c++/2926: gcc 2.95.2 with -O3 makes a bad short to int assignment dsagal
08:25 java/lang/natObject.cc Difficulties Jeffrey Oldham
08:01 invalid jumps into binding contour??? Denys Duchier
07:57 alpha -> ppc cross compiler Simon A Watts
07:46 optimization/2925: inlined builtins emitted more than once garloff
07:09 Re: other/2857: i18n, translations does not work Dennis Bjorklund
05:26 Re: other/2857: i18n, translations does not work Joseph S. Myers
04:56 c/2924: [3.0 regression] Nested function returning variable size struct nicola
04:28 Re: other/2857: i18n, translations does not work Dennis Bjorklund
03:56 libstdc++/2923: signed/unsigned comparison in stringbuf::sync() jakob
02:31 target/484: alpha*-osf4.0*: ICE on mysql/sql/sql_acl.cc: Fixed in 2.95.3, 3.0prerelease rbrown64
02:13 3.0 (20010521) mipsel-linux: EH broken from 20010514 Simon Gee
02:06 c++/2922: two-phase name lookup not working Jens.Maurer
01:28 Re: other/2857: i18n, translations does not work Joseph S. Myers
01:26 libstdc++/2921: exception::what() return '9exception', not 'exception' pere
01:17 Re: other/2857: i18n, translations does not work Zack Weinberg
00:49 Re: other/2857: i18n, translations does not work Joseph S. Myers
00:42 Re: other/2857: i18n, translations does not work Zack Weinberg
00:00 [3.0 regression] File naming confusion Neil Booth

May 23, 2001
23:35 target/139: uw2.1.2: ICE: as got sig 11: Not repeatable on uw2.1.3 rbrown64
23:24 Bug report - a constant value in a switch statement Ryszard Kabatek
20:06 libstdc++/2919: --enable-cxx-flags breaks library carlo
20:06 optimization/2918: long long assignment lost pauli
19:33 Re: h8300-hms: build failure Alexandre Oliva
19:26 optimization/2917: mozilla doesn't run with "-O2 -march=pentiumpro" dbaron
18:39 h8300-hms: build failure Toshi Morita
15:31 Re: target/2878: ARM: cannot use 3.0 to build stage 1 of bootstrap; bad code generated at -O0? Philip Blundell
14:19 Re: v3's testsuite_flags being called too early Alexandre Oliva
14:18 Re: Bug Report Alexandre Oliva
14:16 Re: Missing operator overload in complex.h Alexandre Oliva
14:08 Re: target/2878: ARM: cannot use 3.0 to build stage 1 of bootstrap;bad code generated at -O0? Rod Stewart
13:08 [Solaris 2.5.1/SPARC] libtool related bootstrap failure in boehm-gc Rainer Orth
13:07 RE: Bug Report Tuukka Tikkanen
12:10 Bug Report Steve Sun
11:29 Re: target/2878: ARM: cannot use 3.0 to build stage 1 of bootstrap; bad code generated at -O0? Philip Blundell
11:18 Re: v3's configure chdir'ing to a nonexistant directory Benjamin Kosnik
10:58 v3's testsuite_flags being called too early Phil Edwards
10:56 Re: target/2878: ARM: cannot use 3.0 to build stage 1 of bootstrap;bad code generated at -O0? Rod Stewart
10:56 java/2916: gcj 2.97 produces wrong code for concatenation and final iglewski
10:26 Re: other/2857: i18n, translations does not work Dennis Bjorklund
10:17 v3's configure chdir'ing to a nonexistant directory Phil Edwards
08:18 GCOV problem Inphone Laonady
08:15 Missing operator overload in complex.h David Ronis
07:48 Build failure in dwarf2out.c for sh target Andrew Stubbs
06:56 c/2912: Regression error gcc 3.0: Internal compiler error in print_rtl_and_abort wilhelm.nuesser
06:56 libstdc++/2913: iostreams ignore No space left on device condition donut
05:46 optimization/2911: Invalid C optimization on structs (regression) bonachea
05:11 stl header file errors Amitoj Singh Sukhija , Gurgaon
05:06 GCC 3.0: Bootstrap failure with current sources on powerpc-linux Andreas Jaeger
01:56 c++/2910: dynamic_cast seems to lose or change information Christoph.Pesch
01:46 c++/2909: when trying to build and install the gcc kala.a
01:46 c++/2908: GCC segfaults thomashoward
00:58 cygwin EH problem on branch Billinghurst, David (CRTS)
00:53 Re: other/2857: i18n, translations does not work Dennis Bjorklund
00:21 Re: other/2857: i18n, translations does not work Mark Mitchell
00:11 Re: other/2857: i18n, translations does not work Dennis Bjorklund

May 22, 2001
23:15 Re: __*_frame_info changes break i386/glibc bootstrap Zack Weinberg
23:03 Re: other/2857: i18n, translations does not work Mark Mitchell
22:52 Re: __*_frame_info changes break i386/glibc bootstrap Richard Henderson
22:49 Re: other/2857: i18n, translations does not work Zack Weinberg
22:35 __*_frame_info changes break i386/glibc bootstrap Zack Weinberg
22:26 Re: other/2857: i18n, translations does not work Dennis Bjorklund
21:55 LAPACK results for cygwin - one problem Billinghurst, David (CRTS)
20:11 Re: libstdc++/2907: libstdc++ compiled with optimization fails to initialize ios. Carlo Wood
20:06 Re: gcc-ss-20010521 is now available Carlo Wood
19:59 Re: libstdc++/2907: libstdc++ compiled with optimization fails to initialize ios. Carlo Wood
18:37 Re: gcc-ss-20010521 is now available Benjamin Kosnik
18:14 Re: snapshot 20010514: compression of mangled name Carlo Wood
18:04 Re: gcc-ss-20010521 is now available Carlo Wood
17:54 g++ Internal compiler error 272 Peter Henderson
17:42 Re: snapshot 20010514: compression of mangled name Daniel Berlin
17:16 libstdc++/2907: libstdc++ compiled with optimization fails to initialize ios. carlo
16:12 Re: 3.0 branch bootstrap fails on FreeBSD 4.2? Loren James Rittle
16:06 Re: gcc-ss-20010521 is now available Carlo Wood
15:46 RE: 3.0 mips-sgi-irix6.5: Exception Handling Broken Recently Billinghurst, David (CRTS)
15:26 optimization/2906: mips-sgi-irix6.2 RTL check: expected code `reg', have `subreg' in combine_regs ghazi
14:42 snapshot 20010514: compression of mangled name Eberhard Mattes
14:25 RE: 3.0 branch bootstrap fails on FreeBSD 4.2? Bruce Korb
14:16 c++/2905: Wrong warning cast when using vector class sante
13:56 c/2904: printf changes order guedem
13:12 3.0 branch bootstrap fails on FreeBSD 4.2? Charles Randall
12:49 Re: other/2857: i18n, translations does not work Gabriel Dos Reis
11:56 optimization/2903: Optimization bug with long long arithmetic sean
11:46 objc/2902: collect2 doesn't find ctors/dtors in shared libraries under hpux10.20 dave.anglin
11:36 c++/2901: Program crash when using -fno-rtti with exceptions pere
11:16 preprocessor/2900: Does not handle concatenation of macros properly sean
11:01 Re: other/2857: i18n, translations does not work Zack Weinberg
10:44 Re: Reporting bootstrap failures Neil Booth
10:39 3.0 alpha-unknown-freebsd4.2: EH (Further) Broken Recently (was: Re: 3.0 mips-sgi-irix6.5: Exception Handling Broken Recently) Loren James Rittle
08:03 Re: Analysis of linkage.c failure onmips-sgi-irix6.5/-mabi=64 Mark Mitchell
08:01 Re: 3.0 mips-sgi-irix6.5: Exception Handling Broken Recently Mark Mitchell
07:36 c++/2899: Internal compiler error when using typename in template function efri.nattel
07:13 Re: java/2697 apbianco
06:26 c/2898: Illegal function return in ARM code when compiling with -mthumb-interwork -O2 trauscher
05:16 c++/2897: Segmentation fault by calling methods of ifstream pompl
03:55 Re: Reporting bootstrap failures Gerald Pfeifer
02:28 is it a bug? Arne Moe
02:26 Re: java/2598 apbianco
01:26 c/2896: -std=foo gives error message twice Joseph Myers
01:16 c/2895: Option -mabi=32 not recognized ronald.fischer.gp
00:35 Re: 3.1 bootstrap failure on alpha remains Richard Henderson

May 21, 2001
22:26 c/2894: Incorrect union padding on Linux/ARM port; other architectures correct jeffm
20:42 Analysis of linkage.c failure on mips-sgi-irix6.5/-mabi=64 Billinghurst, David (CRTS)
19:59 RE: g++ -mabi=64 testsuite failures on irix6.5 Billinghurst, David (CRTS)
19:56 optimization/2893: sparc-sun-solaris2.7 -fpic/-fPIC -O regression on compile/20000518-1.c ghazi
19:47 irix6.5 bootstrap failure on branch: Unresolved text symbol "type_num_arguments" Billinghurst, David (CRTS)
19:21 Re: 3.0 mips-sgi-irix6.5: Exception Handling Broken Recently Richard Henderson
18:49 cc1plus: warning: -fvtable-thunks is no longer supported Carlo Wood
18:42 Re: gcc-ss-20010521 is now available Carlo Wood
17:56 Re: 3.0 mips-sgi-irix6.5: Exception Handling Broken Recently Richard Henderson
17:51 Re: 3.0 mips-sgi-irix6.5: Exception Handling Broken Recently Jeffrey Oldham
17:35 Re: g++ -mabi=64 testsuite failures on irix6.5 Jeffrey Oldham
17:02 32/64 bit irix6.5 bugs fixed on trunk in early May? Billinghurst, David (CRTS)
16:33 RE: g++ -mabi=64 testsuite failures on irix6.5 Billinghurst, David (CRTS)
16:26 RE: 3.1 bootstrap failure on irix6.5: as error - must give attribute values for new section Billinghurst, David (CRTS)
16:04 Re: GCC bug on PowerPC with gcc 2.95.2? Cort Dougan
15:56 c++/2892: array addresses corrupted when using template classes ianw
15:52 3.0 mips-sgi-irix6.5: Exception Handling Broken Recently Jeffrey Oldham
15:43 Re: GCC bug on PowerPC with gcc 2.95.2? Geoff Keating
15:26 GCC bug on PowerPC with gcc 2.95.2? Cort Dougan
14:59 Re: 3.1 bootstrap failure on alpha remains Richard Henderson
14:46 Re: g++ -mabi=64 testsuite failures on irix6.5 Jeffrey Oldham
11:56 c/2891: extern inline - undefined references rohloff
09:26 3.1 bootstrap failure on alpha remains Brad Lucier
09:16 c/2890: ANSI STD function strerror missing from SUN 4.1.3 llewins
08:34 libtool changes on branch, build errors on sparc-sun-solaris2.8 Phil Edwards
06:06 c/2889: ia64 gcc core dumps when compiling xmame-0.37b14.2 cpg
05:03 Internal compiler Error while building gcc 2.95.3 on linux Sathya narayanan
04:26 c/2888: crash in reload on eliminating register in REG_EQUAL note containing ASM_OUTPUT hubicka
04:22 Re: [bugs] Internal compiler error while compiling test3 Jan Hubicka
02:39 Re: Access size problem on ARM architecture Richard Earnshaw
02:36 c++/2887: Automatic template instanciation failure snapshot 20010507 pnobili
00:56 c++/2886: Optimizer bug axel.zeuner
00:04 Re: 3.1 bootstrap failure on irix6.5: as error - must give attri bute values for new section Richard Henderson

May 20, 2001
23:54 ICE in ix86_expand_branch, at config/i386/i386.c:6074 Andreas Jaeger
21:10 RE: 3.1 bootstrap failure on irix6.5: as error - must give attribute values for new section Billinghurst, David (CRTS)
20:16 Re: 3.1 bootstrap failure on irix6.5: as error - must give attribute values for new section Richard Henderson
18:49 3.1 bootstrap failure on irix6.5: as error - must give attribute values for new section Billinghurst, David (CRTS)
17:55 Close optimization/2590 scott snyder
15:36 c++/2885: Internal compiler error in `output_die', at dwarf2out.c:5433 nikv
14:32 Re: c/2164: ICE on NetBSD/i386, gcc 3.0 20010303 (prerelease) Krister Walfridsson
13:12 Re: 3.1: Bootstrap comparison failures on alphaev6-unknown-linux-gnu Brad Lucier
11:46 preprocessor/2884: cpp stringizing problem 2 Markus F.X.J. Oberhumer
11:36 preprocessor/2881: code inside "#if 0" generates warnings with -pedantic Markus F.X.J. Oberhumer
10:27 Re: branch spurious references to __gxx_personality_v0 Zack Weinberg
10:06 Re: PR target/817 Mark Mitchell
10:04 Re: branch spurious references to __gxx_personality_v0 Mark Mitchell
04:36 c/2880: compilation of a python wrapper gives insn failure on macosx cary
03:48 PR target/817 Philip Blundell
03:36 target/2878: ARM: cannot use 3.0 to build stage 1 of bootstrap; bad code generated at -O0? philb
01:56 libstdc++/2877: numeric_limits<wchar_t> specialization missing Jens.Maurer

May 19, 2001
22:04 Re: branch spurious references to __gxx_personality_v0 Tom Tromey
19:56 c++/2875: Compiler Segfault kitty
19:07 Re: PATCH[3.0]: Parallel build problem and suggested fix. Alexandre Oliva
18:33 Re: 3.0: Troubling warning in dwarf2out.c Brad Lucier
18:03 Re: 3.0: Troubling warning in dwarf2out.c Mark Mitchell
17:55 3.1: bootstrap failure compiling defineclass.cc on powerpcc-unknown-linux-gnu Brad Lucier
17:51 Re: 3.0: Troubling warning in dwarf2out.c Brad Lucier
17:51 3.1: Bootstrap comparison failures on alphaev6-unknown-linux-gnu Brad Lucier
17:00 Re: PATCH for PR 2828: Testers needed! Philip Blundell
16:59 Re: Bogus fixinclude of stdio.h from glibc 2.2.3 Bruce Korb
16:55 branch spurious references to __gxx_personality_v0 Zack Weinberg
16:17 Re: Bogus fixinclude of stdio.h from glibc 2.2.3 Joseph S. Myers
16:11 Bogus fixinclude of stdio.h from glibc 2.2.3 Bruce Korb
11:56 libgcj/2874: libjava testsuite disk space usage Joseph Myers
11:37 Re: Access size problem on ARM architecture Philip Blundell
10:16 other/2873: Bogus fixinclude of stdio.h from glibc 2.2.3 Joseph Myers
09:51 Re: PATCH for PR 2828: Testers needed! Mark Mitchell
08:29 Re: PATCH for PR 2828: Testers needed! Philip Blundell
06:11 Re: 3.0: Troubling warning in dwarf2out.c Jason Merrill
03:50 Reporting bootstrap failures Laurynas Biveinis

May 18, 2001
23:56 c/2871: passing float, gets converted to double mdesm2
22:16 other/2870: Can't build binary RPM from gcc-snapshot-20010516-1.src.rpm on Red Hat Linux 7.1 znmeb
19:34 Re: PATCH: minor corrections to gthr-dce.h John David Anglin
19:07 Re: 3.0: Troubling warning in dwarf2out.c Mark Mitchell
17:09 Re: 3.0: Troubling warning in dwarf2out.c Stan Shebs
16:34 Re: 3.0: Troubling warning in dwarf2out.c Brad Lucier
15:07 Re: 3.0: Troubling warning in dwarf2out.c Jason Merrill
14:56 c++/2869: virtual derived class destructor bug luppy
13:34 Re: optimization/2692: excessive compile time with optimization scott snyder
12:12 Re: 3.0: Troubling warning in dwarf2out.c Brad Lucier
12:01 Re: libI77 configury still broke Toon Moene
10:55 Re: 3.0: Troubling warning in dwarf2out.c Joseph S. Myers
10:39 3.0: Troubling warning in dwarf2out.c Brad Lucier
10:09 Re: [3.0 regression] libstdc++ and strstr Gerald Pfeifer
10:06 file://localhost/tmp/gcc/gcc-2.95.3/faq.html Natarajan Ramachandran
10:05 PATCH[3.0]: Parallel build problem and suggested fix. Brad Lucier
09:50 3.1 bootstrap fails due to missing autogen, which itself won't build. Brad Lucier
09:08 cc 2.95.2 crashes on legal code ... Andre Mueller
09:06 c++/2868: using RTTI instruction on "cout" frederic.giroud
08:02 Optimisation Oddities in gcc 2.95.3 John Summerfield
07:58 Re: Access size problem on ARM architecture Richard Earnshaw
06:16 c++/2867: Koenig lookup bug kunert
06:06 c/2866: float-int conversion causes infinite recursion on the h8300 port kazu
05:40 c/2555: ICE on HP-UX with -O: Ok in 3.0 20010514 (prerelease) rbrown64
05:39 l'0514 libstdc++ fails building powerpc/limitsMEMBERS.cc on rs6000-ibm-aix4.2.0.0 rbrown64
05:06 optimization/2865: fixincl broken when STDIN is closed aj
04:35 Access size problem on ARM architecture olaf.wepner
02:06 c++/2864: misleading error message about default arg initialization wolfgang.bangerth
01:46 c++/2863: gcc accepts invalid explicit specialization syntax wolfgang.bangerth
01:16 c++/2862: gcc accepts invalid explicit instantiation syntax wolfgang.bangerth
00:50 Re: libI77 configury still broke Mark Mitchell
00:44 Re: libI77 configury still broke Andreas Jaeger
00:37 libI77 configury still broke Mark Mitchell

May 17, 2001
23:27 RE: g++ -mabi=64 testsuite failures on irix6.5 Billinghurst, David (CRTS)
23:01 RE: Test gcc.c-torture/compile/20001226-1.c takes too long tocom pile Mark Mitchell
22:46 RE: Test gcc.c-torture/compile/20001226-1.c takes too long to compile Billinghurst, David (CRTS)
22:43 Re: libstdc++-v3 won't build on AIX 4.1 any more (3.0 branch) Alexandre Oliva
22:31 Re: libstdc++-v3 won't build on AIX 4.1 any more (3.0 branch) Alexandre Oliva
22:19 Re: libstdc++-v3 won't build on AIX 4.1 any more (3.0 branch) David Edelsohn
22:17 Re: libstdc++-v3 won't build on AIX 4.1 any more (3.0 branch) David Edelsohn
22:07 Re: libstdc++-v3 won't build on AIX 4.1 any more (3.0 branch) Alexandre Oliva
21:47 Re: [3.0 regression] libstdc++ and strstr Gabriel Dos Reis
21:43 Re: Test gcc.c-torture/compile/20001226-1.c takes too long tocompile Mark Mitchell
21:29 Re: libstdc++-v3 won't build on AIX 4.1 any more (3.0 branch) Benjamin Kosnik
21:26 c++/2861: Parser crashes while parsing a call a template function using the template keyword anene
21:18 Re: ./.libs/libgcj.so: undefined reference to `__gxx_personality_v0' Zack Weinberg
21:18 Re: libstdc++-v3 won't build on AIX 4.1 any more (3.0 branch) David Edelsohn
21:10 Re: libstdc++-v3 won't build on AIX 4.1 any more (3.0 branch) Alexandre Oliva
20:55 Re: Test gcc.c-torture/compile/20001226-1.c takes too long to compile Jeffrey Oldham
20:50 3.0: Parallel build problem and suggested fix. Brad Lucier
20:50 3.1: bootstrap failure on alpha Brad Lucier
20:42 Re: libstdc++-v3 won't build on AIX 4.1 any more (3.0 branch) Benjamin Kosnik
20:30 CMP & TEST(for Pentium PC) yang.wanlin
20:26 Test gcc.c-torture/compile/20001226-1.c takes too long to compile Billinghurst, David (CRTS)
20:24 Re: libstdc++-v3 won't build on AIX 4.1 any more (3.0 branch) Alexandre Oliva
17:46 c++/2860: incorrectly initialized auto variable kainz
16:07 Re: debug/2813: Type of variable is wrong in dwarf2 debugginginfo Mark Mitchell
15:47 Re: [3.0 regression] libstdc++ and strstr Loren James Rittle
15:44 Re: debug/2813: Type of variable is wrong in dwarf2 debugging info Alexandre Oliva
15:42 Re: [3.0 regression] libstdc++ and strstr Loren James Rittle
15:42 Re: libstdc++-v3 won't build on AIX 4.1 any more (3.0 branch) Alexandre Oliva
15:29 Re: libstdc++-v3 won't build on AIX 4.1 any more (3.0 branch) Benjamin Kosnik
15:22 libstdc++-v3 won't build on AIX 4.1 any more (3.0 branch) Alexandre Oliva
14:46 libstdc++/2859: Fix for smp ref-counted string bug on intel systems graemeb
13:57 Re: Early build failure on sparc-sun-solaris2.8 Bruce Korb
13:36 c++/2858: internal compiler error rmok
12:36 Re: Early build failure on sparc-sun-solaris2.8 Phil Edwards
12:19 Early build failure on sparc-sun-solaris2.8 Bruce Korb
11:26 other/2857: i18n, translations does not work db
11:17 RE: issue with gcc version 3.0 20010418 (prerelease) on x86/redhat 6. 2 w/ openssl 0.9.6a Neulinger, Nathan
10:47 Re: g++ / CC compatibility Alexandre Oliva
10:40 Re: bug report Alexandre Oliva
10:17 Bootstrap failure gcc version 3.0 20010517 (prerelease) David Ronis
09:40 Re: Undefined symbol __gxx_personality_sj0 (data) from stdexcept.o law
09:00 Re: Undefined symbol __gxx_personality_sj0 (data) from stdexcept.o law
08:50 Re: Undefined symbol __gxx_personality_sj0 (data) from stdexcept.o John David Anglin
08:08 Re: Undefined symbol __gxx_personality_sj0 (data) from stdexcept.o law
05:47 Re: V3 testsuite problem on branch Gabriel Dos Reis
05:42 Re: [3.0 regression] libstdc++ and strstr Gabriel Dos Reis
05:10 Re: target/2760: Error compiling gcc 2.95.3 with HP-UX C compiler Bernd Schmidt
01:36 c++/2853: gcc-3.0 generates incorrect code for std::strchr() for i586-pc-msdosdjgp pavenis
01:36 middle-end/2852: internal complier error mohammed
01:24 g++ -mabi=64 testsuite failures on irix6.5 Billinghurst, David (CRTS)
00:26 ./.libs/libgcj.so: undefined reference to `__gxx_personality_v0' Andreas Jaeger

May 16, 2001
22:03 Re: String.h Mike Stump
21:45 Undefined symbol __gxx_personality_sj0 (data) from stdexcept.o John David Anglin
20:40 Re: String.h Zack Weinberg
20:14 String.h Alex Arulanthu
19:06 FW: g++ / CC compatibility Nevenka Bierny
18:46 debug/2851: dbxout.c's concat loses information oldham
18:31 g++ / CC compatibility Nevenka Bierny
17:54 Re: PowerPC Floating Point compare bug? Geoff Keating
16:31 Re: V3 testsuite problem on branch John David Anglin
15:46 Re: [3.0 regression] libstdc++ and strstr Loren James Rittle
15:23 RE: V3 testsuite problem on branch Billinghurst, David (CRTS)
14:46 c/2849: -mmmx flag causes gcc to segfault VÁCLAV" HAISMAN
14:06 c/2848: Flow mishandles conditional SETs where the mode is wider than a single register nickc
13:34 V3 testsuite problem on branch John David Anglin
13:26 optimization/2847: GCC 2.96 with -O2 incorrectly compile if(var==0) break; else printf("test\n"); inside a while yannick.koehler
13:16 c++/2846: gcc 2.95.2/3 have an ice while building clanlib (www.clanlib.org) f.natter
11:48 Re: debug/2813: Type of variable is wrong in dwarf2 debugginginfo Mark Mitchell
11:36 c/2845: Function array causes bug report in 2.96, gives just errors in 2.95 jdomm
11:06 optimization/2844: Conditional branch movement violates dependency on IA64 Hans_Boehm
09:42 Re: 3.0: can't bootstrap on arm-linux Richard Henderson
09:38 bug report Brian Crouch
08:56 c++/2843: parser doesn't accept __attribute__ ((__unused__)) extension dave.anglin
08:53 Re: Please close PRs c++/2486 and c++/2709 Phil Edwards
05:06 optimization/2842: long long on IRIX gives bad code jarausch
03:56 libstdc++/2841: -static in libstdc++ v3 dejagnu testsuite causes linking to fail Rainer Orth
03:50 Re: Unassigned bug reported to GNATS is already fixed Alexandre Oliva
02:07 Unassigned bug reported to GNATS is already fixed Mathias Froehlich
01:56 Re: 3.0: can't bootstrap on arm-linux Alexandre Oliva
01:55 V3 libstdc++ testsuite problem: warning: -ffunction-sections Billinghurst, David (CRTS)
01:39 Re: 3.0: can't bootstrap on arm-linux Philip Blundell
01:39 Re: 3.0: can't bootstrap on arm-linux Philip Blundell
01:18 Re: Branch failure on x86 Linux Andreas Jaeger
00:33 [3.0 regression] libstdc++ and strstr Gerald Pfeifer
00:19 File name issues reprise [3.0 regression] Neil Booth
00:11 Branch failure on x86 Linux Neil Booth

May 15, 2001
23:49 Re: debug/2813: Type of variable is wrong in dwarf2 debugging info Alexandre Oliva
23:16 c/2840: HP-UX: ICEs with -march=1.0 in gcc 3.0 prerelease rbrown64
23:06 c++/2839: export is unimplimented camio
21:48 Re: PATCH: minor corrections to gthr-dce.h Mark Mitchell
21:33 Re: PATCH: minor corrections to gthr-dce.h John David Anglin
21:09 Re: PATCH: minor corrections to gthr-dce.h Mark Mitchell
20:56 Re: SJLJ exceptions are broken Mark Mitchell
20:44 Re: Incorrect code generation on Solaris Alexandre Oliva
20:36 other/2838: Installation error Jumbler_chi
20:11 Re: SJLJ exceptions are broken Richard Henderson
19:38 Re: Incorrect code generation on Solaris Jon Steinhart
19:18 Re: SJLJ exceptions are broken Richard Henderson
19:14 Re: SJLJ exceptions are broken Mark Mitchell
19:10 Re: SJLJ exceptions are broken Richard Henderson
19:07 Re: Incorrect code generation on Solaris Alexandre Oliva
18:23 Re: PATCH: minor corrections to gthr-dce.h John David Anglin
18:16 libstdc++/2837: Reference counted string is not smp safe graemeb
18:12 Re: PATCH: minor corrections to gthr-dce.h law
17:58 Re: 3.0: can't bootstrap on arm-linux Alexandre Oliva
17:57 Re: Bug in STL basic_string template (2.95.2 & 2.95.3) Alexandre Oliva
17:57 PATCH: minor corrections to gthr-dce.h John David Anglin
17:07 SJLJ exceptions are broken Mark Mitchell
15:46 Re: Please close PR c++/45 Neil Booth
15:20 Please close PRs c++/2486 and c++/2709 Peter Schmid
15:05 Please close PR c++/45 Peter Schmid
14:22 GNATS entry 2463 - downgraded from priority HIGH to MEDIUM. Toon Moene
14:16 libgcj/2833: New testsuite failures on 3.0 branch jsturm
13:56 GCC 3.0 --host=i686-linux --target=sh-elf build failure; needs backported patch Toshi Morita
13:36 libstdc++/2832: rdbuf methods incorrect kenny.simpson
13:34 unwind-pe.h vs unwind-dw2.c DJ Delorie
13:08 Re: FreeBSD Fortran Failure Toon Moene
12:26 c++/2831: operator ?: requires storage for initialized static member constants fspam
12:16 libstdc++/2830: incorrect inserter for std::string kenny.simpson
11:48 Re: FreeBSD Fortran Failure Mark Mitchell
11:42 Re: libstdc++/2345 Nathan Neulinger
11:36 debug/2829: Invalid stabx storage class for GCC marker dje
10:16 target/2828: arm-linux: cc1 consumes all memory [regression from 2.95] philb
09:36 Incorrect code generation on Solaris Jon Steinhart
09:26 middle-end/2827: invalid narrowing during use of double type, arrithametic becomes non-comutative rcr197
08:57 cout ignores the last 11 bits of long double Dennis Yelle
08:36 optimization/2826: arm-linux-gcc ice jeroen.dobbelaere
08:23 Problem executing gcc3 generated programs on Solaris2.7 Wolfgang Bangerth
03:46 libstdc++/2825: istream::vscan has gone jarausch
02:28 Re: FreeBSD Fortran Failure Toon Moene
00:12 3.0: can't bootstrap on arm-linux Philip Blundell

May 14, 2001
20:34 Re: libtool litter Mark Mitchell
19:42 Re: gcc.dg/ultrasp2.c Mark Mitchell
19:13 surprising? register allocator performance in gcc 2.95.3 Joshua Redstone
19:05 Re: FreeBSD Fortran Failure Loren James Rittle
16:44 Bug in STL basic_string template (2.95.2 & 2.95.3) Michael Dickey
15:56 objc/2824: @protocol forward definitions do not work kai-objc-bug
14:56 c++/2823: kde2/artsd miscompilation (part 1) Franz.Sirl-kernel
14:44 Re: debug/2813: Type of variable is wrong in dwarf2 debugging info Mark Kettenis
13:15 Re: FreeBSD Fortran Failure Toon Moene
12:59 Re: libtool litter Richard Henderson
12:55 Re: libtool litter John David Anglin
12:39 Re: gcc.dg/ultrasp2.c Alexandre Oliva
12:36 Re: libtool litter law
12:36 c++/2822: gcc: template class error jason.nerothin
11:11 Re: libtool litter John David Anglin
11:06 Re: Where can I find the current bug list for g++-3.0 Neil Booth
11:03 Re: Branch breakage on IRIX 6.5 Mark Mitchell
10:38 Re: Branch breakage on IRIX 6.5 Mark Mitchell
10:28 Re: libtool litter Richard Henderson
10:03 Re: Branch breakage on IRIX 6.5 Richard Henderson
09:50 Re: Branch breakage on IRIX 6.5 Mark Mitchell
09:28 Re: Branch breakage on IRIX 6.5 Richard Henderson
09:23 Re: Branch breakage on IRIX 6.5 Mark Mitchell
09:21 Re: gcc.dg/20001013-1.c Mark Mitchell
09:14 Re: gcc.dg/20001013-1.c Richard Henderson
09:13 Re: How to XFAIL a gcc.dg test? Mark Mitchell
09:12 Re: gcc.dg/ultrasp2.c Mark Mitchell
09:06 c++/2821: C++ code not thread-safe on ARM tomasheran
09:03 Re: Branch breakage on IRIX 6.5 Richard Henderson
09:03 Re: [PATCH] Re: gcc.dg/20001013-1.c Mark Mitchell
08:39 Re: libtool litter John David Anglin
08:36 c/2820: unnamed union inside unnamed struct changes rest of the struct redhog
08:32 Re: Branch breakage on IRIX 6.5 Jeffrey Oldham
08:26 c/2819: ICE in reload_cse_simplify_operands, at reload1.c:8347 etienne.Lorrain
08:19 Re: libtool litter Gary V. Vaughan
08:17 Re: [3.0 critical] Make fixproto deal with assert.h (bootstrap fails) Mark Kettenis
06:36 c++/2818: gcc 2.95.2 sparc-solaris wrong code for "func(*str++)". Bernd.MZ
06:03 Re: How to XFAIL a gcc.dg test? Gabriel Dos Reis
05:58 Re: [3.0 critical] Make fixproto deal with assert.h (bootstrap fails) Fergus Henderson
05:41 Re: gcc.dg/ultrasp2.c Gabriel Dos Reis
05:06 c++/2817: g++.abi/vtable2.C not aliasing safe? Franz.Sirl-kernel
03:56 c++/2816: bad STL implementation on vector / iostream aubin.mahe
03:16 c++/2815: compiler internal error shlomo.anglister
02:55 Where can I find the current bug list for g++-3.0 Stephan Broennimann
02:31 [PATCH] Re: gcc.dg/20001013-1.c Jakub Jelinek
02:26 Re: gcc.dg/20001013-1.c Mark Mitchell
02:19 Re: gcc.dg/20001013-1.c Jakub Jelinek
01:31 gcc.dg/ultrasp2.c Mark Mitchell
01:21 How to XFAIL a gcc.dg test? Mark Mitchell
01:14 gcc.dg/20001013-1.c Mark Mitchell
00:52 Branch breakage on IRIX 6.5 Mark Mitchell
00:39 Re: FreeBSD Fortran Failure Mark Mitchell

May 13, 2001
23:48 Re: FreeBSD Fortran Failure Toon Moene
23:26 debug/2813: Type of variable is wrong in dwarf2 debugging info aoliva
21:14 Re: Compiling Java code using Gcc Alexandre Oliva
20:01 Bootstrap failure in 3.0 20010513 David Ronis
18:03 3.0 bootstrap failure on irix6.5 with new EH Billinghurst, David (CRTS)
16:54 Re: g++.abi/vtable2.C aliasing safe? Mark Mitchell
15:54 g++.abi/vtable2.C aliasing safe? Franz Sirl
15:41 Re: C++ bug 764 Jason Merrill
15:29 Re: 3_0-branch bootstrap failure on i686-pc-linux-gnu Alexandre Oliva
15:25 Re: FreeBSD Fortran Failure Mark Mitchell
14:58 Re: FreeBSD Fortran Failure Joseph S. Myers
14:51 empty subdir after removing assert.h Vladimir A Merzliakov
14:46 Re: FreeBSD Fortran Failure Mark Mitchell
14:18 Re: FreeBSD Fortran Failure Zack Weinberg
14:17 Re: FreeBSD Fortran Failure Mark Mitchell
14:17 Re: FreeBSD Fortran Failure Joseph S. Myers
14:02 Re: FreeBSD Fortran Failure Alexandre Oliva
13:24 Re: FreeBSD Fortran Failure Mark Mitchell
13:05 Re: FreeBSD Fortran Failure Toon Moene
13:01 Re: FreeBSD Fortran Failure Mark Mitchell
12:45 Re: FreeBSD Fortran Failure Toon Moene
12:24 Re: [3.0 critical] Make fixproto deal with assert.h(bootstrap fails) Mark Mitchell
12:21 Re: FreeBSD Fortran Failure Mark Mitchell
12:16 Re: FreeBSD Fortran Failure Toon Moene
10:38 Re: FreeBSD Fortran Failure Mark Mitchell
09:41 Re: libtool litter John David Anglin
08:43 Re: FreeBSD Fortran Failure Toon Moene
08:22 Re: [3.0 critical] Make fixproto deal with assert.h (bootstrap fails) Fergus Henderson
05:26 java/2812: Build failure; missing symbols (iconv) in link of jc1 gcc
05:17 Re: [3.0 branch] x86 bootstrap failure Andreas Jaeger
04:09 [3.0 branch] x86 bootstrap failure Joseph S. Myers
01:06 c++/2811: mult.inheritance+overload+contravariance=SEGV pacman

May 12, 2001
21:46 Re: FreeBSD Fortran Failure Tim Prince
20:39 FreeBSD Fortran Failure Mark Mitchell
18:45 Re: [3.0 critical] Make fixproto deal with assert.h (bootstrap fails) Richard Henderson
18:20 Re: [3.0 critical] Make fixproto deal with assert.h(bootstrap fails) Mark Mitchell
18:16 c++/2810: Problems with enums (gcc 2.95 regression) boost Peter Schmid
18:06 Re: [3.0 critical] Make fixproto deal with assert.h (bootstrap fails) Zack Weinberg
16:13 Re: [3.0 critical] Make fixproto deal with assert.h(bootstrap fails) Mark Mitchell
16:08 Re: [3.0 critical] Make fixproto deal with assert.h (bootstrap fails) Russ Allbery
15:40 Re: [3.0 critical] Make fixproto deal with assert.h(bootstrap fails) Mark Mitchell
14:46 c++/2809: ice on illegal template specialisation Peter Schmid
13:26 libgcj/2808: Makefile generates broken Object.h and Class.h dps
12:00 Re: [3.0 critical] Make fixproto deal with assert.h (bootstrap fails) Zack Weinberg
11:38 Re: [3.0 critical] Make fixproto deal with assert.h(bootstrap fails) Mark Mitchell
09:05 Re: libtool litter John David Anglin
06:26 Re: libtool litter libtool
05:59 Re: [3.0 critical] Make fixproto deal with assert.h (bootstrap fails) Kaveh R. Ghazi
04:16 c++/2807: problem with __complex__ in std::complex<double> specialization fsm
02:16 duplicates, none, what is the deal? [std::ios_base::Init::Init()] Benjamin Kosnik
00:35 Re: duplicate warnings about missing EOF newline Neil Booth

May 11, 2001
22:02 Re: Please help Alexandre Oliva
20:35 Please help Sunil.M
19:21 Re: libtool litter Alexandre Oliva
18:30 Re: libtool litter John David Anglin
18:24 libtool litter John David Anglin
17:16 Re: optimization and printf for i386-pc-solaris-2.7 Alexandre Oliva
15:06 c++/2806: g++ 2.96 inadequate optimization in static and global initializers eric-gcc
13:01 Re: Compilation problems w/ 2.95.3 on Sun Solaris 2.5.1 (fully patched) Auteria Wally Winzer Jr.
11:20 Re: objc: SIGSEGV (in gdb only) during module loading Ovidiu Predescu
11:06 c++/2805: building gcc for mips target, error after make sanjay
10:27 Re: Right-shift bug in egcs-2.91.66 Timur Tabi
10:24 Re: Right-shift bug in egcs-2.91.66 Dale Johannesen
10:06 Re: Right-shift bug in egcs-2.91.66 Timur Tabi
10:03 Re: Right-shift bug in egcs-2.91.66 Dale Johannesen
09:32 Right-shift bug in egcs-2.91.66 Timur Tabi
09:06 c/2804: C GCC 2001-05-11 snapshot "Internal error: Segmentation fault" Etienne.Lorrain
08:46 c++/2803: g++ fails where gcc succeeds hamdy
06:31 Re: Bug report Carlo Wood
06:11 optimization and printf for i386-pc-solaris-2.7 Jonathan Hamaker
04:36 c++/2802: internal compiler error with templates guillaume.lemaitre
02:52 Bug report Mukul Bansal
02:16 c++/2801: ice on using ::std; a.metselaar
01:30 Re: G++/GCC 2.95.2 internal problem on OSF1: 3.0 regression? rbrown64
00:46 libstdc++/2800: sstream compiles with warnings if -Wall baldvin

May 10, 2001
21:21 Compiling Java code using Gcc Sriram Narayanan
18:04 Re: ltconfig test for max cmd args slightly broken fnf
17:44 Re: ltconfig test for max cmd args slightly broken Alexandre Oliva
17:36 Re: Compilation problems w/ 2.95.3 on Sun Solaris 2.5.1 (fully patched) Alexandre Oliva
17:34 Re: gcc 2.96 20000731 (Red Hat Linux 7.1 2.96-81) + libdv Alexandre Oliva
16:01 ltconfig test for max cmd args slightly broken fnf
12:50 Re: duplicate warnings about missing EOF newline Neil Booth
12:25 duplicate warnings about missing EOF newline Matt Kraai
11:33 Re: Bootstrap failure on mainline law
11:20 Bootstrap failure on mainline Andreas Jaeger
09:10 G++/GCC 2.95.2 internal problem on OSF1 Nicolas HUYNH
05:56 PowerPC still broken on branch Andreas Jaeger
02:47 Re: g77 -O3 -g failure in 3.0 branch on irix Toon Moene
02:46 optimization/2799: gcc hangs with any optimization level enabled on sha1.c billr
02:07 g77 -O3 -g failure in 3.0 branch on irix Billinghurst, David (CRTS)

May 09, 2001
18:38 headers with no fixes applied, but still 'fixed' Zack Weinberg
17:46 c++/2797: on legal code g++ complains: assignment of member `X::x' in read-only structure randal
16:46 c++/2796: gcc internal error when parsing a syntax error in a cpp file equijano
15:26 c++/2794: templated method in a templated class cannot be accessed with full qualification fwunderlich
14:36 middle-end/2793: g++: ICE with -g -O3, in add_abstract_origin_attribute, at dwarf2out.c:9273 matze
14:36 c++/2792: failed to build GCC snapshot on HP-11.00 platform ganelin
12:56 java/2791: Bogus "class `foo' already defined ..." error from jc1 jsturm
11:48 Re: assembler assention failure Per Bothner
10:41 Re: bug: returning a float doesn't work Zack Weinberg
10:23 bug: returning a float doesn't work Juan Carlos Pizarro Méndez
09:12 Re: Download gcc Matthew Schalit
09:05 gcc-2.95.2: Incorrect "fixed" header file (signal.h on OSF1 DECUnix) abbott
06:26 Re: preprocessor/2790: Preprocessor has problems using ## to construct valid C code. Carlo Wood
05:36 preprocessor/2790: Preprocessor has problems using ## to construct valid C code. tim.vanholder
04:46 preprocessor/2789: #line directive disallows legal filenames wsmith
03:16 c/2788: can't compile linux-2.4.2 on alpha ev5 martin
01:51 Download gcc Bouazzaoui Nadia
01:36 c/2787: Compiler dump core on sparc-sun-solaris2.7 Haj.Ten.Brugge

May 08, 2001
23:46 c++/2786: erroneous pointer returned by dynamic cast laurent.morel
23:16 debug/2785: compiler fails in final.c while outputting debug information matze
23:16 c++/2784: gcc emits duplicate assembly symbol (regression from gcc 2.95) snyder
23:12 foo = std::pair(1,3) triggers internal compiler error Steven Michael ROBBINS
20:26 c/2783: -ggdb -O1 -finline-functions causes "Internal compiler error" stiletto
19:56 c/2782: HPUX: g77 3.0 (pre) regression caused by C90 bool args rbrown64
17:06 c++/2781: bad code generated for reference call with -O2 (regression from 2.95) snyder
15:46 middle-end/2780: Gcc 2.95 pic code gen problem for m68k- targets pauli
15:42 Re: Compilation problems w/ 2.95.3 on Sun Solaris 2.5.1 (fully patched) Auteria Wally Winzer Jr.
15:06 libstdc++/2779: resolution conflicts between std namespace and <cstring> bonachea
12:45 Re: CPP problem w/ limits.h when building cross-compiler David Connelly
12:40 CPP problem w/ limits.h when building cross-compiler David Connelly
11:20 Re: Bug in GNU CPP option handling (gcc-2.95.[123]) Zack Weinberg
11:13 Re: Bug in GNU CPP option handling (gcc-2.95.[123]) Neil Booth
11:08 gcc 2.96 20000731 (Red Hat Linux 7.1 2.96-81) + libdv Artur Zaprzala
11:06 c++/2778: -fdump-translation-unit option inaccuracies John Wilkinson
10:56 c/2777: Wrong (misleading) error message in gcc 2.95.3 mtodorov
10:56 c/2776: Wrong (misleading) error message in gcc 2.95.3 mtodorov
10:39 Bug in GNU CPP option handling (gcc-2.95.[123]) Peter Breitenlohner
10:16 other/2775: avr.h CVS corruption Joseph Myers
10:06 other/2774: Missing PRs Joseph Myers
08:04 Re: libstdc++/2773: "allocator" not used by stringstream! Carlo Wood
07:28 Re: New trunk breakage on mips-sgi-irix6.2 stage1 compiling libgcc2 Kaveh R. Ghazi
07:26 libstdc++/2773: "allocator" not used by stringstream! carlo
07:19 Re: make check failures with glibc-2.2.3 Andreas Jaeger
07:06 Re: make check failures with glibc-2.2.3 David Ronis
06:46 libstdc++/2772: bind2nd(mem_fun1_ref) does not work eekaikko
05:06 c/2771: internal compiler error sps
03:55 Re: make check failures with glibc-2.2.3 Andreas Jaeger
03:27 RE: Bug Report (Float --> Integer Inplace Conversion Precision Pr oblem) Joe Murray
03:01 Re: Bug Report (Float --> Integer Inplace Conversion Precision Pr oblem) Alexandre Oliva
02:29 RE: Bug Report (Float --> Integer Inplace Conversion Precision Problem) Joe Murray
00:26 c/2770: internal compiler error using ultrasparc backend cpu plindner

May 07, 2001
23:47 Re: Bug Report (Float --> Integer Inplace Conversion Precision Problem) Alexandre Oliva
23:43 Re: PR180 Alexandre Oliva
22:45 PR 2503: AIX 3.2.5: gcc-2.95.3: `as' Seg fault rbrown64
22:11 RE: c/2762: scanf and sscanf failed to handle floating point values Billinghurst, David (CRTS)
21:13 Re: libiberty doesn't build with a K+R compiler Mark Mitchell
21:06 c++/2769: Compiler doesn't find existing copy constructor jungdl
15:40 make check failures with glibc-2.2.3 David Ronis
15:36 c++/2768: odd warning on spurious 'static' bh
12:36 libstdc++/2767: Problems with the new bits/std_cstring.h header Peter Schmid
11:16 c++/2766: Received 'internal compiler error 980711' jfennell
11:06 c/2765: File-scope division by zero causes segfault neil
10:56 other/2764: Fixinclude should fix PTHREAD_MUTEX_INITIALIZER on Solaris2.7 wolfgang.bangerth
10:16 c++/2763: Internal compiler error in `const_hash', at varasm.c:2372 W. Wieser
10:14 Please close c++/2473 Wolfgang Bangerth
10:09 Re: preprocessor/2677 Ronald F. Guilmette
09:46 c/2762: scanf and sscanf failed to handle floating point values hhuang
09:18 libiberty doesn't build with a K+R compiler Zack Weinberg
09:06 Re: preprocessor/2677 neil
08:26 c++/2761: template<class c> A: public Container<c> { iterator a; } gives a syntax error with -pedantic/compiles without it lachaume
08:07 RE: FW: Internal compiler error Sree
06:57 Bug Report (Float --> Integer Inplace Conversion Precision Problem) David Welling
06:26 target/2760: Error compiling gcc 2.95.3 with HP-UX C compiler frediano.ziglio
06:06 c++/2759: messes up struct/class keywords lachaume
05:16 c++/2758: gcc 3.0 20010506 generates wrong code with -O2 matze
04:28 Re: C++ bug 764 Gabriel Dos Reis
00:08 Re: objc: SIGSEGV (in gdb only) during module loading Michael Scheibler

May 06, 2001
23:36 target/2757: CVS snapshots don't build on i386-pc-solaris2.8 jrhett
23:26 c++/2756: g++ says Internal compiler error marchesi
23:22 Re: PR180 Phil Edwards
22:50 PR 1513: HP-UX: deleted {pro,epi}logue insns: Ok in 3.0 prerelease rbrown64
21:36 c/2755: snapshot releases ICE on legal mozilla C code, gcc 2.95.3 does not motrei
19:46 c/2754: "Internal error: Segmentation fault" w/ minor syntax problem j-waldby
19:26 web/2753: gnatsweb requires cookies without saying so j-waldby
17:16 c++/2752: template function is not instantiated florin
14:26 Re: New trunk breakage on mips-sgi-irix6.2 stage1 compiling libgcc2 Alexandre Oliva
14:06 Re: New trunk breakage on mips-sgi-irix6.2 stage1 compilinglibgcc2 Mark Mitchell
14:04 c++/3.0: -pedantic makes an error a warning? Franz Sirl
12:44 Re: New trunk breakage on mips-sgi-irix6.2 stage1 compiling libgcc2 Alexandre Oliva
11:41 Re: New trunk breakage on mips-sgi-irix6.2 stage1 compilinglibgcc2 Mark Mitchell
11:20 Re: New trunk breakage on mips-sgi-irix6.2 stage1 compiling libgcc2 Alexandre Oliva
11:19 Re: New trunk breakage on mips-sgi-irix6.2 stage1 compiling libgcc2 Alexandre Oliva
10:53 Re: New trunk breakage on mips-sgi-irix6.2 stage1 compilinglibgcc2 Mark Mitchell
10:35 Re: 3_0-branch bootstrap failure on i686-pc-linux-gnu Alexandre Oliva
10:35 Re: New trunk breakage on mips-sgi-irix6.2 stage1 compiling libgcc2 Alexandre Oliva
09:23 Re: pa __builtin_return_addr law
07:27 Re: [3.0 branch] libjava testsuite, i686-pc-linux-gnu --disable-shared Bryce McKinlay
06:36 c/2751: Spurious warnings in gcc 2.95.3 <stdarg.h> include files mtodorov
04:35 Optimization bug in current GCC CVS mainline Andreas Jaeger
01:06 c/2750: Bug: Internal compiler error in `gen_tagged_type_instantiation_die' johan_np

May 05, 2001
23:16 c++/2749: Internal compiler error while using template alexvn
16:50 RE: g77 run-time error when using FILE='con' Billinghurst, David (CRTS)
16:06 c/2748: Solaris, pointers and accessing memory with them. tonyhoyt
15:59 Re: C++ bug 764 Martin Sebor
15:04 g77 run-time error when using FILE='con' Nick Holford
10:08 PR180 Neil Booth
08:36 c++/2747: g++ crashes on illegal code template<...> typename dd; lachaume
06:26 libgcj/2746: Bundled zip overvrites higher versioned zip in /usr/local/bin/zip mtodorov
06:16 libgcj/2745: Recompiles after successful 'gmake' when 'gmake install' is tried mtodorov
06:06 c++/2744: @ causes ice in read_token Peter Schmid
05:41 pa __builtin_return_addr Alan Modra

May 04, 2001
15:06 c++/2743: Compile error when exception in throw clause not qualified gdlxn
14:30 Re: Bad error message for non-existent multiply included headers Neil Booth
13:16 c++/2741: GCC bug: compiler takes almost a minute and 350 MB to compile this bitti
12:09 Re: possible gcc bug: compilation problem kdelibs/arts & gcc 3.0 Franz Sirl
11:48 Re: possible gcc bug: compilation problem kdelibs/arts & gcc 3.0 Joseph S. Myers
11:41 Re:unreviewed bug:c++/v2.97 ice when inner template arg has default Larry Evans
11:37 Re: possible gcc bug: compilation problem kdelibs/arts & gcc 3.0 Alexandre Oliva
11:36 Re: internal error in gcc-2.96 Alexandre Oliva
11:32 strange i386 floating point behavior Brian Makin
10:45 Re: possible gcc bug: compilation problem kdelibs/arts & gcc 3.0 Gerald Roth
08:31 Re: objc: SIGSEGV (in gdb only) during module loading Ovidiu Predescu
08:16 c++/2739: g++ allows accessing a private member dmuell
08:16 c++/2738: ICE on return type specification of a destructor wolfgang.bangerth
08:06 libgcj/2737: User-defined thrown exception is not found jddahl
07:05 Re: [3.0 branch] libjava testsuite, i686-pc-linux-gnu --disable-shared Andrew Haley
06:48 internal error in gcc-2.96 joop renes
05:56 bug 2474 and cxa_atexit Nathan Sidwell
05:31 RE: FW: Internal compiler error Sree
04:40 Re: 3_0-branch bootstrap failure on i686-pc-linux-gnu Gerald Roth
04:23 C++ bug 764 Nathan Sidwell
01:30 Re: [PATCH] t-freebsd (assert and -fPIC) Vladimir A Merzliakov
01:02 objc: SIGSEGV (in gdb only) during module loading Michael Scheibler

May 03, 2001
22:59 Re: [3.0 branch] libjava testsuite, i686-pc-linux-gnu --disable-shared Bryce McKinlay
22:58 thread header problem on Solaris with 3.0-20010430 Mike Eberdt
21:33 RE: FW: Internal compiler error Sree
21:26 c/2735: can't cast a union type defined by a typedef to itself cowan
19:47 Re: New trunk breakage on mips-sgi-irix6.2 stage1 compiling libgcc2 Kaveh R. Ghazi
18:36 other/2734: compile problem on powerpc-linux laforge
17:46 Re: New trunk breakage on mips-sgi-irix6.2 stage1 compiling libgcc2 Richard Kenner
16:09 RE: New trunk breakage on mips-sgi-irix6.2 stage1 compiling libgcc2 Billinghurst, David (CRTS)
16:06 Re: New trunk breakage on mips-sgi-irix6.2 stage1 compiling libgcc2 Alexandre Oliva
15:57 New trunk breakage on mips-sgi-irix6.2 stage1 compiling libgcc2 Kaveh R. Ghazi
15:11 Re: solaris2 libjava 500 failures Jeff Sturm
15:10 Re: PATCH: Re: jartool.c:539: undefined reference to `strdup' John David Anglin
13:24 boehm-gc/os_dep.c problems Andreas Jaeger
13:22 Re: 3_0-branch bootstrap failure on i686-pc-linux-gnu Alexandre Oliva
13:22 Re: PATCH: Re: jartool.c:539: undefined reference to `strdup' Tom Tromey
13:16 c++/2733: (PR C++/2717 continued) GCC (3_0-branch) fails to compile correct code (kdelibs/arts/flow/convert.cc) gerald.roth
13:06 target/2732: Interaction with Solaris assembler and SPARCV9 instructions nathan
13:03 Re: output_operand: floating constant misused. Toon Moene
11:26 Re: PATCH: Re: jartool.c:539: undefined reference to `strdup' John David Anglin
11:16 Bad error message for non-existent multiply included headers Matt Kraai
10:53 Re: PATCH: Re: jartool.c:539: undefined reference to `strdup' Alexandre Oliva
10:43 Re: PATCH: Re: jartool.c:539: undefined reference to `strdup' Tom Tromey
10:37 Re: PATCH: Re: jartool.c:539: undefined reference to `strdup' John David Anglin
10:26 java/2731: jartool.c:539: undefined reference to `strdup' dave.anglin
10:13 Re: PATCH: Re: jartool.c:539: undefined reference to `strdup' Alexandre Oliva
10:06 Re: jartool.c:539: undefined reference to `strdup' Tom Tromey
10:06 libgcj/2730: -d and --output-class-dir= fail to place the .o file in the output dir jddahl
09:57 PATCH: Re: jartool.c:539: undefined reference to `strdup' John David Anglin
09:50 Re: [3.0 branch] libjava testsuite, i686-pc-linux-gnu --disable-shared Andrew Haley
09:38 Re: output_operand: floating constant misused. Franz Sirl
09:16 jartool.c:539: undefined reference to `strdup' John David Anglin
08:48 Re: output_operand: floating constant misused. Mark Mitchell
08:43 Re: FW: Internal compiler error William C. Cox
08:42 Re: possible gcc bug: compilation problem kdelibs/arts & gcc 3.0 Alexandre Oliva
08:27 Re: possible gcc bug: compilation problem kdelibs/arts & gcc 3.0 Gerald Roth
07:57 Re: FW: Internal compiler error Alexandre Oliva
07:56 c++/2729: internal error on implicitly inlining a static template member function andreas.ames
07:51 FW: Internal compiler error Sree
06:47 Re: FYI, recent gcc vs. glibc's `#define printf(...' vs texinfo-4.0b karl
06:34 Re: possible gcc bug: compilation problem kdelibs/arts & gcc 3.0 Franz Sirl
05:53 Re: possible gcc bug: compilation problem kdelibs/arts & gcc 3.0 Gerald Roth
05:07 Re: objc/2713: Most objc tests fail on solaris2 w/missing thread functions Rainer Orth
05:06 c/2728: Linux 2.4.4-ac3, asm problem in asm-i386/rwsem.h using gcc 3.0 CVS Christian Iseli
04:45 Re: 3_0-branch bootstrap failure on i686-pc-linux-gnu Alexandre Oliva
04:32 Re: possible gcc bug: compilation problem kdelibs/arts & gcc 3.0 Alexandre Oliva
04:06 c++/2726: g++ crash with template classes with tow version of operator& boehme
04:06 c++/2727: g++ crash with template classes with tow version of operator& boehme
03:41 Re: FYI, recent gcc vs. glibc's `#define printf(...' vs texinfo-4.0b Geoff Keating
03:30 Re: solaris2 libjava 500 failures Alexandre Oliva
03:20 Re: solaris2 libjava 500 failures Alexandre Oliva
03:06 target/2725: Trouble using -mipsX without -mabi on IRIX reichelt
02:46 preprocessor/2724: trouble with ' and " between #if 0 and #endif reichelt
02:36 other/2722: Option -MD does not work in gcc>2.95 in some cases vignani
02:36 c++/2723: exception handling jle
02:25 How to deal with bugs in 2.95.3? Reichelt
01:26 c/2721: Linux kernel 2.4.4 compile failure dmuell
01:02 Re: FYI, recent gcc vs. glibc's `#define printf(...' vs texinfo-4.0b Nathan Sidwell
00:39 Re: solaris2 libjava 500 failures Geoff Keating
00:27 PR 1978: 2.95.2 on HP-UX: Still in 2.95.3: Ok in 3.0 prelease rbrown64
00:20 Re: solaris2 libjava 500 failures Jeff Sturm

May 02, 2001
19:58 Re: FYI, recent gcc vs. glibc's `#define printf(...' vs texinfo-4.0b Alexandre Oliva
19:58 Re: bug when overloading delete with multiple parameters Alexandre Oliva
19:58 Re: solaris2 libjava 500 failures Alexandre Oliva
19:58 Re: gcc error Alexandre Oliva
19:16 libstdc++/2720: cin input truncated if istream.clear() used in cases on "ind" and "ix" only carlsonjf
19:04 Re: Bug in demangler Carlo Wood
14:46 other/2719: demangler crash tromey
14:46 other/2718: in zlib: configure: error: can not find install-sh or install.sh in .. ./.. p.katzmann
14:45 Re: Bug in demangler Tom Tromey
14:45 Re: FYI, recent gcc vs. glibc's `#define printf(...' vs texinfo-4.0b Zack Weinberg
14:30 Re: Bug in demangler Mark Mitchell
14:07 output_operand: floating constant misused. Toon Moene
13:11 Re: FYI, recent gcc vs. glibc's `#define printf(...' vs texinfo-4.0b Neil Booth
12:58 Re: [3.0 branch] libjava testsuite, i686-pc-linux-gnu --disable-shared Alexandre Petit-Bianco
12:48 Re: FYI, recent gcc vs. glibc's `#define printf(...' vs texinfo-4.0b Ben Collins
12:36 c++/2717: g++ fails to compile code that should be correct gerald.roth
11:06 objc/2716: libgcc_s.so not installed correctly rfm
10:20 Re: mainline bootstrap failure on i686-pc-linux-gnu Jeffrey Oldham
10:16 libgcj/2715: Can't compile on Redhat 6.2 jddahl
10:03 FYI, recent gcc vs. glibc's `#define printf(...' vs texinfo-4.0b Jim Meyering
09:36 debug/2714: Stabs truncated on AIX jcownie
09:29 gcc error Y V
08:56 objc/2713: Most objc tests fail on solaris2 w/missing thread functions ghazi
08:46 c++/2712: ICE on a relative simple intruction. claude.simon
08:17 Re: GCC 3.0 Status Report Toshi Morita
06:44 template related(?) internal g++ error Christoph Strebin
06:17 Re: [3.0 branch] libjava testsuite, i686-pc-linux-gnu --disable-shared Andrew Haley
05:55 Re: [3.0 branch] libjava testsuite, i686-pc-linux-gnu --disable-shared Joseph S. Myers
05:55 Internal compiler error Andre Poenitz
04:29 bug when overloading delete with multiple parameters Thorsten Schmitt
04:25 Branch bootstrap failure in libffi (Sun solaris 2.7) Wolfgang Bangerth

May 01, 2001
23:52 Re: solaris2 libjava 500 failures Jeff Sturm
20:34 Bug in demangler Tom Tromey
18:02 Re: Error building gcc-2.95.2 Alexandre Oliva
17:58 re: c/2466 Testsuite failure gcc.c-torture/execute/loop-2b.c -O2 Billinghurst, David (CRTS)
17:36 c++/2711: ice in c_expand_expr (namespace directive) Peter Schmid
16:39 Re: mainline bootstrap failure on i686-pc-linux-gnu Zack Weinberg
16:36 c++/2710: Internal compiler error in c_expand_expr, at c-common.c:4271 wanderer
16:03 Error building gcc-2.95.2 James L Peterson
15:42 bug report for gcc Atakan Gurkan
14:18 Re: ICE gcc-3_0-branch in java code 1 May 2001 Jeffrey Oldham
14:12 Exception handler table entries lost David Capshaw
14:11 Haifa scheduler access uninitialized memory David Capshaw
13:50 Re: g77 Bug Toon Moene
13:46 Not implemented in gcc 2.95.2 Lloyd J. Lewins
13:36 c++/2709: Ice in remove_unnecessary_notes (gcc 2.95 regression) Peter Schmid
13:34 Re: missing quotes in gcc/Makefile.in (stmp-fixinc) Alexandre Oliva
13:16 c++/2708: ambiguity check fails for namespace vs class scope jungman
12:45 g77 Bug Rob McDonald
12:13 Re: Bug in using overloaded functions in derived classes Phil Edwards
12:07 Bug in using overloaded functions in derived classes Lloyd J. Lewins
11:59 Re: Namespace std::rel_ops not defined in stdlibc++-v3 Phil Edwards
11:40 Internal compiler error in c_expand_expr, at c-common.c:4271 Andreas Jaeger
11:25 Re: C++ compiler assertion errors Jim Wilson
11:08 mainline bootstrap failure on i686-pc-linux-gnu Matt Kraai
11:06 c/2707: gcc does not warn on truncate jhabermann
10:58 Namespace std::rel_ops not defined in stdlibc++-v3 Lloyd J. Lewins
06:46 preprocessor/2706: #defines expanded when -fpreprocessed given nathan
04:01 Re: C++ compiler assertion errors Nelson H. F. Beebe
02:56 c/2705: Struct arguments passed incorrectly on Origin 2000 bonachea
01:57 Re: Exploring the option to submit the CR16 compiler sourcecodeto GNU Gali Carmel


Indexes: [Date Index] [Subject Index] [Author Index] [Thread Index]
Site Nav: [Browse other archives for this mailing list]
[Browse other mailing lists at this site]
Search: Limit to:

Mail converted by MHonArc 2.4.7