gcc-bugs archive
date index for March, 2001

This is the mail archive of the gcc-bugs@gcc.gnu.org mailing list for the GCC project.

Indexes: [Date Index] [Subject Index] [Author Index] [Thread Index]
Site Nav: [Browse other archives for this mailing list]
[Browse other mailing lists at this site]
Search: Limit to:

March 31, 2001
21:46 other/2448: Bus errors on Solaris 8 vivienm
19:39 RE: irix bootstrap dies in builtins.c Billinghurst, David (CRTS)
19:25 Re: g++ make check failure on sparc-sun-solaris2.8 Brad Lucier
18:59 Re: libstdc++: "unable to detect exception model" Phil Edwards
18:34 Re: Internal compiler error (cygwin) Christopher Faylor
18:21 Re: Internal compiler error (cygwin) Dave Korn
18:03 Re: GCC-H8300: build failure Toshi Morita
17:42 Re: Internal compiler error (cygwin) Christopher Faylor
17:26 c++/2447: g++ don't handle execption when using with -fomit-frame-pointer chmouel
17:03 Re: Internal compiler error (cygwin) Dave Korn
15:58 Re: g++ make check failure on sparc-sun-solaris2.8 Benjamin Kosnik
14:56 c/2446: error compiling example code for getopt andriesb
14:26 libstdc++/2445: undefined reference to `std::errno' Michael Elizabeth Chastain
12:44 Re: g++ make check failure on sparc-sun-solaris2.8 Brad Lucier
12:39 Re: g++ make check failure on sparc-sun-solaris2.8 Brad Lucier
12:36 preprocessor/2444: Internal error, <new> vs a directory named 'new' porten
10:26 Re: Internal compiler error (cygwin) Michael Elizabeth Chastain
10:26 c++/2443: error while trying to build new kernel linux 2-4-3 kelly
09:47 Re: libstdc++: "unable to detect exception model" Richard Henderson
08:53 Re: g++ make check failure on sparc-sun-solaris2.8 Zack Weinberg
08:40 g++ make check failure on sparc-sun-solaris2.8 lucier

March 30, 2001
23:00 Re: 3.1 Bootstrap failure on Solaris 2.8 Zack Weinberg
20:25 Re: libstdc++: "unable to detect exception model" Phil Edwards
18:07 libstdc++: "unable to detect exception model" Phil Edwards
17:51 Re: stacktrace on ld segfault Alan Modra
16:56 Re: [dave@hiauly1.hia.nrc.ca: Incorrect file name simplication] John David Anglin
16:35 Re: stacktrace on ld segfault Toshi Morita
16:06 libgcj/2441: RegisterNatives fails without interpreter tromey
15:56 c++/2440: istringstream problems after eof encountered ian.wakeling
15:51 stacktrace on ld segfault Kervin Pierre
14:15 Re: GCC 2.95.3 Bug? Alexandre Oliva
13:51 GCC 2.95.3 Bug? Tom Browder
13:44 Re: 3.1 Bootstrap failure on Solaris 2.8 Brad Lucier
13:38 Re: 3.1 Bootstrap failure on Solaris 2.8 Alexandre Oliva
12:45 Sequence matters! GCC bug? Yu Qian Zhou
10:01 Re: [dave@hiauly1.hia.nrc.ca: Incorrect file name simplication] Zack Weinberg
09:53 Re: [dave@hiauly1.hia.nrc.ca: Incorrect file name simplication] John David Anglin
09:51 Re: [dave@hiauly1.hia.nrc.ca: Incorrect file name simplication] Zack Weinberg
09:28 Re: 3.1 Bootstrap failure on Solaris 2.8 Zack Weinberg
09:24 Re: [dave@hiauly1.hia.nrc.ca: Incorrect file name simplication] Neil Booth
09:05 Re: xgcc: Internal error: Segmentation fault (program as) Zack Weinberg
08:48 Re: bootstrap failure i686-pc-linux-gnu Alexandre Oliva
08:43 Re: bootstrap failure i686-pc-linux-gnu Jeffrey Oldham
08:06 objc/2438: Internal compiler error when compiling Objective C code prikryl
07:56 c++/2437: template name binding problem kenny.simpson
07:54 Bug report Abhishek Sharma-RollNo.2000-1
07:18 Link Mario
07:17 Link Mario
06:49 Re: Cannot bootstrap mainline compiler on i686-pc-linux-gnu Graham Stott
06:04 Re: c/2386: gcc -mcpu=ultrasparc SIGSEGV's on some code involvinglong long and pointers. Bernd Schmidt
06:02 Re: irix bootstrap dies in builtins.c Kaveh R. Ghazi
05:58 Cannot bootstrap mainline compiler on i686-pc-linux-gnu Peter Schmid
05:47 Re: c++/2296: gcc-2.95.3.test3: internal error--unrecognizable insn: Bernd Schmidt
05:44 GCC-H8300: build failure Toshi Morita
05:18 Re: gcc 2.95.3 [not pre-3.x]: gmp powm incorrect i686 code Bernd Schmidt
02:03 bootstrap failure i686-pc-linux-gnu Nathan Sidwell
02:00 Re: -I/usr/include Nathan Sidwell
01:56 c++/2434: Compilation with large file support (solaris & aix) pnobili
01:49 Re: cout undefined symbol Alexandre Oliva
01:46 optimization/2433: wrong function param handling in UltraSPARC optimized code gawrilow
01:45 Re: -I/usr/include Joseph S. Myers
01:39 -I/usr/include Nathan Sidwell
01:06 c++/2432: "c++ -O t_010330_1.c && ./a.out" fails, without "-O" the test runs o.k. Andreas.Krakowczyk
00:56 RE: cout undefined symbol Krishna Mohan
00:26 Re: cout undefined symbol Alexandre Oliva
00:26 libgcj/2431: static initializers torsten.rueger
00:16 c++/2430: subscripting very much slower than pointer arithmetic warren
00:13 RE: irix bootstrap dies in builtins.c Billinghurst, David (CRTS)
00:10 RE: cout undefined symbol Krishna Mohan

March 29, 2001
23:28 RE: cout undefined symbol Krishna Mohan
23:26 libgcj/2429: java.text.MessageFormat broken torsten.rueger
23:20 Re: irix bootstrap dies in builtins.c Richard Henderson
23:11 Re: Internal compiler error (cygwin) Zack Weinberg
23:08 Re: Seg Fault when I compile latest cvs of 3.0 branch.. Alan Modra
22:43 Re: QT Compile Error Alexandre Oliva
22:33 Re: cout undefined symbol Daniel Berlin
22:30 cout undefined symbol Krishna Mohan
22:28 Internal compiler error (cygwin) Thomas Henlich
22:26 libgcj/2428: Classloader is not set torsten.rueger
22:18 [dave@hiauly1.hia.nrc.ca: Incorrect file name simplication] Neil Booth
22:03 Seg Fault when I compile latest cvs of 3.0 branch.. JorgP
20:48 irix bootstrap dies in builtins.c Billinghurst, David (CRTS)
20:46 target/2427: Extra loop failures with -mcpu=athlon Joseph Myers
19:45 java/2424: gjc thinks a final variable is reassigned when it is not sdlee
19:45 java/2423: false reporting of "Final variable initialization error" in constructor sdlee
19:34 gcc version 3.1 20010320 internal compiler error (1/2) nbecker
19:34 gcc version 3.1 20010320 internal compiler error (2/2) nbecker
18:36 Re: xgcc: Internal error: Segmentation fault (program as) Alan Modra
18:11 Incorrect file name simplication John David Anglin
18:11 Re: [dave@hiauly1.hia.nrc.ca: Incorrect file name simplication] John David Anglin
18:11 Re: [dave@hiauly1.hia.nrc.ca: Incorrect file name simplication] John David Anglin
18:11 Re: [dave@hiauly1.hia.nrc.ca: Incorrect file name simplication] John David Anglin
18:10 QT Compile Error Lari S J Huttunen
17:56 Re: [dave@hiauly1.hia.nrc.ca: Incorrect file name simplication] Zack Weinberg
17:56 c++/2422: Adding PlutoTimeValue::operator timeval(void) const causes Internal compiler error in `fixup_var_refs_1', at function.c:2070 drew
12:07 gcc-3.0 dwarf2 debug abort Alan Modra
11:55 -O1 thru -O3 produce fatally bad code for System/390 using 2.95.2 Leigh Clayton

March 28, 2001
18:06 Re: 3.1 Bootstrap failure on Solaris 2.8 Alexandre Oliva
17:56 Re: 3.1 Parallel build failure on sparc Alexandre Oliva
17:56 c++/2421: can't declare ordinary nested class as friend of template class jhl
17:37 RE: GCC-H8300: major problems with -mint32 Kazu Hirata
16:47 GCC 2.95.3 and LIBC Tom Browder
16:32 Re: xgcc: Internal error: Segmentation fault (program as) Alan Modra
15:40 Re: 3.1 Parallel build failure on sparc Bryce McKinlay
15:37 Re: 3.1 Bootstrap failure on Solaris 2.8 Jeffrey Oldham
15:33 Re: 3.1 Bootstrap failure on Solaris 2.8 Jeffrey Oldham
15:24 Re: xgcc: Internal error: Segmentation fault (program as) amylaar
15:22 Re: 3.1 Bootstrap failure on Solaris 2.8 Alexandre Oliva
15:22 Re: 3.1 Parallel build failure on sparc Alexandre Oliva
15:22 Re: 3.1 Bootstrap failure on Solaris 2.8 Alexandre Oliva
15:22 Re: gd-2.0.0 triggers gcc 2.95.3 internal bug at build Alexandre Oliva
15:13 Re: xgcc: Internal error: Segmentation fault (program as) H . J . Lu
15:03 Re: GCC-H8300: major problems with -mint32 Toshi Morita
14:57 Re: xgcc: Internal error: Segmentation fault (program as) Zack Weinberg
14:20 DJGPP bootstrap failure: frame.h not found Mark E.
14:15 GCC-H8300: major problems with -mint32 Toshi Morita
14:13 Re: 3.1 Bootstrap failure on Solaris 2.8 Zack Weinberg
14:12 xgcc: Internal error: Segmentation fault (program as) Zack Weinberg
13:46 c/2420: Internal compiler error received compiling mkreiserfs.c mark.post
13:40 Re: 3.1 Bootstrap failure on Solaris 2.8 Brad Lucier
13:29 Re: 3.1 Bootstrap failure on Solaris 2.8 Zack Weinberg
13:07 Re: 3.1 Parallel build failure on sparc Mark Mitchell
13:06 bug report with mingw Lloyd Dupont
12:46 c/2419: GCC 2.96 FP bit manipulation snafu cchen
12:40 Re: 3.1 Bootstrap failure on Solaris 2.8 Brad Lucier
12:36 Re: 3.1 Bootstrap failure on Solaris 2.8 Jeffrey Oldham
12:29 Re: 3.1 Parallel build failure on sparc Alexandre Oliva
11:56 c++/2418: Internal compiler error reported when unbalanced parentheses are encountered. blackw
11:47 3.1 Bootstrap failure on Solaris 2.8 Brad Lucier
11:05 gcc 3.1 build failure for i686-pc-linux-gnu Jeffrey Oldham
10:19 3.1 Parallel build failure on sparc Brad Lucier
09:50 gcc-core 2.95.2 and 2.95.3 install failures on HP-UX 10.20 Lou Biskup
09:34 Re: SEGV eh throw in shared lib with ARM cross-GCC Philip Blundell
09:06 c++/2417: GCC 2.95.3 gives internal compiler error imad.ossaily
09:06 target/2416: asm error while compiling gcc-2.95.3 on AIX-4.3.3.6 ogernand
08:54 optimization/412 probably fixed Jan Vroonhof
08:46 optimization/2415: ICE (regression 2.95.2->gcc3.0) when compiling fdlibm Jan Vroonhof
08:13 gd-2.0.0 triggers gcc 2.95.3 internal bug at build Eugene Leitl
06:46 c++/2413: Under AIX 4.3.0: Global object constructors not executed jerry.terlouw
03:56 java/2412: jv-scan reports parse error Mika.Riekkinen
02:56 other/2411: 2.95.2 runs, change in .h leads to compile error of 2.95.3 ckrackowiz

March 27, 2001
20:16 c++/2410: ICE caused by mismatched class types on externs matt
19:48 ld: Duplicate symbols are not allowed in shared libraries John David Anglin
19:36 other/2409: Tests g++.old-deja/g++.mike/p3708*.C crash dejagnu on cygwin David.Billinghurst
18:16 fortran/2408: g77.f-torture/execute/short.f -Os failure David.Billinghurst
17:36 optimization/2407: compile fails in emit_move_insn_1 if optimization is on (-O) cmg
17:30 Re: COM binary compatibility Phil Edwards
17:18 Re: COM binary compatibility Pierre Phaneuf
16:56 c++/2406: == operator does not work on vector<class x> Joe Buck
16:51 GCC-H8300: Internal compiler error in find_reloads Toshi Morita
16:49 Re: COM binary compatibility Phil Edwards
16:07 SEGV eh throw in shared lib with ARM cross-GCC Michael Eager
16:05 Re: c++/2405: "using std::rel_ops" blows up std::vector Joe Buck
14:36 COM binary compatibility Pierre Phaneuf
14:36 c++/2405: "using std::rel_ops" blows up std::vector jbuck
14:03 Re: c/2403: Bug in __mulhi3 causes it to give wrong answer for certain values for Atmel AVR Target Toshi Morita
12:46 c/2404: arm-linux-gcc ice bkohlen
12:26 c/2403: Bug in __mulhi3 causes it to give wrong answer for certain values for Atmel AVR Target lee
12:09 Re: make clean doesn't in current cvs Laurynas Biveinis
10:41 Code generation bug in 2.95.2 Ruediger Schuetz
09:57 Re: gcc using clobbered register as input with inline assembly Timur Tabi
09:40 Re: Cross Compiler for MIPS ! Steven J. Hill
09:38 Re: libstdc++/2383: Problems with istrstream Martin Sebor
05:46 c++/2402: Problem with compile-time sizeof evaluation and templates stephen
04:46 c++/2401: Internal compiler error in `scan_region', at except.c:2566 adam
04:11 Re: 2.95.3 destruction in Linux header Bernd Schmidt
04:07 Re: gcc using clobbered register as input with inline assembly Bernd Schmidt
03:06 java/2400: Linked list don't compile torsten.rueger

March 26, 2001
21:46 optimization/2399: 23 superflouis moves in a C++ function that needs 1 crosby
21:46 c++/2398: external name gets put in wrong namespace snyder
19:56 c/2397: big char array causes segfault vkire
18:56 Re: bad interaction between inlining and sibcall optimization? Richard Henderson
18:44 Re: bad interaction between inlining and sibcall optimization? Richard Henderson
17:41 Anonymous union assignment problem: ok now Stefan Westerfeld
16:26 c/2396: ARM/thumb 5th function argument access problem ted
14:06 target/2395: x86_64 opcode generated for i686 drepper
12:55 Re: V3: irix6.5 g++ tests fail due to unresolved symbols Benjamin Kosnik
12:28 Re: 2.95.3 destruction in Linux header Bruce Korb
12:18 template and friend and overload Woody Lichtenstein
12:13 Re: gcc using clobbered register as input with inline assembly Zack Weinberg
11:56 Re: gcc using clobbered register as input with inline assembly Timur Tabi
11:39 Re: gcc using clobbered register as input with inline assembly Zack Weinberg
11:26 Anonymous union assignment problem Stefan Westerfeld
11:20 Re: 2.95.3 destruction in Linux header Stephen L Moshier
11:08 Re: gcc using clobbered register as input with inline assembly Timur Tabi
11:05 Re: gcc using clobbered register as input with inline assembly Zack Weinberg
10:38 Re: gcc using clobbered register as input with inline assembly Timur Tabi
10:36 c/2394: -O2 -mcpu=ultrasparc can generate std's to non-8-byte aligned stack offsets grubba
10:20 Re: gcc using clobbered register as input with inline assembly Zack Weinberg
09:41 gcc using clobbered register as input with inline assembly Timur Tabi
09:21 Re: Cross Compiler for MIPS ! Eric Christopher
09:18 Re: [PATCH] gcc/Makefile.in gcc-3_0-branch, pass CFLAGS to stage1_build Franz Sirl
09:16 c++/2393: Missing constant value for array bounds yields "internal compiler error" Bill.R.Emshoff
08:36 Re: [PATCH] gcc/Makefile.in gcc-3_0-branch, pass CFLAGS to stage1_build Richard Earnshaw
08:07 Re: bad interaction between inlining and sibcall optimization? David Mosberger
07:56 c/2392: mcpu=ultrasparc causes internal compiler error signal 11 somervil
06:08 change stack size Simon Pesant
05:53 Re: ICE in find_reloads Jan Hubicka
05:51 Re: ICE in find_reloads Bernd Schmidt
05:43 Re: ICE in find_reloads Jan Hubicka
05:01 Re: 2.95.3 destruction in Linux header Bernd Schmidt
04:58 gcc-2.95.2: "(unsigned char) < 256" Ulrich Windl
04:45 Re: ICE in find_reloads Jan Hubicka
04:39 Re: ICE in find_reloads Jan Hubicka
04:38 Re: ICE in find_reloads Bernd Schmidt
03:39 Bug fix missed in gcc-2.95.3 (and gcc-2.95.2) Adam J. Richter
02:36 optimization/2391: Exponential compilation time explosion in combine Richard Earnshaw

March 25, 2001
23:44 Cross Compiler for MIPS ! Nazim Khan
22:00 Re: bad interaction between inlining and sibcall optimization? law
20:22 V3: irix6.5 g++ tests fail due to unresolved symbols Billinghurst, David (CRTS)
19:58 gcc bug: compoiler generates code that causes core dump david
17:46 c/2389: Segmentation fault ppar2357
16:26 libgcj/2388: Problems on cygwin. Case insensitive file system? David.Billinghurst
16:00 Re: c/2381: conflicting types for `va_list' (Solaris 8 Intel) Carlo Wood
14:26 c++/2387: Bad codegen for static local references jason_merrill
13:58 Re: Undefined references to `std::locale::id::_S_highwater' Michael Elizabeth Chastain
12:46 c/2386: gcc -mcpu=ultrasparc SIGSEGV's on some code involving long long and pointers. grubba
12:11 Re: Undefined references to `std::locale::id::_S_highwater' Jason Merrill
10:07 Re: -pg vs regparm(2) on linux Zack Weinberg
09:56 target/2385: [ARM; regression from 2.95] Internal compiler error in find_reloads philb
09:36 Re: 2.95.3 destruction in Linux header Stephen L Moshier
08:36 c++/2384: Class that throws itself Peter Schmid
08:36 libstdc++/2383: Problems with istrstream schmid
08:26 java/2382: libjava's testsuite returns error case aj
04:56 c/2381: conflicting types for `va_list' (Solaris 8 Intel) Peter_Darren_Bray
02:40 Re: Undefined references to `std::locale::id::_S_highwater' Michael Elizabeth Chastain
02:06 c++/2380: Compiling the Crypto++ "bench.cpp" Causes g++ to Segfault dew
01:54 Re: -pg vs regparm(2) on linux Doug Evans
01:50 Re: -pg vs regparm(2) on linux Richard Henderson
01:43 Re: -pg vs regparm(2) on linux Doug Evans
01:30 Re: -pg vs regparm(2) on linux Richard Henderson

March 24, 2001
23:08 Undefined references to `std::locale::id::_S_highwater' Michael Elizabeth Chastain
23:06 fortran/2379: sin anc cos functions result in undefined __builtin_sin/cos jaakko.hyvatti
22:56 other/2378: gcc fails bootstrap with error 139 on s- dan
17:10 Re: farg Martin Sebor
15:43 Re: 2.95.3 destruction in Linux header Stephen L Moshier
15:14 Re: 2.95.3 destruction in Linux header Geoff Keating
14:50 -pg vs regparm(2) on linux Doug Evans
12:29 Re: Optimizer bug -- known? Alexandre Oliva
12:26 debug/2377: Segfault in dbxout.c:1013 schmid
12:22 Re: 2.95.3 destruction in Linux header Stephen L Moshier
12:11 Optimizer bug -- known? Mike Oliver
10:46 c++/2376: g++ generates internal compiler error when building KDE-2.1 timp
10:26 java/2375: static inner class doesn't find inherited methods joerg_brunsmann
10:02 Local types and template template members Jean-Paul Rigault
09:41 Re: farg Carlo Wood
07:23 Re: 2.95.3 destruction in Linux header Geoff Keating
06:25 Re: 2.95.3 destruction in Linux header Stephen L Moshier
06:16 c++/2374: template class inheriting from template template parameter Richter.Jens
04:44 farg Maciej Hrebien
03:56 c++/2373: Exception rethrow in function-try-block Frank.Uepping

March 23, 2001
22:50 GCC feature request: attribute((noreturn)) on asm() gcc
20:26 c++/2372: const struct parameter causes incorrect code with -O2. suckfish
19:56 c/2371: Hang with long long function argument. snowball3
17:36 ICE in find_reloads Philipp Thomas
16:21 Re: 2.95.3 destruction in Linux header Stephen L Moshier
15:56 java/2370: Behavior of main compilation without --main is unfriendly Hans_Boehm
15:49 Re: 2.95.3 destruction in Linux header Geoff Keating
15:36 java/2369: --main should check the following symbol Hans_Boehm
15:34 Incorrect diagnostic for missing operator Michael Eager
14:39 2.95.3 destruction in Linux header Stephen L Moshier
13:36 c++/2368: Internal error #92 (catch clauses) schmid
13:04 bad interaction between inlining and sibcall optimization? David Mosberger
12:56 c++/2367: Internal compiler error rwgk
11:29 Re: Problem with Global Objects/Classes and Libraries Marshall H Hamilton
11:13 internal compiler error in `emit_move_insn`,at expr.c:2593 Patricio F. Provasi
10:56 other/2366: The specs file does not pass the argument -xarch=v8plusa to as when compiling with -mcpu=v9 on SunOS 5.x/sparc grubba
10:56 c/2365: gcc 2.95.3 bison and msgfmt problem as108
10:30 Re: Problem with Global Objects/Classes and Libraries Alexandre Oliva
10:04 Re: Problem with Global Objects/Classes and Libraries Marshall H Hamilton
09:49 Re: Still with the Java testsuite failures Zack Weinberg
09:46 compiler-bug Juha Mäkinen
09:46 c++/2364: long long and templates schmid
09:43 RE: 3.0 branch bootstrap failure on irix6.5 Jeffrey Oldham
09:36 libstdc++/2363: objdir with colon causes bootstrap failure Gerald Pfeifer
09:30 Re: gcc 3.0 c++ error (regression) Alexandre Oliva
09:21 Re: Problem with Global Objects/Classes and Libraries Alexandre Oliva
07:46 c++/2362: boost: "gcc can't handle cv-qualified references" schmid
07:06 java/2361: Cannot acces protected field of superclass in a different package mark
07:02 gcc 3.0 c++ error (regression) DJ Delorie
06:46 java/2360: Internal compiler error make_class_data (constant stress test?) scgmille
06:37 build errors for download gcc-2.95.3-tar.gz for host m68k-motorola-sysv Beere, Chris
06:36 java/2358: Inner class extending another in package: Can't find method vegardh
06:36 other/2359: Problem building gcc 2.95.3 on AIX 4.3.3.0 tkalix
05:12 Undefined references to `std::locale::id::_S_highwater ' Roberto Bagnara
05:10 Re: GCC issues with patent US5297284? Jeremy White
05:03 Re: C++ problem enquiry before submition to gnats. Theodore Papadopoulo
04:26 libgcj/2357: HashMap does not handle initialCapacity=0 correctly mark
03:26 Re: gcc-2.95.3 objc segfault Bernd Schmidt
01:56 c++/2356: Wrong "unused parameter" warnings with -W -Wall Matti Rintala
01:42 Re: gcc-2.95.3 objc segfault Yann DRONEAUD
00:54 gcc-2.95.3: g++ optimizer destroys explicit template instantiations Markus Werle

March 22, 2001
23:36 c++/2354: Compiler passes wrong switches to assembler rovf
23:36 libgcj/2355: !#@$!@#^%#$^%&$%&@#$% unhappy
22:16 Re: Still with the Java testsuite failures Bryce McKinlay
20:26 c++/2353: template frient specification causes an internal compiler error john.rusnak
20:16 c++/2352: inheritance on solaris alan_gonzalez
20:10 Re: make clean doesn't in current cvs Colin Howell
19:32 Re: other/2351: can't build gcc-2.95.2 on redhat 7.0 Carlo Wood
18:46 other/2351: can't build gcc-2.95.2 on redhat 7.0 jeff.deifik
17:52 Re: C++ problem enquiry before submition to gnats. Martin Sebor
17:44 RE: c++/2350: constant propagation problem accross function call Billinghurst, David (CRTS)
17:36 c++/2350: constant propagation problem accross function call hankinsr
16:33 Re: makeinfo failure in 2.95.x build Dave Korn
16:29 make clean doesn't in current cvs Mark E.
15:26 c++/2349: Compiler generated copy-constructor generates warning for unused argument. bumgard
15:16 c++/2348: scalar assignment to struct causes compiler crash philb
14:57 gcc 2.95.3 [not pre-3.x]: gmp powm incorrect i686 code Kevin Ryde
13:23 ICE in make_decl_rtl while compiling glibc-2.2.2 Franz Sirl
13:13 C++ problem enquiry before submition to gnats. Theodore Papadopoulo
12:40 makeinfo failure in 2.95.x build Scott Thomason
11:56 Problem with Global Objects/Classes and Libraries Marshall H Hamilton
11:06 c/2347: gcc does not accept "-l m" as POSIX permits (wants -lm) schweikh
11:00 Re: boehm-gc/Makefile.am: What is -shared-gcc? Tom Tromey
10:27 Today's gcc 3.0 from CVS is broken. H . J . Lu
10:26 libstdc++/2346: Problems with seekg (rewind)? schmid
10:11 GCC issues with patent US5297284? Bradley M. Kuhn
09:54 Re: gcc-2.95.3 build failure with 2 different binutils Alexandre Oliva
09:41 Re: merge-with-binutils documentation is wrong/incomplete Alexandre Oliva
09:32 boehm-gc/Makefile.am: What is -shared-gcc? Jeffrey Oldham
08:54 Re: gcc-2.95.3 build failure with 2 different binutils Markus Werle
07:43 Re: merge-with-binutils documentation is wrong/incomplete Markus Werle
07:23 Re: merge-with-binutils documentation is wrong/incomplete Markus Werle
07:16 Re: merge-with-binutils documentation is wrong/incomplete Alexandre Oliva
07:11 Re: ftp updates Alexandre Oliva
07:09 Re: merge-with-binutils documentation is wrong/incomplete Bernd Schmidt
07:07 Re: gcc-2.95.3 build failure with 2 different binutils Alexandre Oliva
07:07 Re: merge-with-binutils documentation is wrong/incomplete Markus Werle
07:06 libstdc++/2345: cin.getline doesn't work on solaris, double enter, and single char read only nneul
07:04 Re: merge-with-binutils documentation is wrong/incomplete Markus Werle
07:02 Re: ftp updates Bernd Schmidt
06:58 Re: merge-with-binutils documentation is wrong/incomplete Bernd Schmidt
06:55 Re: gcc-2.95.3 objc segfault Bernd Schmidt
06:18 cvs: linker problems with hppa2.0w-hp-hpux11.00 Markus Werle
05:49 Re: gcc-2.95.3 build failure with 2 different binutils Markus Werle
05:26 c/2344: gcc-3 crash jes
05:25 ftp updates jnye
04:13 Re: PA move_operand Alan Modra
02:30 Re: gcc-2.95.3 build failure with 2 different binutils Alexandre Oliva
02:17 Re: gcc-2.95.3 build failure with 2 different binutils Markus Werle
02:16 Re: merge-with-binutils documentation is wrong/incomplete Markus Werle
00:56 gcc-2.95.3: internal compiler error during libojc compilation Yann Droneaud

March 21, 2001
22:05 Re: PA move_operand Alan Modra
21:32 Re: PA move_operand law
20:20 PA move_operand Alan Modra
18:02 Re: m68k floating point overwrites vector table Nick Papadonis
14:26 Re: gcc-2.95.3 build failure with 2 different binutils Alexandre Oliva
13:56 target/2342: Build failure of gcc 20010321 for arm-elf larwe
13:16 Re: merge-with-binutils documentation is wrong/incomplete Alexandre Oliva
13:16 c++/2341: Compiler crashes on complex templates with optimization egbert
12:56 c/2340: Internal Error: Segmentation fault mrouthier
11:49 Re: merge-with-binutils documentation is wrong/incomplete Phil Edwards
11:40 Re: Your pushqi1 patch Jan Hubicka
11:14 libiberty (was Re: merge-with-binutils documentation is wrong/incomplete) Phil Edwards
10:44 Your pushqi1 patch Mark Mitchell
10:33 Re: G++ preprocessor problem with unary ## -- summary Neil Booth
10:27 Re: forget my last message Phil Edwards
09:16 cleaning up Mike Stump
09:03 Re: G++ preprocessor problem with unary ## -- summary Dave Martindale
07:47 cvs-tree is buggy/broken on hppa2.0w-hp-hpux11.00 Markus Werle
07:06 fortran/2339: Large Files on IA32 Linux LJPage
06:06 libgcj/2338: RandomAccessFile does not create the file if not found pedro
05:55 Re: gcc-2.95.3 build failure on hppa2.0w-hp-hpux11.00 with 2 different binutils Markus Werle
04:56 target/2337: Incomplete information in release notes rovf
04:35 Re: gcc-2.95.3 build failure on hppa2.0w-hp-hpux11.00 with 2 different binutils Markus Werle
03:26 target/2336: Tru64 5.1, make bootstrap, linking of cc1 fails jeremie_petit
03:13 Re: merge-with-binutils documentation is wrong/incomplete Markus Werle
03:05 Re: gcc-2.95.3 build failure on hppa2.0w-hp-hpux11.00 with 2 different binutils Markus Werle
03:03 gcc-2.95.3 build failure with 2 different binutils Markus Werle
02:56 RE: 3.0 branch bootstrap failure on irix6.5 Billinghurst, David (CRTS)
02:25 Re: merge-with-binutils documentation is wrong/incomplete Joseph S. Myers
02:10 Re: merge-with-binutils documentation is wrong/incomplete Philip Blundell
02:03 Re: merge-with-binutils documentation is wrong/incomplete Joseph S. Myers
01:32 Re: merge-with-binutils documentation is wrong/incomplete Markus Werle
01:26 c++/2334: Bug in C++ C.Galambos

March 20, 2001
22:31 Recent CVS; Next 3.3; bus error in stage2 explained James McKelvey
21:09 Re: is gcc 2.95.2 -pthreads recommended? TC
20:26 java/2333: ICE in mark_reference_fields jsturm
19:05 Re: bug? Need help deciding. Zack Weinberg
19:02 Re: forget my last message Eric Christopher
18:32 forget my last message Vicky Daigle
18:26 bug? Need help deciding. Vicky Daigle
17:51 RE: 3.0 branch bootstrap failure on irix6.5 Billinghurst, David (CRTS)
17:29 Re: is gcc 2.95.2 -pthreads recommended? Benjamin Kosnik
16:40 Re: Problems with cin.getline on solaris 2.x Nathan Neulinger
16:40 is gcc 2.95.2 -pthreads recommended? Martin Sebor
14:43 index.html does not include gcc-2.95.3 Nick Thurn
13:46 java/2332: valid declaration rejected tromey
12:44 Bug report Aleksey Grinchenko
12:36 c/2331: xgcc: Internal compiler error in 'do_spec_1' at ../../gcc2953/gcc/gcc.c:4028 jcheng
12:18 Problems with cin.getline on solaris 2.x Neulinger, Nathan R.
11:57 Re: sys/cdefs.h required by gcc 2.95.3 but not 2.95.2. Why? Bug? Thomas Kaiser
11:54 Re: ../sysdeps/unix/sysv/linux/errlist.c:49: Internalcompiler error in set_decl_assembler_name, at tree.c:218 Mark Mitchell
10:46 Re: G++ preprocessor problem with unary ## Neil Booth
10:26 c++/2330: static_cast<>() to a private base is allowed philippeb
10:21 Re: Dec 30 patch causes large performance regression on ia64 Richard Henderson
09:36 c/2329: Cannot compile simple C program under HP-UX 11.0 rnelson
09:34 Re: sys/cdefs.h required by gcc 2.95.3 but not 2.95.2. Why? Bug? Thomas Kaiser
08:22 Re: Dec 30 patch causes large performance regression on ia64 Graham Stott
07:34 Re: Dec 30 patch causes large performance regression on ia64 Bernd Schmidt
07:14 Re: merge-with-binutils documentation is wrong/incomplete Phil Edwards
07:07 Re: sys/cdefs.h required by gcc 2.95.3 but not 2.95.2. Why? Bug? Bernd Schmidt
05:00 Re: merge-with-binutils documentation is wrong/incomplete Markus Werle
03:58 Re: merge-with-binutils documentation is wrong/incomplete Alexandre Oliva
03:17 Re: merge-with-binutils documentation is wrong/incomplete Markus Werle
02:57 Re: sh-elf newlib broken Alexandre Oliva
02:39 ../sysdeps/unix/sysv/linux/errlist.c:49: Internal compiler error in set_decl_assembler_name, at tree.c:218 Andreas Jaeger
02:37 merge-with-binutils documentation is wrong/incomplete Markus Werle
02:07 Re: G++ preprocessor problem with unary ## Denys Duchier
01:41 link to binutils is missing Markus Werle
00:50 Re: G++ preprocessor problem with unary ## Zack Weinberg
00:34 Re: G++ preprocessor problem with unary ## Dave Martindale
00:22 sh-elf newlib broken John Wehle

March 19, 2001
23:43 Re: G++ preprocessor problem with unary ## Neil Booth
23:26 sys/cdefs.h required by gcc 2.95.3 but not 2.95.2. Why? Bug? TC
23:16 c/2328: ICE in validate_condition_mode on powerpc-unknown-linux-gnu lucier
23:06 c/2327: problem with cross-compiled linux kernel in gcc 3.0 CVS tree lilo
23:02 G++ preprocessor problem with unary ## Dave Martindale
14:30 gcc-20010312, still unable to compile qt 2.2.3 on linux-redhat-alpha Matthias Welwarsky
13:54 bug in -fsyntax-only Harold Levy
13:54 internal compiler error bug in gcc-2.95.3 on solaris-sparc ? robert somerville
12:26 c++/2326: name lookup regression mike
12:16 c++/2325: Small problem cross-compiling the c++ compiler jeffs
11:46 other/2324: Strange error with 'make install' gcc-2.95.2 bartelt
11:16 c++/2322: asdfadf adsf adfadafd pp_mm
10:26 c/2321: gcc: Internal compiler error: program cc1 got fatal signal 11 robert
09:16 c++/2320: incorrect order of destruction of function parameters James.Kanze
09:10 Re: java/2319: invalid UTF-8 sequences should be rejected Tom Tromey
09:01 Re: java/2319: invalid UTF-8 sequences should be rejected Joseph S. Myers
08:36 java/2319: invalid UTF-8 sequences should be rejected tromey
06:02 gcc-2.95.3 objc segfault Yann DRONEAUD
05:36 middle-end/2318: gcc 2.95.3 build ('make boostrap') fails on Tru64 5.1 jeremie_petit
05:07 Re: Dec 30 patch causes large performance regression on ia64 Bernd Schmidt
03:06 optimization/2317: ICE in reload_cse_simplify_operands, at reload1.c:8341 ask

March 18, 2001
23:39 ARM codegen bug Mark Mitchell
18:01 ARM bug Mark Mitchell
17:46 c++/2316: gcc 2.97 fails to overload on language linkage sebor
16:06 target/2315: ICE with -O on x86 with mainline gcc drepper
14:36 target/2314: -Dinhibit_libc doesn't work for gcc cross-compiler sc843
08:01 gcc-2.95.3 miscompiles VNC (and maybe XFree86) Ronald Wahl
07:36 3.1 bootstrap failure with additional optimization flags Laurynas Biveinis
02:26 java/2313: Java SimpleDateFormat crash with non US locales (french...) diam

March 17, 2001
20:56 java/2312: Check for initialization of all final fields erronously fails bryce
20:16 Re: g++ - pred Martin Sebor
20:07 Re: [BUG] libio/gcc gcc 2.95.2 build failure. Dave Korn
17:01 3.0 branch bootstrap failure on irix6.5 Billinghurst, David (CRTS)
14:32 2.95.3.test4 problem Richard Zidlicky
13:54 Re: Dec 30 patch causes large performance regression on ia64 Richard Henderson
12:32 REGRESSION: reload ice Gabriel Dos Reis
10:36 Re: make clean failure Alexandre Oliva
08:46 libstdc++/2311: isnan(), isinf(), etc, not undefined pcarlini
07:01 Re: gcc-3.0 20010314: Miscompiled C source with -O3 -fomit-frame-pointer Mike Harrold
06:47 Re: gcc-3.0 20010314: Miscompiled C source with -O3 -fomit-frame-pointer pavenis
06:21 Re: gcc-3.0 20010314: Miscompiled C source with -O3 -fomit-frame-pointer Mike Harrold
06:00 gcc-3.0 20010314: Miscompiled C source with -O3 -fomit-frame-pointer pavenis
04:46 target/2309: arm-linux: unrecognizable insn philb
01:50 GCC installation problem bhalekar sheetal
01:50 GCC installation problem bhalekar sheetal

March 16, 2001
22:36 c/2308: x86_64 opcode generated for i686 drepper
18:32 subreg byte Andrew Macleod
16:06 other/2307: README points to deprecated INSTALL directory bh
12:58 Re: Still with the Java testsuite failures Alexandre Petit-Bianco
12:47 Re: Still with the Java testsuite failures Tom Tromey
12:07 Deadlock which buiding Rodrigo Barbosa (aka morcego)
11:42 Re: [c++] file numbering confusion Peter Schmid
11:29 Re: [c++] file numbering confusion Neil Booth
11:16 c++/2306: access control lost for virtual bases theonetruekenny
11:14 Re: [c++] file numbering confusion Benjamin Kosnik
11:08 Particularly ugly x86 long long code generation gcc
11:02 Re: [c++] file numbering confusion Neil Booth
10:56 Re: make clean failure Laurynas Biveinis
10:39 [c++] file numbering confusion Benjamin Kosnik
10:38 Re: Still with the Java testsuite failures Zack Weinberg
10:29 g++ - pred Maciej Hrebien
10:29 g++ - priv Maciej Hrebien
10:24 m68k floating point overwrites vector table Nick Papadonis
09:36 c++/2305: Binary IO read problem jesch
08:36 web/2304: Broken link on http://gcc.gnu.org/onlinedocs/ dkorn
08:17 Re: GCC choked at math expression Michael Meissner
08:16 c++/2303: ice with templates Jerome.Abela
07:36 libstdc++/2302: Problems with toupper schmid
07:16 GCC choked at math expression Pedro A. Aranda Gutiérrez
06:06 c++/2301: g++ syntax error ? philippe.jouguet
05:36 other/2300: gcc_AC_C_FLOAT_FORMAT failed ask
04:02 G++ 2.95.3 internal error Per Wigren
02:18 java/2299: Problem with String Arrays and += Martin Kahlert
02:02 make clean failure Richard Henderson
00:31 Re: Another g++ failure tracked to lazy RTL patch Loren James Rittle

March 15, 2001
23:24 Re: Still with the Java testsuite failures Zack Weinberg
23:09 Re: Still with the Java testsuite failures Tom Tromey
22:52 Re: alpha-linux libstdc++ build problems Richard Henderson
22:33 Re: Another g++ failure tracked to lazy RTL patch Mark Mitchell
21:50 Re: alpha-linux libstdc++ build problems Benjamin Kosnik
21:45 RE: gcc-20010312 build fails on cygwin 1.1.8 Billinghurst, David (CRTS)
21:31 gcc-20010312 build fails on cygwin 1.1.8 Andrew S. Howell
20:05 Another g++ failure tracked to lazy RTL patch Loren James Rittle
20:00 Web Site Traffic Building <Top Ten>
19:16 c/2298: m68hc12 bootstrap ICEs jgg
18:29 Re: alpha-linux libstdc++ build problems Loren James Rittle
17:59 Re: [BUG] libio/gcc gcc 2.95.2 build failure. Spider
17:12 Internal compiler error in make_decl_rtl jan p. springer
16:34 Still with the Java testsuite failures Zack Weinberg
16:15 Re: new C++ EH code: builtin or not? g++ can't decide... Phil Edwards
16:12 alpha-linux libstdc++ build problems Richard Henderson
16:07 Re: new C++ EH code: builtin or not? g++ can't decide... Richard Henderson
16:06 c++/2296: gcc-2.95.3.test3: internal error--unrecognizable insn: Martin.Spott
15:36 libstdc++/2295: Scope of rand function schmid
14:29 Re: [BUG] libio/gcc gcc 2.95.2 build failure. Phil Edwards
13:47 Re: [BUG] libio/gcc gcc 2.95.2 build failure. Geoff Keating
12:56 c++/2294: using declaration confusion theonetruekenny
12:26 optimization/2293: ICE in print_rtl_and_abort dmuell
12:17 ICE triggered by if statement ... Stefan Schwarzer
11:46 c++/2292: gcc 2.95.2 ice when using derived template jeffrey.schwab
09:30 [BUG] libio/gcc gcc 2.95.2 build failure. Spider
08:09 new C++ EH code: builtin or not? g++ can't decide... Phil Edwards
02:18 Re: c/2291: Pedantic may be too pedantic Joseph S. Myers
01:56 c/2291: Pedantic may be too pedantic lw
00:34 GCC-SH: Internal compiler error in propagate_one_insn, at flow.c:3924 Toshi Morita
00:25 Re: Very nasty C bug in gcc 2.95.2 Geoff Keating

March 14, 2001
23:21 Re: Very nasty C bug in gcc 2.95.2 Ken Settle
21:27 Re: ssh 2.4 compile bug Alexandre Oliva
21:16 RE: Tests g++.old-deja/g++.mike/p3708*.C crash dejagnu on cygwin Billinghurst, David (CRTS)
21:00 ssh 2.4 compile bug Eric Pratt
19:18 Re: Very nasty C bug in gcc 2.95.2 Geoff Keating
18:41 oops Ken Settle
17:03 Very nasty C bug in gcc 2.95.2 Ken Settle
16:10 Today's gcc 3.0 crashes on alias H . J . Lu
13:36 fortran/2290: Internal compiler error in find_reloads, at reload.c:3487 gdsjaar
11:56 c++/2289: Incorrect parsing of anonymous union with struct members. vap
10:04 Bug? Or am I doing something really stupid... ? [SOLVED] Mike Harrold
09:13 Bug? Or am I doing something really stupid... ? Mike Harrold
07:02 re: patch to fix undefined weak symbols fixes emacs!!! Jack Howarth
06:57 GCC and G++ Snapshot 20010313-1 Success (but small XEmacs user problem) Tom Browder
06:56 c++/2288: Redereclaration not diagnosed. gdr
05:34 Tests g++.old-deja/g++.mike/p3708*.C crash dejagnu on cygwin Billinghurst, David (CRTS)
04:47 Wrong URL for [Browse other archives for this mailing list] RDBrown
04:46 objc/2287: Internal error while building GNUstep with GCC snapshot 5 march 2001 dleeuw
02:26 debug/2286: Simplified c++/1657: types weirdness (looks like memory corruption with -ggdb) wolfgang.bangerth

March 13, 2001
21:57 patch to fix undefined weak symbols fixes emacs!!! Jack Howarth
20:06 c++/2284: Spurious unused parameter warning snyder
19:31 gcc 3, glibc 2.2, and DWARF2 failure Jim Wilson
19:16 debug/2283: -g3 -O1 -finline-function and __attribute__((constructor)) yield bad stabs d
17:36 c++/2282: faulty argument signature matching for catch() mayer
16:21 Posible bug in gcc: Optimization bug - 2.95.2 Shawn Starr
13:36 web/2281: Bug in the "Suboptimal code for complex conditionals" proposal cbouchon
13:14 RE: c++/1898: IRIX 5 needs a fixincludes hack Bruce Korb
12:56 java/2280: gcj -C does not translate Java 'finally' correctly praun
12:45 Re: c++/1898: IRIX 5 needs a fixincludes hack Alexandre Oliva
12:26 java/2279: Verify bytecode after creating it tromey
11:28 Re: `c++' language required by `java' Tom Tromey
11:18 Re: `c++' language required by `java' John David Anglin
11:15 Re: `c++' language required by `java' Tom Tromey
10:36 c++/2278: Incorrect executable generated by compiler tomas.szeredi
10:29 `c++' language required by `java' John David Anglin
09:26 preprocessor/2277: reader complains about input file larger than 8230 bytes Peter.Zienicke
08:36 c++/2276: Crash when a virtual base class constructor throws an exception aph
08:26 optimization/2275: Bad optimization for simple sum loops. -O0 better than -O3 peter.rydesater
07:56 Re: Does weak work on PPC with -O2? Franz Sirl
07:41 Re: Does weak work on PPC with -O2? Bernd Schmidt
06:31 Re: internal compiler error while compiling allegro Andris Pavenis
06:27 Re: internal compiler error while compiling allegro Alexandre Oliva
05:22 internal compiler error while compiling allegro Bill Simpson
02:55 Re: c++/1917 Theodore.Papadopoulo
02:28 GCC-MCORE: Insn does not satisfy its constraints Toshi Morita
02:16 picojava target very broken Toshi Morita
02:07 k6 optimization Nicolas Vignal
01:56 c++/2274: C++ internal compiler error on alphaev56-dec-osf4.0d matthes

March 12, 2001
20:58 Re: C Library Regular Expression Problem Alexandre Oliva
17:16 Re: Does weak work on PPC with -O2? Franz Sirl
15:28 Re: Does weak work on PPC with -O2? Geoff Keating
15:04 Re: Please test and report on other arches Loren James Rittle
14:17 Re: Does weak work on PPC with -O2? Franz Sirl
14:12 Re: Does weak work on PPC with -O2? Jack Howarth
13:46 target/2273: [Alpha/Tru64 UNIX V5.1] SEGV in long double code Rainer Orth
11:47 Re: gcc 2.95.2/AIX are exceptions thread safe? Geoff Keating
11:32 gcc 2.95.2/AIX are exceptions thread safe? Martin Sebor
10:48 RE: IRIX 5 needs a fixincludes hack Bruce Korb
10:25 Please test and report on other arches Jack Howarth
08:51 Re: Does weak work on PPC with -O2? H . J . Lu
07:56 libstdc++/2272: comparison between signed and unsigned integer expressions in sstream boris
07:36 other/2271: Building libjava crashes with: "execvp: /usr/bin/sh: Arg list too long" jarek
07:13 Issue about inline. Hui Wang
06:56 c++/2270: While compiling doxygen under OpenBSD/i386 2.8, the compiler dies with "index.cpp:2397: Internal compiler error in `make_label_edge', at flow.c:1097" jon
06:08 Re: other/2141: set -C in gccbug not portable Richard Earnshaw
05:48 Re: other/2141: set -C in gccbug not portable Joseph S. Myers
05:12 Re: other/2141: set -C in gccbug not portable Rainer Orth
04:42 c++/2269 additional information Matthias Welwarsky
02:16 c++/2269: gcc-20010305 fails to compile qt-2.2.3 toolkit on linux/alpha matze
00:57 C Library Regular Expression Problem p.klotz
00:56 c++/2268: g++ 2.95.2/3 gives ICE, today's online compilation SegFaults. horvath_tibor
00:06 c++/2267: the following program fails to compile, and produces an internal compiler error. anupam.kapoor

March 11, 2001
22:28 Re: Does weak work on PPC with -O2? Geoff Keating
21:14 Re: Does weak work on PPC with -O2? H . J . Lu
20:46 Re: Does weak work on PPC with -O2? Geoff Keating
17:52 Does weak work on PPC with -O2? H . J . Lu
17:10 Re: GNU/Linux PPC undefined symbols in libgcc* Rod Stewart
16:56 OPPORTUNITY IS KNOCKING!!!.........dont let it pass you by. anopportunity4u2
16:33 GNU/Linux PPC undefined symbols in libgcc* Rod Stewart
15:16 libgcj/2266: libgcj does not make CNI header files for inner classes bryce
14:56 middle-end/2265: ICE in reload_cse_simplify_operands - Alpha ev4 root (by way of Thorsten Kranz
14:07 Re: c/2085: sparc-sun-solaris2.7 RTL checking bootstrap failure on 3.1 CVS Kaveh R. Ghazi
12:16 Re: Recent CVS; Next 3.3; bus error in stage2 Toon Moene
12:06 preprocessor/2264: Macro expansion failure with ## pre-processor operator mm7323
11:45 FREE Biotech Stock Info! 483 biotechstox72
11:10 IRIX 5 needs a fixincludes hack Alexandre Oliva
09:36 optimization/2263: Cross Alpha->68k: Internal compiler error in update_equiv_regs, at local-alloc.c:1097 gcc
07:56 c++/2262: ICE build_rtti_vtbl_entries, at cp/class.c:7811 ask
05:26 optimization/2261: optimisation failed for Python-2.0 ask
04:16 c++/2260: template template parameters not supported Jens.Richter

March 10, 2001
23:15 Re: Inlining bug on MIPS - both 2.95.3 and 3.0 branches Geoff Keating
20:39 Re: Inlining bug on MIPS - both 2.95.3 and 3.0 branches Alexandre Oliva
20:36 libstdc++/2259: istream::tellg/seekg cause character loss hhuang
19:22 Re: Inlining bug on MIPS - both 2.95.3 and 3.0 branches Daniel Jacobowitz
19:03 Recent CVS; Next 3.3; bus error in stage2 James McKelvey
18:15 Re: If you don't have a previous incarnation of GCJ installed... Alexandre Oliva
17:58 Re: Inlining bug on MIPS - both 2.95.3 and 3.0 branches Alexandre Oliva
17:51 Re: Inlining bug on MIPS - both 2.95.3 and 3.0 branches Daniel Jacobowitz
17:26 libstdc++/2257: Problems with slices schmid
16:04 i386.md:6306: warning: destination missing a mode? Billinghurst, David (CRTS)
15:47 Need to include <sys/cygwin.h> to eliminate warnings in cppinit.c Billinghurst, David (CRTS)
15:34 winnt.c doesn't include i386-protos.h Billinghurst, David (CRTS)
14:56 c++/2256: Internal compiler error in `find_function_data', at function.c:542 eric
14:26 libstdc++/2255: libstdc++ incorrectly uses /lib/cpp to identify host compiler version gcc
13:49 Re: Inlining bug on MIPS - both 2.95.3 and 3.0 branches Geoff Keating
13:48 Re: /usr/lib/dld.sl: Unresolved symbol: <FF>libstdc++.sl.3 (plabel) Phil Edwards
13:38 Re: /usr/lib/dld.sl: Unresolved symbol: <FF>libstdc++.sl.3 (plabel) John David Anglin
13:22 Re: /usr/lib/dld.sl: Unresolved symbol: <FF>libstdc++.sl.3 (plabel) Phil Edwards
11:14 Re: c++/2215: ICE on compilation of code with -fhonor-std and -ggdb Benjamin Kosnik
10:46 c++/2254: Impossible to compile the qt toolkit steven
10:06 c++/2253: gcc-3.0 cannot compile mysql Franz.Sirl-kernel
10:03 Re: other/2141: set -C in gccbug not portable Joseph S. Myers
09:46 other/2252: If 'as' crashes gcc points you to the gcc bug site gcc
09:36 middle-end/2251: reload.c: unable to generate reloads schmid
09:13 Build problems for gcc-20010305 and gcc-20010205 releases Nelson H. F. Beebe
08:35 Re: /usr/lib/dld.sl: Unresolved symbol: <FF>libstdc++.sl.3 (plabel) John David Anglin
04:16 c/2250: Missing space in cygwin specs file David.Billinghurst
02:26 c++/2249: Generates illecal PPC assembler pere

March 09, 2001
22:00 Re: If you don't have a previous incarnation of GCJ installed... Alexandre Oliva
20:46 Re: Inlining bug on MIPS - both 2.95.3 and 3.0 branches Daniel Jacobowitz
20:41 Re: Inlining bug on MIPS - both 2.95.3 and 3.0 branches Geoff Keating
19:36 Re: If you don't have a previous incarnation of GCJ installed... Bryce McKinlay
18:30 Re: If you don't have a previous incarnation of GCJ installed... Zack Weinberg
17:36 c/2248: gcc 2.95.2 preprocessor bug with -O options jdmorgen
17:15 Re: If you don't have a previous incarnation of GCJ installed... Loren James Rittle
16:00 Re: --enable-languages problem on the branch Tom Tromey
15:51 Re: If you don't have a previous incarnation of GCJ installed... Bryce McKinlay
15:29 Re: If you don't have a previous incarnation of GCJ installed... Zack Weinberg
15:10 Re: If you don't have a previous incarnation of GCJ installed... Bryce McKinlay
15:10 Inlining bug on MIPS - both 2.95.3 and 3.0 branches Daniel Jacobowitz
14:46 target/2247: IA64 compiler ICE with -O2 sje
14:37 --enable-languages problem on the branch Daniel Jacobowitz
14:36 target/2246: Code generated for IA64 doesn't reset NaT bit on scratch reg sje
11:29 Problems testing gcc-20010305 snapshot Tom.Williams
10:29 problem on solaris2.6 Herman ten Brugge
10:19 Re: objc failures on branch Andreas Jaeger
10:06 c++/2245: Internal compiler error in `refers_to_regno_for_reload_p', at reload.c:5924 fabian
09:08 Re: objc failures on branch Manfred Hollstein
08:56 Re: objc failures on branch Andreas Jaeger
07:56 c/2243: Misplacement of label at start of function. voel
05:46 Re: objc failures on branch Manfred Hollstein
04:56 Re: 3.0 20010305 (prerelease) gen-num-limits.cc compile failure o n alpha-dec-osf4.0e Rainer Orth
04:30 3.1 20010307 IRIX compiler error jarausch
03:56 c++/2242: C++ programs built with gcc won't find libstdc++.so eskil
03:16 Re: 3.0 20010305 (prerelease) gen-num-limits.cc compile failure o n alpha-dec-osf4.0e RDBrown
01:58 Re: Problem compiling DDD-3.3 on Solaris 8/SPARC (and possible fix?) Andreas Zeller
01:22 If you don't have a previous incarnation of GCJ installed... Zack Weinberg
01:06 c++/2241: Internal compiler error ndeb

March 08, 2001
21:36 c++/2240: internal compiler error on static arrays inside templates larry
20:36 c++/2239: Use of an undeclared variable is handled but causes an Internal compiler error in weird places. mat.hounsell
20:36 c++/2238: Use of a class member constant as a size for a member array creation is not handled and causes an Internal compiler error in weird places. mat.hounsell
17:43 Re: PATCH: Current incarnation of subreg-byte Richard Henderson
17:41 Re: PATCH: Current incarnation of subreg-byte Ben Collins
17:36 libgcj/2237: serialization doesn't throw exception on failure tromey
17:36 other/2236: config.if (gcc 2.95.2, possibly others) pukes if it can't find gl*bc orc
17:16 c++/2235: GCC 2.95.2 I.C.E. on "friend" template declaration mhfrantz
16:44 Re: preprocessor/2234: incorrect line numbers Neil Booth
16:32 Re: preprocessor/2234: incorrect line numbers Neil Booth
16:22 Re: [head] Java bootstrap failure: natClip.cc:26: syntax error before`;' Zack Weinberg
16:21 Re: [head] Java bootstrap failure: natClip.cc:26: syntax error before`;' Zack Weinberg
16:16 Re: PATCH: Current incarnation of subreg-byte Richard Henderson
16:06 Re: [head] Java bootstrap failure: natClip.cc:26: syntax error before`;' Bryce McKinlay
16:00 Re: [head] Java bootstrap failure: natClip.cc:26: syntax error before`;' Bryce McKinlay
15:26 preprocessor/2234: incorrect line numbers schmid
15:11 Re: [head] Java bootstrap failure: natClip.cc:26: syntax error before`;' Zack Weinberg
15:09 Re: PATCH: Current incarnation of subreg-byte Gerald Pfeifer
14:56 c++/2232: Numerous g++ internal errors #122 after trivial omissions of closing brackets/braces/parens greg.edwards
14:56 c++/2233: ice instead of "storage size of x isn't constant" agno
13:58 Re: java/2224: error while bootstrapping from cvs Bryce McKinlay
13:36 RE: 3.0 20010305 (prerelease) gen-num-limits.cc compile failure o n alpha-dec-osf4.0e Rainer Orth
13:32 reporting bug prashanth naidu
13:30 RE: 3.0 20010305 (prerelease) gen-num-limits.cc compile failure o n alpha-dec-osf4.0e Bruce Korb
13:20 RE: 3.0 20010305 (prerelease) gen-num-limits.cc compile failure o n alpha-dec-osf4.0e Rainer Orth
13:14 RE: 3.0 20010305 (prerelease) gen-num-limits.cc compile failure on alpha-dec-osf4.0e Bruce Korb
13:06 Re: 3.0 20010305 (prerelease) gen-num-limits.cc compile failure on alpha-dec-osf4.0e Rainer Orth
12:36 c++/2231: -fsyntax-only causes "Internal compiler error" on Linux seanm
11:16 c++/2230: ICE in `fix_lexical_addr', at function.c:5546 Ruth.Doane
11:08 [head] Bootstrap failure compiling crtstuff.c Gerald Pfeifer
10:46 Re: gcc-20010305 IRIX 5.3 installation Benjamin Kosnik
10:16 c++/2229: ld can't find inlined functions leo.dearden
10:12 Re: g77 list directed io bug? Peter Schmid
09:47 gcc-20010305 IRIX bug report Werner Mausshardt
08:46 c++/2228: g++ 3.0 AIX 4.3 PPC internal compiler error rboehne
07:46 c/2227: generates unsigned compare in comparison of int to sizeof() LathamCD
07:16 other/2226: gcc build ignores CPPFLAGS airwin
07:06 c/2225: gcc does not compile on OSF5.1 - mips-tfile: segmentation fault dieter.meinert
05:24 glibc-2.2.2 m.brulisauer
04:06 optimization/2223: overflow in update_equiv_regs foad
02:36 c++/2222: option enable-target-optspace disables _GNU_SOURCE holler

March 07, 2001
23:38 Re: preprocessor bug in gcc 2.95.2[.1] Neil Booth
23:35 Re: preprocessor bug in gcc 2.95.2[.1] Zack Weinberg
23:19 preprocessor bug in gcc 2.95.2[.1] Laurent Montaron
23:12 Re: C gcc-3.0 compiler crash Neil Booth
22:36 c++/2221: Duplicate symbol pending_lang_change dje
22:03 g77 list directed io bug? Tom Beaver
21:59 Re: [head] Java bootstrap failure: natClip.cc:26: syntax error before`;' Alexandre Oliva
21:40 Re: can't bootstrap Tom Tromey
21:32 Re: gcc-20010305 IRIX 5.3 installation Alexandre Oliva
21:26 c++/2220: Internal compiler error on nested template inheritance egnor-gcc
20:05 Re: libstdc++ invalid exception Alexandre Oliva
19:28 Re: libstdc++ invalid exception Kai-Ting Amy Wang
17:33 can't bootstrap Mike Stump
17:19 Re: libstdc++ invalid exception Alexandre Oliva
17:17 Re: reporting bug Alexandre Oliva
16:56 preprocessor/2219: Using "##" with macro varargs generates spurious warning jelson
16:06 c++/2218: Problem with pointers on class-member functions stephane.brunet
15:36 java/2216: gcj generates bad bytecode tromey
15:17 C gcc-3.0 compiler crash Nicola Pero
14:07 Re: /usr/lib/dld.sl: Unresolved symbol: <FF>libstdc++.sl.3 (plabel) Jeffrey A Law
14:06 c++/2215: ICE on compilation of code with -fhonor-std and -ggdb leo.dearden
14:04 Re: gcc-20010305 IRIX 5.3 installation Benjamin Kosnik
13:53 Re: /usr/lib/dld.sl: Unresolved symbol: <FF>libstdc++.sl.3 (plabel) John David Anglin
13:43 Re: gcc-20010305 IRIX 5.3 installation Rainer Orth
13:42 Re: /usr/lib/dld.sl: Unresolved symbol: <FF>libstdc++.sl.3 (plabel) Jeffrey A Law
13:28 libstdc++ invalid exception Kai-Ting Amy Wang
13:18 reporting bug prashanth naidu
13:05 /usr/lib/dld.sl: Unresolved symbol: <FF>libstdc++.sl.3 (plabel) John David Anglin
12:54 PATCH: Current incarnation of subreg-byte Andrew Macleod
12:51 Re: Problem in compiling xc/lib/X11/imRm.c by /usr/bin/gcc onRedHat7.0 Eric Christopher
12:46 c++/2214: Internal compiler error in finish_function gcoakley
12:13 No problem parsing mips.md in 3.0 branch Brian Murphy
11:56 c++/2213: Internal Compiler Error: Cast from long long to member function philippeb
11:45 Re: ../../gcc/fixproto[275]: 25412 Memory fault(coredump) Neil Booth
11:41 Re: ../../gcc/fixproto[275]: 25412 Memory fault(coredump) John David Anglin
11:36 c++/2212: Internal Compiler Error: invalid member pointers philippeb
11:26 libstdc++/2211: Performance regression for cin.read with respect to g++-2.95.2 ? Theodore.Papadopoulo
11:24 Re: ../../gcc/fixproto[275]: 25412 Memory fault(coredump) John David Anglin
11:16 libstdc++/2209: Diagnostic regression with respect to g++-2.95.2 ? Theodore.Papadopoulo
11:16 c++/2210: ice, abi bug, virtual functions, optimization off schmid
10:46 c++/2208: Problem with g++ and templates B.Touron
10:42 Re: gcc-20010305 IRIX 5.3 installation Benjamin Kosnik
09:41 Re: 3.0 20010305 (prerelease) gen-num-limits.cc compile failure on alpha-dec-osf4.0e Benjamin Kosnik
09:16 c++/2207: dtor and operator delete have different object teemu
08:48 X11-Headers Guntram Seiß
08:16 libgcj/2206: Bootrsap fails. sefer
07:26 gcc-20010305 IRIX 5.3 bug report Werner Mausshardt
07:08 Re: Problem in compiling xc/lib/X11/imRm.c by /usr/bin/gcc on RedHat7.0 ganeshb
06:36 c++/2205: g++ crashes when compiling qdatastream.cpp in qt-2.2.4 sb
06:07 Re: gcc-20010305 IRIX 5.3 installation Werner Mausshardt
05:42 FYI: g++ FAILs from vendor nm for 3.0 20010305 on hppa2.0-hp-hpux10.20 RDBrown
05:42 3.0 20010305 (prerelease) gen-num-limits.cc compile failure on alpha-dec-osf4.0e RDBrown
05:26 c++/2204: G++ don't check (member) function parameter for abstract-ness. gdr
05:16 Re: c++/2199: misspelling in gcc/combine.c (compiling 2.95.2 with2.95.3) Bernd Schmidt
05:09 Re: Problem in compiling xc/lib/X11/imRm.c by /usr/bin/gcc on RedHat7.0 Eric Christopher
05:08 Problem in compiling xc/lib/X11/imRm.c by /usr/bin/gcc on RedHat7.0 ganeshb
05:06 Re: Problem in compiling xc/lib/X11/imRm.c by /usr/bin/gcc on RedHat7.0 ganeshb
05:06 target/2203: dlopen() crashes on AIX when compiling with g++ uddeborg
04:51 Re: Problem in compiling xc/lib/X11/imRm.c by /usr/bin/gcc on RedHat7.0 Eric Christopher
04:36 c++/2202: g++ accept to throw object of class with pure virtual member bourguet
04:36 c++/2201: Internal compiler error while compiling patr of lapack++ a.metselaar
04:27 Problem in compiling xc/lib/X11/imRm.c by /usr/bin/gcc on RedHat7.0 ganeshb
02:26 c++/2200: -finstrument-functions doesn't work with exceptions? bjorn_hellander
00:36 Re: ../../gcc/fixproto[275]: 25412 Memory fault(coredump) Neil Booth

March 06, 2001
23:45 Re: gcc-20010305 IRIX 5.3 installation Werner Mausshardt
18:10 Re: Strange exception bug Benjamin Kosnik
18:09 [v3] istream fixes for libstdc++/2181 Benjamin Kosnik
16:54 Re: ../../gcc/fixproto[275]: 25412 Memory fault(coredump) Alan Modra
16:36 Re: ../../gcc/fixproto[275]: 25412 Memory fault(coredump) John David Anglin
15:13 Strange exception bug Bernard Normier
14:45 Re: ../../gcc/fixproto[275]: 25412 Memory fault(coredump) John David Anglin
14:03 ../../gcc/fixproto[275]: 25412 Memory fault(coredump) John David Anglin
13:06 irix6.5 bootstrap failure - Unresolved text symbol "alloca" Billinghurst, David (CRTS)
12:26 Re: Patch review - any way to expedite? Toshi Morita
11:56 c++/2199: misspelling in gcc/combine.c (compiling 2.95.2 with 2.95.3) maxy
11:36 c++/2198: nested templates trigger ICE in gcc version 2.95.3 20010219 (prerelease) schimmel
11:12 RE: ICE for AutoGen-5.1.3 Bruce Korb
11:02 Re: gcc-20010305 IRIX 5.3 installation Gabriel Dos Reis
10:46 c++/2197: "error before '$'", but no '$' in compilation unit schmid
10:45 Re: Small update to reversed_comparison_code Jeffrey Oldham
10:44 Re: More Objective C @"string" bugs... Ovidiu Predescu
10:36 c++/2196: Template specialization and LONG_LONG_MAX -> sorry schmid
10:36 c++/2195: Template specialization and LONG_LONG_MIN -> ice schmid
09:51 Re: More Objective C @"string" bugs... Geoff Keating
09:50 Re: More Objective C @"string" bugs... Geoff Keating
09:48 Re: gcc-20010305 IRIX 5.3 installation Benjamin Kosnik
09:11 Re: More Objective C @"string" bugs... Zack Weinberg
09:02 Re: DECL_DEFER_OUTPUT Change and Java Jeffrey Oldham
09:01 Re: gcc-20010305 IRIX 5.3 installation Alexandre Oliva
08:45 gcc-20010305 IRIX 5.3 installation Werner Mausshardt
08:41 Re: DECL_DEFER_OUTPUT Change and Java Tom Tromey
08:39 Re: More Objective C @"string" bugs... Tom Tromey
08:09 Re: DECL_DEFER_OUTPUT Change and Java Jeffrey Oldham
08:03 Re: remove_unnecessary_notes breaks libjava build Per Bothner
07:33 Re: remove_unnecessary_notes breaks libjava build Richard Kenner
07:25 fatal signal for g77 bernetti
06:26 java/2194: error: redefinition of symbol ".LLBB0" ask
06:18 Re: DECL_DEFER_OUTPUT Change and Java Jason Merrill
06:10 Re: More Objective C @"string" bugs... Joseph S. Myers
05:47 Re: c/2192: compilation of GToolkit gtoolkit-0.9.4] under Red HAT 7.0 Nicola Pero
04:38 Re: More Objective C @"string" bugs... Nicola Pero
04:24 Problem parsing mips.md in 3.0 branch Brian Murphy
02:36 fortran/2193: g77 installation get me an error when use ld. e_schwob
02:36 c/2192: compilation of GToolkit gtoolkit-0.9.4] under Red HAT 7.0 bmrevet

March 05, 2001
23:42 Re: More Objective C @"string" bugs... Neil Booth
23:38 Re: More Objective C @"string" bugs... Neil Booth
22:16 Re: libstdc++/2181: Problems with istringstream Benjamin Kosnik
22:01 Re: COMPILE ERRORS in MySQL-3.23.33-1.src.rpm Alexandre Oliva
21:44 DECL_DEFER_OUTPUT Change and Java Jeffrey Oldham
18:45 Patch review - any way to expedite? Toshi Morita
18:39 Re: libstdc++-v3 configuration and check problems under hpux 10.20 Benjamin Kosnik
18:30 Re: libstdc++/2190: abs(long), div(long,long) defined in <cmath> instead of <cstdlib> Benjamin Kosnik
18:22 Re: More Objective C @"string" bugs... Ovidiu Predescu
18:17 Re: More Objective C @"string" bugs... Joseph S. Myers
17:50 Re: c++/2189: g++ rejects legal code Benjamin Kosnik
17:49 Re: More Objective C @"string" bugs... Nicola Pero
17:21 Re: MAINLINE breakage on Solaris-2.7 Zack Weinberg
16:58 Re: MAINLINE breakage on Solaris-2.7 Gabriel Dos Reis
15:42 Re: More Objective C @"string" bugs... Zack Weinberg
15:36 c/2191: GCC 2.95.2 gives misleading "syntax error" with headerfile typedef, when error is elsewhere Mika.Reunanen
15:16 Re: MAINLINE breakage on Solaris-2.7 Gabriel Dos Reis
15:09 Re: MAINLINE breakage on Solaris-2.7 Joseph S. Myers
15:04 Re: More Objective C @"string" bugs... Nicola Pero
14:56 Re: preprocessor bug: @ + MACRO does not work in gcc-3.0 Neil Booth
14:53 Re: preprocessor bug: @ + MACRO does not work in gcc-3.0 Neil Booth
14:49 Re: MAINLINE breakage on Solaris-2.7 Gabriel Dos Reis
14:20 Results for 3.0 20010304 (prerelease) testsuite on mips-sgi-irix6.5 Billinghurst, David (CRTS)
14:19 Re: preprocessor bug: @ + MACRO does not work in gcc-3.0 Zack Weinberg
14:18 Re: preprocessor bug: @ + MACRO does not work in gcc-3.0 Zack Weinberg
14:14 Re: -O generates NaN Haruhiko Okumura
14:07 Re: More Objective C @"string" bugs... Zack Weinberg
14:07 Re: MAINLINE breakage on Solaris-2.7 Zack Weinberg
14:06 libstdc++/2190: abs(long), div(long,long) defined in <cmath> instead of <cstdlib> snyder
14:06 c++/2189: g++ rejects legal code mayer
13:55 Re: c/2179: segv on declaration of large arrays when using -pthread option Loren James Rittle
13:35 Re: MAINLINE breakage on Solaris-2.7 Gabriel Dos Reis
13:32 Re: preprocessor bug: @ + MACRO does not work in gcc-3.0 Ovidiu Predescu
13:31 Re: More Objective C @"string" bugs... Nicola Pero
13:29 Re: libstdc++-v3 configuration and check problems under hpux 10.20 John David Anglin
13:16 preprocessor/2188: (-ffast-math implies -D__FAST_MATH__) not documented lucier
13:16 c/2187: /usr/include/_G_config.h:53: Internal error: Segmentation fault. klau
13:14 More Objective C @"string" bugs... Zack Weinberg
13:08 Re: preprocessor bug: @ + MACRO does not work in gcc-3.0 Neil Booth
12:56 Re: MAINLINE breakage on Solaris-2.7 Zack Weinberg
12:55 Re: preprocessor bug: @ + MACRO does not work in gcc-3.0 Zack Weinberg
12:26 Re: MAINLINE breakage on Solaris-2.7 Gabriel Dos Reis
12:25 Re: preprocessor bug: @ + MACRO does not work in gcc-3.0 Neil Booth
12:20 Re: libstdc++-v3 configuration and check problems under hpux 10.20 Gabriel Dos Reis
12:02 Re: libstdc++-v3 configuration and check problems under hpux 10.20 Phil Edwards
12:00 Re: preprocessor bug: @ + MACRO does not work in gcc-3.0 Ovidiu Predescu
11:46 c++/2185: (T()) not accepted as function argument rene
11:37 Re: preprocessor bug: @ + MACRO does not work in gcc-3.0 Joseph S. Myers
11:23 Re: libstdc++-v3 configuration and check problems under hpux 10.20 John David Anglin
11:04 Re: preprocessor bug: @ + MACRO does not work in gcc-3.0 Neil Booth
10:54 Re: Wrong multi-line string warning Neil Booth
10:26 c++/2184: using declarations for classes in function templates Sylvain.Pion
10:06 c++/2183: gcc-3_0-branch compiles 2x slower than 2.95 gisli
09:33 Re: MAINLINE breakage on Solaris-2.7 Zack Weinberg
09:26 libstdc++/2181: Problems with istringstream schmid
09:26 c++/2182: Internal compiler error in latest gcc (trunk & gcc 3) using -fpic fnf
09:25 gcc-3.0 and the sparc-linux target, ICE Ben Collins
09:03 preprocessor bug: @ + MACRO does not work in gcc-3.0 Nicola Pero
06:03 Re: -O generates NaN Michael Meissner
05:36 c/2179: segv on declaration of large arrays when using -pthread option abaddon
04:26 today's cvs bootstrap failure on hppa2.0w-hp-hpux11.00 Markus Werle
04:19 MAINLINE breakage on Solaris-2.7 Gabriel Dos Reis
04:07 Re: objc failures on branch Rainer Orth
02:26 c++/2178: ignoring of an unitialized reference error mik
01:46 c/2177: code generated segementation faults inappropriately dean
01:16 Wrong multi-line string warning Andreas Jaeger

March 04, 2001
23:56 Bootstrap failure of trunk on alphaev6-unknown-linux-gnu Brad Lucier
23:26 other/2176: Printing unsigned long int with int format in dwarf2out.c lucier
23:06 optimization/2175: fold in fold_const.c associates non-multiply expressions lucier
20:16 other/2174: configure --enable-languages=c,c++,g77,objc does not fail lucier
19:27 Fwd: GCC Probblem #2 irene
16:10 Re: gcc Internal compiler error Kenneth J. Hendrickson
15:16 c/2173: Wide char definitions in mips-sgi-irix (includes patch) David.Billinghurst
14:36 c++/2172: g++ Internal error #19990916 Uwe F. Mayer
14:26 c++/2171: g++ Internal error #19990916. mayer
10:54 Re: objc failures on branch Gabriel Dos Reis
10:53 COMPILE ERRORS in MySQL-3.23.33-1.src.rpm David Killingsworth
09:32 Re: objc failures on branch Manfred Hollstein
07:16 c/2170: gcc version 2.95.3 19991030 (prerelease) stops with Error 1 when trying to make postfix-release-20010228 on OpenBSD 2.8 (ports) w.zeikat
00:36 c/2168: genattr abort during cross compilation pit

March 03, 2001
22:26 c++/2167: wrong constructor called theonetruekenny
19:45 RE: fortran/2153: statement function arg namespace overlaps subr namespace Billinghurst, David (CRTS)
17:56 c++/2166: More mangling bugs carlo
15:26 c/2165: Make on plotutils-2.4 causes gcc to gives segmentation fault krishna.kant
12:46 c/2164: ICE on NetBSD/i386, gcc 3.0 20010303 (prerelease) anonymous
11:51 Re: objc failures on branch Alexandre Oliva
11:36 c++/2163: Code for constructors emitted twice. carlo
10:39 Re: objc failures on branch Manfred Hollstein
07:09 Re: m68k -mcpu32 current CVS crashes Stephen L Moshier
07:06 optimization/2162: solaris2.7 extra -fPIC failures from execute/loop-8.c ghazi
05:39 "Fortran" GNATS report 2073 moved to `Other' Toon Moene
03:31 GNATS entry libf2c/941 Toon Moene
02:46 c/2161: long if-else cascade overflows parser stack anton
02:42 Re: alpha libstdc++ build failure Benjamin Kosnik
02:36 c/2160: signal 11 when compiling large generated program anton

March 02, 2001
22:46 c++/2159: g++ Internal error #122 mayer
21:29 Re: -O generates NaN Haruhiko Okumura
20:36 c/2158: extra testsuite "execute" failures with -O -fomit-frame-pointer -p (profiling) ghazi
20:26 c/2157: gcc.c-torture/execute/990127-2.c fails with -O3 -fpic/-fPIC ghazi
20:16 c/2156: gcc.c-torture/execute/conversion.c fails with -O3 -fpic/-fPIC ghazi
20:14 Re: Serious design flaw in mangling sheme. Carlo Wood
20:02 Re: Serious design flaw in mangling sheme. Carlo Wood
19:48 Serious design flaw in mangling sheme. Carlo Wood
19:36 java/2155: Overzealous detection of uninitialized final variables bryce
18:16 alpha libstdc++ build failure Richard Henderson
16:46 c++/2154: gcc compilation failure murat
14:36 fortran/2153: statement function arg namespace overlaps subr namespace crussell
13:15 Re: end and err labels not used in g77 during internal files read Toon Moene
12:49 Re: objc failures on branch Alexandre Oliva
12:30 Re: objc failures on branch Phil Edwards
12:21 Re: objc failures on branch Alexandre Oliva
12:14 Re: high priority: gcc generates weird code Carlo Wood
12:09 Re: objc failures on branch Phil Edwards
11:58 Re: objc failures on branch Alexandre Oliva
11:36 preprocessor/2152: gcc -v emits CPP version number twice Rainer Orth
11:13 high priority: gcc generates weird code QingLong
10:48 Re: objc failures on branch Phil Edwards
10:16 Re: gcc 3.0 and multilibbing Alexandre Oliva
10:03 Re: gcc 3.0 and multilibbing Tom Tromey
09:28 Re: [head] Java bootstrap failure: natClip.cc:26: syntax error before`;' Zack Weinberg
09:25 Re: Results for 2.97 20010212 (experimental) testsuite on i686-pc -cyg win Christopher Faylor
08:56 Re: #1821 can be closed Alexandre Oliva
08:56 preprocessor/2151: `gcc -E -' makes core dump ask
08:29 #1821 can be closed Harri Porten
06:36 java/2149: storage size of `_ZTVN4java4lang5ClassE' isn't known ask
06:36 libstdc++/2148: Strange warning while bootstrapping the libstc++ library schmid
06:31 Re: m68k -mcpu32 current CVS crashes Jason Duerstock
06:26 Re: gcc Internal compiler error Kenneth J. Hendrickson
06:07 Re: m68k -mcpu32 current CVS crashes Stephen L Moshier
04:54 Re: gcc Internal compiler error Bernd Schmidt
04:35 Does Size Matter? 67% of Women surveyed think so! info
03:56 c++/2147: code cannot be debugged on IRIX Helmut Jarausch
02:50 end and err labels not used in g77 during internal files read Luc Maisonobe
02:16 optimization/2146: Invalid optimization for the exponential function Frederic.Goualard
00:48 Re: objc failures on branch Andreas Jaeger
00:32 Re: objc failures on branch Alexandre Oliva
00:16 objc/2145: objc testsuite fails since libgcc_so.0 is not found aj
00:10 Re: objc failures on branch Andreas Jaeger

March 01, 2001
23:50 Re: objc failures on branch Alexandre Oliva
23:46 Re: gcc 3.0 and multilibbing Alexandre Oliva
23:40 remove_unnecessary_notes breaks libjava build Per Bothner
23:29 Re: Results for 2.97 20010212 (experimental) testsuite on i686-pc -cyg win Neil Booth
21:00 gcc Internal compiler error Kenneth J. Hendrickson
19:32 Re: [head] Java bootstrap failure: natClip.cc:26: syntax error before`;' Alexandre Oliva
19:16 preprocessor/2143: Cygwin testsuite regressions: -dirafter and system files David.Billinghurst
16:48 Re: [head] Java bootstrap failure: natClip.cc:26: syntax error before`;' Zack Weinberg
14:46 c++/2142: silly internal error for a well placed ";" mikea
12:36 other/2141: set -C in gccbug not portable Rainer Orth
11:21 Re: Calling non-trivial default copy constructors (c++/2065) Phil Edwards
11:06 c++/2140: Internet error: Segmentation fault / Tree check: expected class ... michael
10:44 Re: build failure on hppa2.0-hp-hpux10.20 Jeffrey A Law
09:46 RE: re[2]: alpha-dec-osf5.0 fixinclude problem Bruce Korb
09:09 re[2]: alpha-dec-osf5.0 fixinclude problem Greg Freemyer
08:06 c++/2139: Annoying C++ warning Sylvain Pion
07:15 RE: alpha-dec-osf5.0 fixinclude problem Bruce Korb
06:41 Re: Dec 30 patch causes large performance regression on ia64 Bernd Schmidt
06:01 Re: c++/2138: trouble with STL's distance function Wolfgang Bangerth
02:36 c++/2138: trouble with STL's distance function reichelt
02:35 Re: [head] Java bootstrap failure: natClip.cc:26: syntax error before`;' Manfred Hollstein
01:46 c++/2137: friend access and DR 209 nathan
01:45 Re: PA problem Richard Earnshaw
01:36 c++/2136: g++ seems to disregard '::' in '::delete' mps
00:16 c++/2135: Exceptions broken using -O2 and method-pointers together tgarnock-jones


Indexes: [Date Index] [Subject Index] [Author Index] [Thread Index]
Site Nav: [Browse other archives for this mailing list]
[Browse other mailing lists at this site]
Search: Limit to:

Mail converted by MHonArc 2.4.7