gcc-bugs archive
date index for February, 2001

This is the mail archive of the gcc-bugs@gcc.gnu.org mailing list for the GCC project.

Indexes: [Date Index] [Subject Index] [Author Index] [Thread Index]
Site Nav: [Browse other archives for this mailing list]
[Browse other mailing lists at this site]
Search: Limit to:

February 28, 2001
23:28 Calling non-trivial default copy constructors (c++/2065) Magnus Fromreide
23:16 c++/2134: GCC build aborts with segmentation fault shridhar_daithankar
20:25 Re: Results for 2.97 20010212 (experimental) testsuite on i686-pc -cyg win Christopher Faylor
20:11 Re: Results for 2.97 20010212 (experimental) testsuite on i686-pc -cyg win Geoff Keating
19:21 Bug in the mangler of the new ABI (both 3.0 and 3.1) Carlo Wood
18:39 Re: c++/2042: Traditional C++ syntax error on id "export" Benjamin Kosnik
17:12 Re: Results for 2.97 20010212 (experimental) testsuite on i686-pc -cyg win DJ Delorie
17:06 Re: Results for 2.97 20010212 (experimental) testsuite on i686-pc -cyg win Chris Faylor
17:06 optimization/2131: Wrong result upon returning long long value nenad
17:02 Re: libstdc++/2086: bootstrap error, libstdc++-v3/src/local.cc: op - Benjamin Kosnik
16:57 Re: Results for 2.97 20010212 (experimental) testsuite on i686-pc -cyg win DJ Delorie
16:52 Re: Results for 2.97 20010212 (experimental) testsuite on i686-pc -cyg win Christopher Faylor
16:26 c++/2130: problem at compilation when using friend with a template class francois.sugny
14:35 Re: [head] Java bootstrap failure: natClip.cc:26: syntax error before`;' Alexandre Oliva
13:46 debug/2129: osf1-5.0 gcc 2.95.2 fails with -g flag mikef
12:56 c/2128: [Tru64 UNIX V5.1] gcc testsuite failures: long to long double conversion Rainer Orth
12:37 Re: The "cannot open crt1.o" problem Alexandre Oliva
12:16 c++/2127: namespace problems reichelt
11:58 The "cannot open crt1.o" problem Richard Dybowski
11:45 Re: g77 file truncation bug Toon Moene
10:53 Re: Results for 2.97 20010212 (experimental) testsuite on i686-pc -cyg win DJ Delorie
10:45 Re: PA problem Jeffrey A Law
09:07 Re: PA problem Richard Earnshaw
08:58 Re: mips/mips.h bug with WCHAR_TYPE? Martin Sebor
08:46 other/2126: configure script fails with --silent option pirie
08:45 New Objc Test Failures Revealed on mips-sgi-irix6.5 Jeffrey Oldham
07:38 Re: PA problem Jeffrey A Law
06:56 c++/2125: Namespaces are confused by forward-referencing typedefs stephen.webb
06:36 c++/2124: Misleading error message when name conflicts detected stephen.webb
06:29 Re: PA problem Alexandre Oliva
06:06 PA problem Richard Earnshaw
05:59 Re: Bug in Objective-C compiler found Nicola Pero
05:56 c++/2123: Array initializer schreib
04:46 optimization/2122: Error in openssl ask
03:56 Re: objc failures on branch Andreas Jaeger
03:41 gcc 2.95.3-test2 on m68k-openbsd Janne Johansson
03:41 Re: objc failures on branch Nicola Pero
02:33 objc failures on branch Andreas Jaeger
02:06 c++/2121: Parse error bourguet
01:18 Re: Bug in Objective-C compiler found Joseph S. Myers
01:15 Re: [Q]: Can't compile egcs-1.1.2 Alexandre Oliva
00:37 Re: Bug in Objective-C compiler found Richard Henderson
00:32 Re: binutils turns gcc into a cross compiler Alexandre Oliva
00:29 Re: Bug in Objective-C compiler found Richard Henderson

February 27, 2001
23:48 Re: Results for 2.97 20010212 (experimental) testsuite on i686-pc -cyg win Neil Booth
23:07 RE: mips/mips.h bug with WCHAR_TYPE? Billinghurst, David (CRTS)
21:44 Re: binutils turns gcc into a cross compiler Jesse Caldwell
20:09 Re: binutils turns gcc into a cross compiler Alexandre Oliva
19:17 binutils turns gcc into a cross compiler Jesse Caldwell
16:12 Re: c/2100: -fstrength-reduce (is active with -O2) produces wrong code Franz Sirl
15:12 Re: cannot build libjava Phil Edwards
15:05 RE: Results for 2.97 20010212 (experimental) testsuite on i686-pc -cyg win Billinghurst, David (CRTS)
15:03 cannot build libjava Per Bothner
14:19 mips/mips.h bug with WCHAR_TYPE? Neil Booth
13:46 c++/2120: error 19990919 occurs in compilation Pat_n_Cats
10:49 gcc bug report Johnson, Jarrod T.
10:11 alpha-dec-osf5.0 fixinclude problem Greg Freemyer
09:56 target/2119: Boostrap fails with i686-pc-solaris2.7 where i386-pc-solaris2.7 works. frohlich
07:16 other/2118: Error in Makefile (make -k check) wanderer
05:20 -Wreturn-type failing to report a warning (gcc-2.95.2) Andrew Pollard
04:16 c++/2117: gcc3.0 cannot return references from conversion operators Henry Weller
03:36 middle-end/2116: ICE in reload Ian Dall
02:36 c++/2115: asm bug related to inline function Sylvain.Pion

February 26, 2001
20:45 Dwarf2 Dies on "throw()" Jeffrey Oldham
20:06 c++/2113: Internal compiler error in expand_inline_function, at integrate.c:676 chandler
19:16 c++/2112: Diagnostic message misleading for binding r-value to non-const reference richarda
18:16 c++/2111: Class derivation over embedded templates arch
18:13 [Q]: Can't compile egcs-1.1.2 k5-suzuki
17:16 c++/2110: compile error in function pointer cast (regression from 2.95) dmuell
16:10 Re: m68k -mcpu32 current CVS crashes Jason Duerstock
15:56 optimization/2109: followup #2072 - -ffloat-store negates bug eljay
15:12 Re: PATCH: simplify_and_const_int - disable call to force_to_mode Toshi Morita
15:06 c++/2108: parse error on legal code. jamie
14:56 optimization/2107: followup to 2072 -- bug details discovered (SPARC, PIC) eljay
14:34 ICE in gen_subprogram_die - gcc 20010122 Thorsten Kranzkowski (by way o
13:26 web/2106: Can't read CVS diffs from gcc-cvs.gnu.org archive lucier
12:18 gcc 3.0 and multilibbing Tom Tromey
11:46 c++/2105: internal compiler error bischoff
11:26 c++/2104: ice only if debuggging (-g) is enabled schmid
11:13 Re: PATCH: simplify_and_const_int - disable call to force_to_mode Joseph S. Myers
11:12 Re: c/2102: no warning when comparing (unsigned int) with (int) Kaveh R. Ghazi
11:07 PATCH: simplify_and_const_int - disable call to force_to_mode Toshi Morita
10:40 m68k -mcpu32 current CVS crashes Stephen L Moshier
09:31 -pg option prevents -R getting to collect2 Eric Marsden
09:16 libstdc++/2103: No support for wchar i/o Ralf.Bartzke
09:06 c/2102: no warning when comparing (unsigned int) with (int) philippe.jouguet
08:46 c++/2101: expression in structure initializer in template causes ICE niemayer
08:36 c/2100: -fstrength-reduce (is active with -O2) produces wrong code dllorens
07:47 Re: Bug in Objective-C compiler found Nicola Pero
06:42 20010226 ICE bilgili
04:26 optimization/2099: ICE in gen_reg_rtx, at emit-rtl.c:541 ask
04:16 c/2098: compare with unsigned variable - no error reporting jochen.pernsteiner
02:46 debug/2097: The compiler gives a Segmentation Fault when debug option is passed (-g) rafa
02:06 java/2095: redefinition of symbol ".LLBB0" in assembler output ask

February 25, 2001
23:26 c++/2094: gcc3.1 emits 'sorry, not implemented: use of `ptrmem_cst' in template type unification' togawa
14:26 optimization/2093: Internal compiler error emitting DWARF2 for nested functions velco
13:26 Re: Wish: __builtin_side_effect_free_p, __builtin_lvalue_p Niels Möller
13:26 c++/2092: parse error in conjunction with templates post
13:26 optimization/2091: SPARC follow-up to 2072 -- illustrative example eljay
13:21 GCC-SH: bug in force_to_mode() Toshi Morita
11:39 Re: Wish: __builtin_side_effect_free_p, __builtin_lvalue_p Richard Henderson
11:17 Re: Wish: __builtin_side_effect_free_p, __builtin_lvalue_p Niels Möller
10:55 Re: Wish: __builtin_side_effect_free_p, __builtin_lvalue_p Richard Henderson
10:46 c/2090: Internal error: Segmentation fault when compiling wref.c with -Os gilles.rajaobelina
10:40 Re: Pointer type problem (plain C on i386) Richard Henderson
10:06 libstdc++/2089: Problems with namespaces and exceptions (std::range_error) schmid
09:46 c++/2088: Bootstrap 3.0 on i686-linux fails again. carlo
07:53 Re: Bug in installation of cross-compiler for MIPS. Soubhik Bhattacharya
07:46 Bug in installation of cross-compiler for MIPS. Rami Gideoni
07:09 Re: Bootstrap failure: /cvs/gcc/gcc/rtl.c:1277: Internal error: Segmentation fault Carlo Wood
07:08 Re: c++/2087: ICE during bootstrap of 3.0 Carlo Wood
03:09 Bootstrap failure: /cvs/gcc/gcc/rtl.c:1277: Internal error: Segmentation fault Andreas Jaeger
01:07 Re: [head] Java bootstrap failure: natClip.cc:26: syntax error before`;' Manfred Hollstein

February 24, 2001
20:16 c++/2087: ICE during bootstrap of 3.0 carlo
17:06 libstdc++/2086: bootstrap error, libstdc++-v3/src/local.cc: op - mschalit
14:16 Re: [head] Java bootstrap failure: natClip.cc:26: syntax error before`;' Alexandre Oliva
11:16 c/2085: sparc-sun-solaris2.7 RTL checking bootstrap failure on 3.1 CVS ghazi
10:36 c++/2084: LONG_LONG_MAX causes ice in tree_low_cst (namespaces) schmid
07:26 c++/2082: g++ defines _GNU_SOURCE by default dbaron
06:56 c++/2081: Zero cast to reference in constructor default parameter causes ICE gcc-bug
06:56 c++/2080: g++ runs out of memory if reference parameter is initialized with 0 gcc-bug
03:15 Re: [head] Java bootstrap failure: natClip.cc:26: syntax error before`;' Manfred Hollstein

February 23, 2001
23:21 Re: building proper .so file for JNI Tom Tromey
23:19 Re: building proper .so file for JNI Tom Tromey
22:32 Re: [head] Java bootstrap failure: natClip.cc:26: syntax error before`;' Zack Weinberg
21:38 Re: [head] Java bootstrap failure: natClip.cc:26: syntax error before`;' Alexandre Oliva
21:16 Re: [head] Java bootstrap failure: natClip.cc:26: syntax error before`;' Zack Weinberg
21:11 Re: [head] Java bootstrap failure: natClip.cc:26: syntax error before`;' Alexandre Oliva
17:42 gcc-2.95.3.test4 miscompiles calc-2.11.4t2 on PowerPC Martin Buck
17:36 libstdc++/2079: iostream.h needs more using declarations dbaron
17:36 optimization/2078: Internal compiler error in print_rtl_and_abort, at flow.c:6592 ericb
15:44 Re: building proper .so file for JNI Bryce McKinlay
14:56 optimization/2077: __builtin_frame_address(2) emits wrong codes. nobu.nokada
14:46 optimization/2076: scheduler ignores data dependency dje
14:11 RE: building proper .so file for JNI Briley, Eric
13:30 Re: gcj does not build on Solaris (X11 headers incorrect) Tom Tromey
13:08 Re: building proper .so file for JNI Alexandre Oliva
13:06 preprocessor/2075: cpp doesn't emit builtin macros with -E/-save-temps Rainer Orth
13:06 preprocessor/2074: cpp doesn't emit builtin macros with -E/-save-temps Rainer Orth
12:56 fortran/2073: cannot configure the fortran compiler on my platform tacondarcure
12:53 Re: building proper .so file for JNI Tom Tromey
10:46 optimization/2072: SPARC leaf function loses %l7 contents spuriously eljay
10:06 libstdc++/2071: cin bug on solaris 2.6 Theodore.Papadopoulo
09:02 Mysterious namespace and typedef interactions stephen.webb
08:16 c++/2070: syntax error in correct code igodard
07:26 preprocessor/2069: Preprocessor defines machine-type=1 rbt
05:51 Re: Can't compile gcc-2.95.2 Tim Prince
05:46 java/2068: java --> c++ ask
04:26 libstdc++/2067: bootstrap failed: `alloca' undeclared ask
02:46 java/2066: Source parser segfault in resolve_package bryce
02:27 [Q]: Can't compile gcc-2.95.2 k5-suzuki
02:25 [Q]: Can't compile gcc-2.95.2 k5-suzuki

February 22, 2001
23:46 c++/2065: Annoying invalid message on compiler-generated copy constructor -- regression vs. 2.95 wolfgang.bangerth
23:46 libstdc++/2064: config/os/irix/bits/ctype_base.h incompatible with IRIX 5.3 fleming.151
22:26 c++/2063: Internal compiler error in `gen_reload_inhi', at ../cc_tools/insn-emit.c:5550 vahe
17:08 template parameters bug Chris Leishman
15:56 target/2062: -mcpu=ultrasparc (or -mv9) -O1 with long argument lists and doubles can produce bad code llib
13:27 gcc 2.95.2 bug: -O2 -g Rajeev Byrisetty
12:59 building proper .so file for JNI Briley, Eric
12:24 Re: internal compiler error with typeof in templates Martin Berger
12:10 Re: internal compiler error with typedef in templates Gabriel Dos Reis
12:01 Re: gcj does not build on Solaris (X11 headers incorrect) Phil Edwards
11:36 c++/2061: g++-3 emits misleading warning schmid
11:33 Bug with gcc-2.95.2 with -O causing link failure Andrew Pollard
11:08 Re: internal compiler error with typedef in templates Martin Berger
10:56 java/2060: Bug accessing variable in superclass from inner class of subclass. (value is munged) mjr
10:29 in template class with template parameter base declaring switch jumps wrong Martin Hippe
07:46 c++/2059: Internal compiler error. -- with template code with syntax errors. rhankins
06:20 Re: Your List of Search Engines mehul_trivedi
05:56 target/2058: gcc 3.1 20010221 will not bootstrap on m68k linux jason
05:33 RE: gcj does not build on Solaris (X11 headers incorrect) Anthony Green
02:48 Re: undefined symbol: __dso_handle Markus Werle
02:20 Re: gcj does not build on Solaris (X11 headers incorrect) Bryce McKinlay
01:17 Re: gcj does not build on Solaris (X11 headers incorrect) Jon Beniston
00:32 gcj does not build on Solaris (X11 headers incorrect) Martin Kahlert
00:06 c++/2057: bug in global "const" array schreib

February 21, 2001
16:36 libstdc++/2054: g++-3 rejects legal code, accepted by g++-2.95.2 (functors) schmid
16:36 c++/2055: Legal code rejected by gcc-3, accepted by gcc-2.95 (static array) schmid
13:56 c++/2053: Static cast from parent to children is working but shouldn't philippeb
13:51 Re: libstdc++-v3 configuration and check problems under hpux 10.20 Phil Edwards
13:46 Re: libstdc++-v3 configuration and check problems under hpux 10.20 Gabriel Dos Reis
13:30 Re: libstdc++-v3 configuration and check problems under hpux 10.20 Phil Edwards
13:03 Re: fastjar/Makefile.in is generated by a bad automake H . J . Lu
12:50 Re: fastjar/Makefile.in is generated by a bad automake Tom Tromey
12:19 Re: fastjar/Makefile.in is generated by a bad automake H . J . Lu
12:11 Re: fastjar/Makefile.in is generated by a bad automake Gabriel Dos Reis
11:22 fastjar/Makefile.in is generated by a bad automake H . J . Lu
10:06 c++/2052: gcc 3.0 fails to recognize cout << flush; Robert Boehne
10:01 Re: Internal error from g++ Phil Edwards
09:11 Re: undefined symbol: __dso_handle Alexandre Oliva
08:37 Re: undefined symbol: __dso_handle Markus Werle
08:02 undefined symbol: __dso_handle Markus Werle
07:49 Nasty Parse error gcc-2.96 and 2.97 (2/2) nbecker
07:49 Nasty Parse error gcc-2.96 and 2.97 (1/2) nbecker
07:14 c++/2009: Rename to "All g++ apps linked with -lGLU core dump on startup" Randall Hopper
07:13 Internal error from g++ Kanze, James
06:36 c/2051: dwarf2 bug on ia64 jes
05:46 RE: java doesn't build without c++ Anthony Green
05:46 Re: Required - GCC Manuals for Windows98 Alexandre Oliva
05:40 Re: gcc 3.0 function pointer conversion problem. Alexandre Oliva
05:18 java doesn't build without c++ Martin Kahlert
04:22 Re: conditional exec verify_live problem after scheduling Richard Earnshaw
03:36 c++/2050: Compiler incorrectly complains about instantiation of template declaration with operator mathijs
02:49 Wish: __builtin_side_effect_free_p, __builtin_lvalue_p Niels Möller
02:27 Required - GCC Manuals for Windows98 Selvam Chinnandi
02:06 20010220 snapshot internal error bilgili
02:05 fpermissive and bit-fields Andolfato Luigi-LANDOLF1
01:47 AW: g++ 2.95.3: throw does zero byte malloc? Hugo Mildenberger

February 20, 2001
22:16 c++/2049: gcc 2.95/3.0 gives syntax error igodard
21:56 c++/2048: 2.97 20010205 parsing error braz
21:08 Re: libstdc++-v3 configuration and check problems under hpux 10.20 Jeffrey A Law
19:56 c/2047: Internal compiler error in `require_complete_type', at c-typeck.c:96 jreiser
18:46 c/2046: gcc does not allow '-' (stdin) as input tranle
18:16 c++/2045: no warning when a non void function falls through without a return value; bad code generated. jamie
15:46 c++/2044: errant template compilation errors igodard
15:30 Re: g77 file truncation bug Toon Moene
13:46 c++/2043: C++ traditional-cpp refuses to pass a specific pointer to function with void* argument herter
13:36 c++/2042: Traditional C++ syntax error on id "export" herter
12:39 Re: preprocessor and gcc specific forms Richard Henderson
11:16 Re: preprocessor and gcc specific forms Kathleen Fisher
11:00 Re: Bug in Objective-C compiler found Zack Weinberg
10:46 c/2041: incorrect warning message for -m486 option cljanss
10:26 java/2040: java.util.Hashtable(int,float) is stricter than sun's version pedro
09:45 gcc 3.0 function pointer conversion problem. jnance
09:12 Re: Bootstrap error on Redhat 7.0 with 3.0 branch Alexandre Oliva
07:48 cvs build-failure for hppa64-hp-hpux11.00 Markus Werle
07:43 Problem with gcc3.0 and fstream.h jnance
07:26 c++/2039: bad code generated for access to unnamed union in base class jlemke
06:48 Re: cvs: hpux-11.0 g++: search of libstdc++ error? Markus Werle
06:30 cvs: hpux-11.0 g++: search of libstdc++ error? Markus Werle
06:26 c++/2038: struct used, int expected jorgen
06:15 Bug in Objective-C compiler found Nicola Pero
04:56 libstdc++/2037: ostrstream, string & vector delivers 'garbage' output with cout georg.ritter
04:53 Internal error from g++ Kanze, James
04:29 g++: incorrect implicit copy constructor Kanze, James
04:12 Internal compiler error Ryszard Kabatek
03:03 internal compiler error with typedef in templates martinb
00:26 web/2036: More broken gcc-cvs links Joseph Myers

February 19, 2001
23:06 c/2035: Internal compiler error on complex casts. Only with optimisation. emmerik
22:13 Re: libstdc++-v3 configuration and check problems under hpux 10.20 Alexandre Oliva
22:06 c/2034: boostrap error, CVS gcc, as: unrecognized option `-Qy' mschalit
21:26 fortran/2033: -ffixed-line-length-none gives bogus warning asnd
19:17 Bootstrap error on Redhat 7.0 with 3.0 branch Edgar Villanueva
18:56 debug/2032: The bugs in libgcc2.c when building x86 to ARM cross compiler ericy
16:56 fortran/2031: ICE in g77.f-torture/compile/20000511-2.f David.Billinghurst
15:26 Re: c++/708 Martin Sebor
15:17 g77 file truncation bug mike
13:06 Re: RSHIFT Toon Moene
12:46 c/2030: misleading warning for -m486 snyder
12:43 Re: Bootstrap failure on ia32 Andreas Jaeger
12:38 Bug Report Dave Duchene
11:36 Re: Bootstrap failure on ia32 Zack Weinberg
11:35 Re: ARM bootstrap failures (all configurations) Richard Henderson
10:26 libstdc++-v3 configuration and check problems under hpux 10.20 John David Anglin
09:06 c/2029: problem with build for Cygwin ashutosh.sharma
08:56 c++/2028: option -finstrument-functions breaks valid code schmitt
08:03 Bootstrap failure on ia32 Andreas Jaeger
07:56 c/2027: gcc crash when compiling at -O1 or higher jes
07:28 Re: RSHIFT Tim Prince
06:50 [3.0] bootstrap failure: gensupport.c:807: Internal error Gerald Pfeifer
06:41 [3.0] bootstrap failure: libgcc2.c:3601, on sparc-sun-solaris2.8 Gerald Pfeifer
06:02 Bootstrap fail on powerpc-linux in cse_basic_block (also fancy_abort still doesn't work right) Franz Sirl
05:50 Re: g++ 2.95.3: throw does zero byte malloc? Sebastian Rittau
05:46 Pointer type problem (plain C on i386) Balazs Takacs
05:40 cvs c++-bootstrap failure on hppa2.0w-hp-hpux11.00 Markus Werle
05:24 Re: g++ 2.95.3: throw does zero byte malloc? Bernd Schmidt
03:46 java/2026: libjava/gnu/gcj/xlib/natClip.cc:15:18: vector: No such file or directory ask
03:14 Re: ARM bootstrap failures (all configurations) Richard Earnshaw
01:36 Re: GCC kernel miscompile with O2 Richard Henderson
01:07 optimization/2025: ICE in extract_insn, at recog.c:2227 ask

February 18, 2001
22:02 Re: [PATCH] Re: REG_DEAD/REG_EQUIV problem. Jeffrey A Law
20:16 libgcj/2024: libgcj can abort on bogus arguments to Class.forName() bryce
20:08 RSHIFT KATAYAMA Jiro
18:26 c++/2023: ICE in lookup_template_class theonetruekenny
16:26 c++/2022: Internal compiler error when c function has same name as mangled C++ name adam
16:16 c++/2021: Internal error #378. carlo
16:06 libstdc++/2020: fstream initialization seg-faults if global locale is missing required facets bumgard
16:06 c++/2019: Wrong line number in warning carlo
15:46 fortran/2018: Sqrt causes ice in emit_move_insn, at expr.c:2718 schmid
15:06 libstdc++/2017: Member function seekg is wrong rafa
14:47 compiler failuer on an pentium 90 with debian woody Guido Roock
13:56 optimization/2016: -O _AND_ -funroll_all_loops causes segfaults on PPC ewindisc
13:47 Re: [MAINLINE] Bootstrap failure on i686-pc-linux-gnu Geoff Keating
12:09 Re: ARM bootstrap failures (all configurations) Richard Henderson
11:08 Mainline doesn't bootstrap on i686-linux Andreas Jaeger
11:05 Re: c++/1687: Extreme compile time regression from 2.95.2 John David Anglin
10:21 Re: New bootstrap failure on irix6 on reload1.c Richard Henderson
07:22 New bootstrap failure on irix6 on reload1.c Kaveh R. Ghazi
06:06 c++/2015: New ICE in snapshot of February 17 bagnara
04:01 Re: c++/672: gcc treats temporary as rvalue when passing references Jason Merrill
03:59 Re: optimization/671: Internal compiler error building bzflag with -O2 on Jason Merrill
03:52 Re: c++/670: 2.91.66, 2.95.2 and 2.96 seem to call too many destructors. Jason Merrill
03:45 Re: c++/655: -fno-rtti breaks exception handling Jason Merrill
03:45 Re: c++/588: defining static data member of template class needs initializer Jason Merrill
03:45 Re: [PATCH] Re: REG_DEAD/REG_EQUIV problem. Alan Modra
03:40 Re: c++/383: C++v2,96:member template conversion not implicit Jason Merrill
02:46 [MAINLINE] Bootstrap failure on i686-pc-linux-gnu Gabriel Dos Reis

February 17, 2001
23:12 Re: [PATCH] Re: REG_DEAD/REG_EQUIV problem. Jeffrey A Law
21:45 Re: [PATCH] Re: REG_DEAD/REG_EQUIV problem. John David Anglin
16:41 ICEing on the cake^Wbootstrap Phil Edwards
14:57 Re: [PATCH] Re: REG_DEAD/REG_EQUIV problem. John David Anglin
13:37 Re: Fresh CVS update bootstrap fails on FreeBSD 4.2 David O'Brien
12:46 Re: Reg-stack and cmove bug Richard Henderson
12:26 c++/2014: error in print_rtl_and_abort, at flow.c:6592 george.goffe
12:01 Re: [head] Java bootstrap failure: natClip.cc:26: syntax error before`;' Zack Weinberg
11:56 c++/2013: g++ 2.96: typedefs + namespaces + inheritance == problem fatal
10:56 c/2012: ICE when compiling current cvs gcc David Welch
10:36 c/2011: ICE when compiling current cvs gcc David Welch
09:53 RE: Fresh CVS update bootstrap fails on FreeBSD 4.2 Charles Randall
09:45 Re: ARM bootstrap failures (all configurations) Richard Henderson
06:24 Re: ARM bootstrap failures (all configurations) Richard Earnshaw
04:45 g++ 2.95.3: throw does zero byte malloc? Sebastian Rittau
02:24 Re: [head] Java bootstrap failure: natClip.cc:26: syntax errorbefore`;' Gerald Pfeifer
01:40 Re: [head] Java bootstrap failure: natClip.cc:26: syntax errorbefore`;' Gerald Pfeifer
01:36 Re: Reg-stack and cmove bug Jan Hubicka
01:34 [head] Bootstrap failure: libgcc2.c:747: Internal compiler error invalidate_replace_src Gerald Pfeifer

February 16, 2001
22:35 Fresh CVS update bootstrap fails on FreeBSD 4.2 Charles Randall
21:16 c++/2010: Internal error: Segmentation fault (version 2.97 20010207) carlo
17:55 Re: Java-related bootstrap failure: sparc-sun-solaris2.8 Bryce McKinlay
17:32 Re: [head] Java bootstrap failure: natClip.cc:26: syntax error before`;' Bryce McKinlay
17:15 Re: Java-related bootstrap failure: sparc-sun-solaris2.8 Gerald Pfeifer
17:10 Re: [PATCH] Re: REG_DEAD/REG_EQUIV problem. John David Anglin
15:44 [head] Java bootstrap failure: natClip.cc:26: syntax error before`;' Gerald Pfeifer
14:00 Re: Reg-stack and cmove bug Richard Henderson
12:28 Re: Reg-stack and cmove bug Zack Weinberg
11:54 Re: g77 bug Toon Moene
11:24 Re: Internal compiler error Neil Booth
10:46 Re: Reg-stack and cmove bug Jan Hubicka
10:06 c++/2009: g++ (-lGLU) aa8vb
10:04 Re: gcc-3_0-branch doesn't bootstrap: `inline_max_insns' undeclared Andreas Jaeger
10:01 Re: gcc is not Working on HP 9000/821/D250 HP-UX 10.20 Alexandre Oliva
10:00 Re: Internal compiler error Alexandre Oliva
09:59 Re: C++ templates troubles Alexandre Oliva
09:58 gcc-3_0-branch doesn't bootstrap: `inline_max_insns' undeclared Andreas Jaeger
09:06 java/2008: ICE in gcj (no optimization) Martin Kahlert
07:26 preprocessor/2007: gcc has a segmentation fault with defines siva
04:38 gcc is not Working on HP 9000/821/D250 HP-UX 10.20 Michael HOFER
04:36 c++/2005: loop in gcc when function has const additional waratah
03:52 Re: Reg-stack and cmove bug Jan Hubicka
03:50 Re: Reg-stack and cmove bug Jan Hubicka
02:21 Internal compiler error martin.hjelmstedt
01:40 gcc-bugs@gcc.gnu.org k5-suzuki
01:26 target/2004: Internal error on correct code while compiling for ARM emarty
01:04 Reg-stack and cmove bug Zack Weinberg

February 15, 2001
23:37 C++ templates troubles Vasiliy A. Chernoivan
23:28 Re: Preprocessor question... Eli Zaretskii
17:32 Re: Preprocessor question... Carlo Wood
17:07 Re: bug in g77 Steven Castillo
16:58 Re: Preprocessor question... Joseph S. Myers
16:56 other/2003: libgcc ABI Joseph Myers
16:55 Re: Java-related bootstrap failure: sparc-sun-solaris2.8 Bryce McKinlay
15:38 Preprocessor question... Glen Nakamura
15:13 Re: Java-related bootstrap failure: sparc-sun-solaris2.8 Gerald Pfeifer
14:40 g77 bug Matthew Bettencourt
14:37 Re: bug in g77 Toon Moene
13:56 c/2002: problem (?) with variable length arrays extension itlee
12:56 Re: web/2000: "Cookies not enabled" warning gone from GNATS Gerald Pfeifer
11:33 Re: [PATCH] Re: REG_DEAD/REG_EQUIV problem. John David Anglin
10:56 optimization/2001: Inordinately long compile times in reload CSE regs lucier
10:36 web/2000: "Cookies not enabled" warning gone from GNATS lucier
08:51 bad 3.0 IA32 PIC generation Robert Lipe
08:06 other/1999: java_cup VS gcj anast
07:46 c/1998: compiler chokes on - as filename Andreas Schwab
07:04 hpux-11.0: Tree check: expected class 't', have '2' (complex_expr) Markus Werle
07:00 cvs bootstrap failure on i686-pc-linux-gnu Markus Werle
04:53 ARM bootstrap failures (all configurations) Richard Earnshaw
04:41 gcc-20010122 ice on Blitz++ testuite; compiles .ii files! Derrick Bass
03:36 c++/1996: Undefined reference to non-virtual thunk when virtual functions from one class are split over two source files jo
02:16 c/1995: position dependency in asm("" : ... : : ) etienne.lorrain
01:37 gcc-2.95.2 / SGI 64bit / internal error--unrecognizable insn Klaus Dolag
00:41 Re: [mainline] Bootstrap failure: gcc/timevar.c:492: Internalerror:Segmentation fault Jan Hubicka
00:09 G++ gives ICE on non-initialized static const member Courtenay Footman
00:03 debug info on IRIX is broken jarausch

February 14, 2001
23:26 c/1994: gcc 2.96 optimisation bug Ben Caradoc-Davies
23:06 fortran/1993: Internal error in gcc 2.95.2 SGowdy
22:54 [mainline] Bootstrap failure: gcc/timevar.c:492: Internalerror:Segmentationfault Gerald Pfeifer
21:46 GCC kernel miscompile with O2 William Stearns
21:36 java/1992: ICE compiling Tomcat dyp
21:26 java/1991: Tree check: expected class 'e', have 'x' (identifier_node) when compiling Tomcat dyp
21:16 irix bootstrap fail in mkdeps.c Billinghurst, David (CRTS)
19:57 Re: c++/1687: Extreme compile time regression from 2.95.2 Zack Weinberg
19:02 Error in Bug Report c++/1989 Kevin Atkinson
18:56 c++/1990: #include <ext/slist> does not work kevina
18:46 c++/1989: #include <ext/slist> does not work kevina
17:36 c++/1988: Compiler produces seg fault message when including checktty.c into a c++ app. cbearden
17:16 c/1987: GCC 2.95.2 fails to build under Interix 2.2 bo
17:16 libstdc++/1986: bootstrap error in CVS gcc libstdc++/libmath/mathconf.h mschalit
16:51 Re: Strange bug in GCC 2.95.2 (Linux/I386/Suse7.0 Alexandre Oliva
16:28 Re: bug in g77 Steven Castillo
16:06 Re: c++/1687: Extreme compile time regression from 2.95.2 John David Anglin
14:46 c++/1985: bare typename inside of template function fails hudson
13:01 Re: c++/1687: Extreme compile time regression from 2.95.2 Zack Weinberg
11:56 c/1984: mis-ordering of op codes causes kernel panic alan.jones
11:39 g++ volatile keyword bug in template instantiation? Marat Ruvinov
11:26 Re: bug in g77 Toon Moene
10:16 c++/1983: compiler tells me to submit a bug report for static const declaration. coleenp
09:59 RE: Bootstrap failure: objdir=srcdir, FreeBSD make Bruce Korb
09:42 Re: Java-related bootstrap failure: sparc-sun-solaris2.8 Phil Edwards
09:36 c/1982: gcc treating "extern __inline__ asmfn (...) {...}" in <asm/bitops.h> as undefined prasad
08:03 Re: Bootstrap failure: objdir=srcdir, FreeBSD make Mark Mitchell
07:51 Internal compiler error with gcj Martin Kahlert
07:36 c++/1981: using declarations in function templates Sylvain Pion
05:46 c++/1980: Error assigning const array 520065607613-0001
05:36 c/1979: GCC-20010122 not compiled on alpha osf5.1 webmaster
05:22 Strange bug in GCC 2.95.2 (Linux/I386/Suse7.0 Laurent.Kersten
04:46 c/1978: gcc 2.95.2 in HP-UX 10.20 with -O2 generates wrong code Sami.J.Salonen
03:36 Java-related bootstrap failure: sparc-sun-solaris2.8 Gerald Pfeifer
03:23 Re: Bootstrap failure: objdir=srcdir, FreeBSD make Richard Earnshaw
03:07 Re: c++/1687: Extreme compile time regression from 2.95.2 Scott A Crosby
02:26 c/1977: gcse.o differs ask
02:16 preprocessor/1976: different treatment of shift in preprocessor and compiler fl
01:16 Re: register move costs broken Jan Hubicka

February 13, 2001
23:16 c++/1975: ICE for -O2 compile of nested throw in nested default/switch/conditional/destructor. bumgard
22:41 Re: register move costs broken Alan Modra
22:15 Re: register move costs broken Jeffrey A Law
21:31 register move costs broken Alan Modra
21:16 other/1974: config.guess failed to determine the host type Pierre
21:16 other/1973: config.guess failed to determine the host type Pierre
20:26 libstdc++/1972: Exceptions classes need to copy string argument. bumgard
19:56 libgcj/1971: ObjectOutputStream generates incorrect serialVersionUID's for array classes bryce
18:36 java/1970: Can't instantiate local class in static method bryce
17:14 Re: CLASS_CANNOT_CHANGE_MODE Richard Henderson
17:05 CLASS_CANNOT_CHANGE_MODE Alan Modra
16:42 Re: strange bug, alloca suspected Keith Owens
16:06 c++/1969: private delete fails mysteriously bh
13:44 strange bug, alloca suspected Yann Droneaud
12:46 libstdc++/1968: bits/std_fstream.h fails to define typedef for _ctype_type. bumgard
12:36 libstdc++/1967: bits/localefwd.h incorrectly uses int instead of size_t in for loop. bumgard
12:27 Bootstrap failures on an i686-pc-linux-gnu Gabriel Dos Reis
12:16 bootstrap comparison failure on mainline Andreas Jaeger
11:56 c++/1966: FOO will not construct with temporary BAR ipelet
11:50 Antigen found VBS/SST virus ANTIGEN_MGICAX
11:26 c/1965: bootstrap falure with make -j 4 on solaris2.8 lucier
11:17 Re: h8300-rtems configure problem in libstdc++-v3 Joel Sherrill
10:32 Re: h8300-rtems configure problem in libstdc++-v3 Carlo Wood
10:24 Re: h8300-rtems configure problem in libstdc++-v3 Jeffrey A Law
10:16 c/1964: code generation bug with -gdwarf-2 and -fPIC on x86 crigler
10:08 h8300-rtems configure problem in libstdc++-v3 Joel Sherrill
09:35 Re: Stop gcc from halting on warnings Alexandre Oliva
09:00 Stop gcc from halting on warnings Wayne R. Wise
08:26 other/1963: collect2 interprets "-oldstyle_liblookup" as "-o ldstyle_liblookup" anonymous
08:16 c++/1962: deducing array types nathan
07:40 Here you have, ;o) Mike Hammonds
04:22 Re: Bootstrap failure: i386.c:8753: invalid type argument of `->' Gerald Pfeifer
03:21 Re: Bootstrap failure: i386.c:8753: invalid type argument of `->' Jan Hubicka
02:48 Re: Bootstrap failure: i386.c:8753: invalid type argument of `->' Jan Hubicka
02:41 Re: Bootstrap failure: i386.c:8753: invalid type argument of `->' Jan Hubicka
02:39 Bootstrap failure: i386.c:8753: invalid type argument of `->' Gerald Pfeifer
02:37 Re: combine.c:1670: warning: left shift count >= width of type Richard Henderson
02:36 c++/1960: const qualified arrays and templates nathan
02:19 Re: combine.c:1670: warning: left shift count >= width of type Alexandre Oliva
01:43 combine.c:1670: warning: left shift count >= width of type Andreas Jaeger

February 12, 2001
23:16 c++/1959: template copy constructor requires const richarda
23:08 bug in g77 Steven Castillo
22:56 java/1958: Incorrect error message attempting to access non-final local from local class bryce
18:37 Re: print-file-name Alexandre Oliva
17:16 c/1956: Internal compiler error related to nested function/optimisation a.p.selby
15:16 c/1955: Linking wrong shared libgcc with mabi=64 on irix6.5 David.Billinghurst
14:48 print-file-name Daniel Wagner
14:06 other/1954: problem with gcj joel
12:06 libstdc++/1953: C++: ambigous overload compile failure carlo
11:55 Re: Incorrect code produced with inline functions & assembler Brian Hurt
11:36 c++/1952: Compiling a reasonably simple sort routine causes the bug witkop
11:08 Re: preprocessor and gcc specific forms Alexandre Oliva
11:06 Re: -frepo g++ bug ? Alexandre Oliva
10:59 Re: preprocessor and gcc specific forms Richard Henderson
10:45 arm-rtems/elf -mthumb bad code generated Joel Sherrill
10:36 c++/1951: fatal when declaring initialized automatic struct containing pointers to method rpm
10:11 more on arm-elf/arm-rtems Joel Sherrill
09:16 c/1950: GCC cross build fails malcolm.herring
08:56 web/1949: can't log to misrnet web site ysedky
07:56 target/1947: gcc for target xscale generates incorrect code when optimization is turned on vmoorthy
07:42 -frepo g++ bug ? Marat Ruvinov
07:26 preprocessor and gcc specific forms Kathleen Fisher
07:26 c/1946: Coinfiguration script ignores --program-suffix parameter james.mcininch
07:22 arm-elf and arm-rtems build failure Joel Sherrill
06:18 mips-rtems failure Joel Sherrill
04:26 optimization/1945: flow.c:3790 ICE Patch Prologue contains dead register sets shane
04:26 c++/1944: Internal error #20010127 - reproducable ritzert
03:46 other/1943: Build failure x86 - CVS as of 12/2/2001 dg
01:08 libstdc++ bug - need help (IRIX) jarausch
00:26 c/1942: error in do_jump wilhelm.nuesser
00:06 c/1941: unknow szallar

February 11, 2001
16:43 Re: bug: trashed register. Marc Esipovich
16:39 Re: bug: trashed register. Alexandre Oliva
16:36 c++/1940: No option for turning off reporting of mismatched "{" "}" craigs
14:41 bug: trashed register. Marc Esipovich
14:06 c++/1936: pseudo-construction and >> operator Jens.Maurer
13:26 c++/1935: g++ gives internal compiler error on struct in member template in template class robert
10:56 c++/1934: Crash on bad member name sean.middleditch
08:33 Re: GCC on Alpha internal error. Alexandre Oliva
07:31 [BUG: gcc-20010211]: ICE during compilation of libstdc++-v3/src/locale-inst.cc on armv4l-unknown-linux-gnu Manfred Hollstein
05:16 c++/1933: configure;make Dragan.Krnic
00:26 java/1932: Yet another problem resolving qualified method call with inner classes bryce

February 10, 2001
20:05 Re: Bootstrap failure: objdir=srcdir, FreeBSD make David O'Brien
19:58 Re: Bootstrap failure: objdir=srcdir, FreeBSD make Mark Mitchell
16:56 optimization/1931: Alpha->68K cross produces dough floating point instruction gcc
15:56 libstdc++/1930: helper function-macro undefined incorrectly peters
14:08 Internal error #122 after parse error Falk Hueffner
13:56 c++/1929: template "nested" class problem x.lsi.maillard
13:49 Re: Missing warning message Andrew Vaught
13:16 libstdc++/1928: "long long" not handled by "cout" geoffj
13:13 Re: Missing warning message Zack Weinberg
12:22 Missing warning message Andrew Vaught
10:56 c++/1927: internal compiler error 980711 gilles56
01:16 libstdc++/1926: valarray_meta.h: typo line 300 mjbedy

February 09, 2001
18:03 Re: Incorrect code produced with inline functions & assembler Alan Modra
17:50 g++ -V2.95.2 does not work Hidvegi
17:36 c++/1925: should issue diagnostic for pure virtual called in dtor bh
16:54 Re: Bootstrap failure: java/mangle_name.c, tm.h and insn-codes.h:No such file or directory Gerald Pfeifer
15:46 Re: Bootstrap failure: objdir=srcdir, FreeBSD make David O'Brien
15:36 c++/1924: compiler fails to parse valid (I think) construct lakshman
15:04 GCC on Alpha internal error. James Duhl
14:08 Incorrect code produced with inline functions & assembler Brian Hurt
13:25 Re: Bootstrap failure: java/mangle_name.c, tm.h and insn-codes.h:No such file or directory Alexandre Petit-Bianco
12:59 Re: Bootstrap failure: java/mangle_name.c, tm.h and insn-codes.h:No such file or directory Gerald Pfeifer
12:45 m68k-elf CVS internal compiler error Joel Sherrill
11:32 Re: Bootstrap failure: java/mangle_name.c, tm.h and insn-codes.h: Nosuch file or directory Alexandre Petit-Bianco
10:53 Re: A problem with cin or strtod? Joseph S. Myers
10:48 Re: Bootstrap failure: java/mangle_name.c, tm.h and insn-codes.h: Nosuch file or directory Alexandre Petit-Bianco
10:26 A problem with cin or strtod? Daniel P. Katz
10:09 Re: Hundreds of g++ testsuite failures? Brad Lucier
09:30 Re: Dec 30 patch causes large performance regression on ia64 Richard Kenner
08:42 Re: Hundreds of g++ testsuite failures? Benjamin Kosnik
08:31 Re: Hundreds of g++ testsuite failures? Brad Lucier
08:26 java/1922: error in java/mangle_name.o undefined ask
08:13 Extra constructor debug info Daniel Berlin
08:11 Java related bootstrap failure: java/mangle_name.c:144: undefinedreference to `error' Gerald Pfeifer
07:53 Dec 30 patch causes large performance regression on ia64 Bernd Schmidt
06:26 Bootstrap failure: java/mangle_name.c, tm.h and insn-codes.h: Nosuch file or directory Gerald Pfeifer
05:06 c++/1921: code segment and stack segment are same for executable. jasvant.singh
01:26 c++/1920: g++ -O1 optimization bug in casting a reference argument mdejong

February 08, 2001
21:26 c++/1919: localefwd.h won't compile with -fno-exceptions dbaron
16:36 c/1918: A called function incorrectly accesses args in a list of 16 arguments modur
14:52 Re: Bootstrap failure: objdir=srcdir, FreeBSD make Mark Mitchell
14:46 c++/1917: ICE on legal code #283 Theodore.Papadopoulo
13:36 c++/1916: internal compile error 980711 gilles56
12:26 other/1915: building libgcj/gcj anast
10:56 c++/1914: parse error at template default arg in ctor Richard.Kreckel
10:16 libgcj/1913: reading closed streams throws NullPointerException, not IOException paul
08:55 scheduling problem on solaris2.6 Herman ten Brugge
08:05 Re: RFA - C++ new initializers Jason Merrill
07:46 java/1912: Segfault when handling segfault = infinite recursion paul
05:58 Re: Bootstrap failure: objdir=srcdir, FreeBSD make Will Andrews
05:16 c/1910: incorrect long long return value with -O2 optimization djk
04:12 Re: Bootstrap failure: objdir=srcdir, FreeBSD make Steve McIntyre
01:16 c/1909: gcc version 2.97 20010205 (experimental) cannot compile http://www.fftw.org/fftw-2.1.3.tar.gz wengler
00:43 Re: Bootstrap failure: objdir=srcdir, FreeBSD make Zack Weinberg
00:16 Re: Bootstrap failure: objdir=srcdir, FreeBSD make David O'Brien

February 07, 2001
21:56 c++/1908: Member Template Specialization Bug cjoy
21:46 libgcj/1907: symbol demangling by Throwable.printStackTrace Per Bothner
15:14 Re: Bootstrap failure: gcc/cppexp.c:430: structure has no member named `n_true' Zack Weinberg
15:09 Re: Bootstrap failure: objdir=srcdir, FreeBSD make Zack Weinberg
14:18 Re: Bootstrap failure: objdir=srcdir, FreeBSD make Neil Booth
14:16 libgcj/1906: difference between gcj and jdk for MessageFormat paul
14:01 Bootstrap failure: gcc/cppexp.c:430: structure has no member named`n_true' Gerald Pfeifer
13:35 Re: Bootstrap failure: objdir=srcdir, FreeBSD make Gerald Pfeifer
13:06 Re: Bootstrap failure: objdir=srcdir, FreeBSD make David O'Brien
13:02 Re: Bootstrap failure: objdir=srcdir, FreeBSD make David O'Brien
13:00 Re: Bootstrap failure: objdir=srcdir, FreeBSD make David O'Brien
12:46 preprocessor/1903: cpp (2.95.3) does not create proper dependencies for .c++ source file extensions tkunze
11:31 Re: Hundreds of g++ testsuite failures? Brad Lucier
11:26 Re: Hundreds of g++ testsuite failures? Benjamin Kosnik
10:37 Re: c++/1687: Extreme compile time regression from 2.95.2 Zack Weinberg
10:32 Re: Hundreds of g++ testsuite failures? Brad Lucier
10:06 c/1902: sparc-rtems(elf) fails to compile newlib joel
08:51 Re: conditional exec verify_live problem after scheduling Richard Earnshaw
08:40 Re: conditional exec verify_live problem after scheduling Richard Henderson
07:25 Re: conditional exec verify_live problem after scheduling Richard Earnshaw
07:16 c++/1901: class method, when overloaded, hides methods with the same name vladimir.kondratiev
05:26 c++/1900: exception classes, multiple inheritence dhoover
01:29 Re: gcc's <stdbool.h> is broken Jason Merrill
01:08 Re: HPUX: Did I already mention ... Markus Werle
00:35 Please, fix include/g++/bits/localefwd.h:399 warning Vladimir A. Merzliakov

February 06, 2001
23:14 Re: libstdc++-v3 won't build on IRIX 5.2 Mark Mitchell
22:16 Re: libstdc++-v3 won't build on IRIX 5.2 Benjamin Kosnik
22:16 c++/1899: Omitting template arg gives "Internal compiler error" dlr
21:17 Re: libstdc++-v3 won't build on IRIX 5.2 Alexandre Oliva
20:56 c++/1898: problems compiling with varargs fleming.151
19:57 Re: libstdc++-v3 won't build on IRIX 5.2 Benjamin Kosnik
18:42 Re: libstdc++-v3 won't build on IRIX 5.2 Alexandre Oliva
18:40 Re: GCC snapshots + binutils 2.11 CVS won't bootstrap on FreeBSD 2.2.7 Alexandre Oliva
18:28 Re: Bootstrap failure: objdir=srcdir, FreeBSD make Alexandre Oliva
18:06 libstdc++/1897: basic_ostream operators contain non-ISO-standard variable length arrays. bumgard
18:06 c++/1896: Seg Fault in qt-2.2.4 lukeskyfly
17:59 Re: Bootstrap failure: objdir=srcdir, FreeBSD make Gerald Pfeifer
17:53 Re: Bootstrap failure: objdir=srcdir, FreeBSD make Alexandre Oliva
17:46 java/1895: Libjava: Arrays.sort doesn't work harinath
16:44 Re: Bit manipulation on PowerPC Dave Korn
16:16 libstdc++/1894: typename keyword missing on sentry decls in istream.tcc and ostream.tcc bumgard
15:56 libstdc++/1893: References to ios_base::iostate not qualified in istream.tcc bumgard
14:55 Re: libstdc++-v3 won't build on IRIX 5.2 Benjamin Kosnik
14:06 c/1892: Internal segmentation fault joe
13:54 GCC snapshots + binutils 2.11 CVS won't bootstrap on FreeBSD 2.2.7 Alexandre Oliva
13:28 libstdc++-v3 won't build on IRIX 5.2 Alexandre Oliva
13:16 c++/1891: Internal compiler error in find_free_reg, at Immanuel, Gidado-Yisa
12:43 Re: c++/1687: Extreme compile time regression from 2.95.2 Zack Weinberg
12:06 preprocessor/1890: macro evaluation order prevents termination b.i.mills
11:37 Re: Why warn about #include_next in system headers? Neil Booth
11:24 Re: Why warn about #include_next in system headers? Zack Weinberg
11:02 Re: c++/1687: Extreme compile time regression from 2.95.2 Zack Weinberg
11:01 Re: Why warn about #include_next in system headers? Neil Booth
10:54 Re: Why warn about #include_next in system headers? Neil Booth
10:26 c++/1889: error in copy_body_r, at cp/optimize.c:317 cljanss
10:08 Re: gcc's <stdbool.h> is broken Zack Weinberg
10:02 Re: Why warn about #include_next in system headers? Franz Sirl
09:58 Re: c++/1687: Extreme compile time regression from 2.95.2 Kelley Cook
09:12 Re: Hundreds of g++ testsuite failures? Brad Lucier
07:46 HPUX: Did I already mention ... Markus Werle
07:06 signed integer overflow Bob Tennent
05:11 Re: gcc's <stdbool.h> is broken Jason Merrill
04:26 c++/1888: #if defined(xor) won't work moz
03:31 inheritance issue - solaris - simple testcase Alan Gonzalez
03:06 c++/1887: internal compilor error ??? allali
00:35 Re: Why warn about #include_next in system headers? Zack Weinberg
00:30 Re: Why warn about #include_next in system headers? Zack Weinberg
00:26 libstdc++/1886: Some .tcc files not includedImplementation missing for __basic_file<> template class. bumgard
00:23 Re: gcc's <stdbool.h> is broken Zack Weinberg
00:23 Re: Why warn about #include_next in system headers? Neil Booth

February 05, 2001
23:56 libstdc++/1885: bits/basic_ios.h does not include bits/basic_ios.tcc bumgard
23:50 Re: gcc's <stdbool.h> is broken Neil Booth
22:44 Re: Bit manipulation on PowerPC Geoff Keating
21:56 libstdc++/1884: Some .tcc files not included because _GLIBCPP_NO_TEMPLATE_EXPORT macro is not defined bumgard
21:52 Re: gcc's <stdbool.h> is broken Zack Weinberg
21:06 c++/1883: Function lookup in template constructors fails when using namespace. Carlo.Wood
20:36 c++/1882: Compilation fails when a default constructor appears as the first argument in constructor template. bumgard
17:56 Re: Why warn about #include_next in system headers? Alexandre Oliva
17:36 c/1881: gcc -M output has changed--breaks make's automatic prereqs cljanss
15:38 Re: Why warn about #include_next in system headers? Neil Booth
15:21 Re: Why warn about #include_next in system headers? Franz Sirl
15:16 Re: Why warn about #include_next in system headers? Neil Booth
15:15 Re: undefined `__terminate_set_func@GCC_3.0' Per Bothner
14:56 java/1880: Link failure compiling bytecode from javac jeff.sturm
14:28 Re: Missing warning (gcc version 2.97 20010122) Martin Sebor
14:18 C++ ICE with g++-20010204 Franz Sirl
14:10 Why warn about #include_next in system headers? Franz Sirl
13:44 Re: undefined `__terminate_set_func@GCC_3.0' Per Bothner
12:46 Re: gcc's <stdbool.h> is broken Neil Booth
12:28 Re: gcc's <stdbool.h> is broken Zack Weinberg
11:26 c++/1878: C++ 2.95.[23] gets an internal compiler error on IRIX 6.5.x ats
11:16 c++/1877: gcc-20010122 and gcc-20010205 cause linker errors with static const int spencer
11:04 Re: gcc's <stdbool.h> is broken Joseph S. Myers
10:30 gcc's <stdbool.h> is broken Bruno Haible
10:16 c++/1876: class template within a namespace buschelm
08:53 Missing warning (gcc version 2.97 20010122) Carlo Wood
07:44 g++ endless loop Dirk Bonekaemper
07:41 Bootstrap failure: objdir=srcdir, FreeBSD make Gerald Pfeifer
07:26 c++/1875: G++ fails compiling simple STL code fpillet

February 04, 2001
23:46 Re: undefined `__terminate_set_func@GCC_3.0' Chris G. Demetriou
22:26 c++/1874: Internal error created trying to cast - possibly incrorrectly - using trait-type classes and explicit 'class' keyword tony
21:35 Re: [patch] Re: CVS 20010202 bootstrap error in libjava Bryce McKinlay
18:26 java/1873: Can't see nested type declared in superclass of enclosing context bryce
15:36 c/1872: bootstrap failure on irix6.5 - identifier "MASK_FLAG64" is undefined David.Billinghurst
14:36 c++/1871: internal compiler error in reg_save bram
12:06 c++/1870: Legal code does not compile (iterator) schmid
11:36 c++/1869: All C++ program segfault lukeskyfly
09:21 [patch] Re: CVS 20010202 bootstrap error in libjava Matthias Klose
08:43 undefined `__terminate_set_func@GCC_3.0' Per Bothner
06:16 optimization/1868: ICE in print_rtl_and_abort, at flow.c:6592 ask
04:39 g++ exception_support.h has original_value, but not the compiler Brendan Kehoe
03:06 optimization/1867: ICE in compilation of java/lang/k_tan.c ask

February 03, 2001
22:16 java/1866: Array initializer: undefined reference to `LJv0.0' bryce
22:08 Re: [patch] Re: CVS 20010202 bootstrap error in libjava Tom Tromey
20:30 -O3 -fno-default-inline Martin Sebor
17:32 Re: [patch] Re: CVS 20010202 bootstrap error in libjava Mark Mitchell
17:23 [patch] Re: CVS 20010202 bootstrap error in libjava Bryce McKinlay
16:06 other/1865: struct utsname members are different for g++ and gcc jnance
14:46 c++/1864: another problem with virtual derivation snyder
14:25 Re: CVS 20010202 bootstrap error in libjava Mark Mitchell
13:38 Re: sparc: Cross to sparc; undefined ref to umul Alexandre Oliva
13:17 sparc: Cross to sparc; undefined ref to umul Dave Gilbert
13:10 CVS 20010202 bootstrap error in libjava Matthias Klose
13:08 Re: c++/1841: Incorrect error: invalid use of member '' in staticmember function Martin Sebor
12:57 Re: middle-end/1719: Abort in local-alloc.c Ian Dall
11:56 c++/1862: Segmentation fault caused by compiler generated exit code khuang
10:44 Re: heads up: copying libstdc++-v3 PRs Phil Edwards
09:55 Re: c++/1841: Incorrect error: invalid use of member '' in staticmember function 'Neil Booth'
09:48 Re: c++/1841: Incorrect error: invalid use of member '' in staticmember function Jean-Bernard Delva
09:36 Re: c++/1841: Incorrect error: invalid use of member '' in staticmember function Alexandre Oliva
02:00 Re: c++/1841: Incorrect error: invalid use of member '' in staticmember function 'Neil Booth'

February 02, 2001
23:19 Re: REG_DEAD/REG_EQUIV problem. Jeffrey A Law
20:27 Re: [PATCH] Re: REG_DEAD/REG_EQUIV problem. John David Anglin
18:36 heads up: copying libstdc++-v3 PRs Phil Edwards
16:43 Re: c++/1841: Incorrect error: invalid use of member '' in staticmember function Martin Sebor
16:02 RE: c++/1841: Incorrect error: invalid use of member '' in static member function Jean-Bernard Delva
15:47 Bit manipulation on PowerPC mwilliams
15:26 c++/1844: failure to match identical declarations Jens.Maurer
14:56 c++/1843: Segmentation fault during try/catch exceptions. steven.belbin
14:25 Re: c++/1841: Incorrect error: invalid use of member '' in static member function Neil Booth
13:16 c++/1842: when using regparm-attribute on function pointer, it affects previous function pointer too rat
12:26 c++/1841: Incorrect error: invalid use of member '' in static member function jb
12:11 Re: gcc 2.97 "fixincludes" breaks wnn/commonhd.h Dave Korn
12:02 RE: gcc 2.97 "fixincludes" breaks wnn/commonhd.h Bruce Korb
11:41 Re: bug? cannot copy const array Neil Booth
11:26 java/1840: unknown encoding: `ISO8859-1' schmitt
11:24 RE: bug? cannot copy const array Kazu Hirata
11:23 make distclean fails for libstdc++-v3 and srcdir==objdir Gerald Pfeifer
10:49 bug? cannot copy const array jdonner
09:26 java/1839: Assembler errors with -fjni jeff.sturm
09:16 c++/1838: g++ gives an internal compiler error in grokdeclarator pabrabbin
07:50 Re: Bug in bitset (g++ 2.95.2) Phil Edwards
06:44 Bug in bitset (g++ 2.95.2) Victor Porton
05:26 Is CSE getting more conservative on 2.95.3.test3? Kazu Hirata
03:16 c++/1837: Internal compiler error found tojuro
02:56 optimization/1836: ICE with long double && -O2 && -funroll-all-loops wolfgang.bangerth
01:50 [Patch] htdocs/install/specific.html outdated Wolfgang Bangerth
00:39 gcc 2.97 "fixincludes" breaks wnn/commonhd.h Martin Buchholz

February 01, 2001
19:56 c++/1835: toplevel cv-qualifiers considered in finding best viable function dbaron
17:56 Re: [new-regalloc] gcc.c-torture/compile/20000728-1.c at -O1 Daniel Berlin
17:37 [new-regalloc] gcc.c-torture/compile/20000728-1.c at -O1 Richard Henderson
16:25 Re: new-regalloc performance Daniel Berlin
16:03 Re: new-regalloc performance Richard Henderson
14:52 Re: new-regalloc performance Daniel Berlin
14:26 Re: new-regalloc performance Daniel Berlin
14:03 new-regalloc performance Richard Henderson
14:00 Internal error generated by g++ (#122) Douglas Boffey
13:36 libstdc++/1834: istream manipulators and sentry snyder
11:26 c++/1833: inlining sometimes causes incorrect behavior peteb
10:26 fortran/1832: -list directed i/o overflow hangs, -fbounds-check doesn't detect Robert.C.Haskell
10:16 optimization/1831: -fprofile-arcs and -fbranch-probabilities don't get along lucier
10:06 c++/1830: Singletons are buggy pb
09:32 Re: Hundreds of g++ testsuite failures? Brad Lucier
07:26 Re: Hundreds of g++ testsuite failures? Kaveh R. Ghazi
07:00 c/1827: ICE in `reverse_condition' or segfault depending on version Etienne Lorrain
05:56 java/1828: error if function arg list erronously followed by a semi-colon paul
05:48 Problem with -O2 in gcc 2.95-2 on RS6000 AIX 4.3 Philippe Lucas
04:06 c/1827: ICE in `reverse_condition' or segfault depending on version etienne_lorrain
03:28 Bug in exception handling Yakushev
01:47 [PATCH] Re: REG_DEAD/REG_EQUIV problem. Alan Modra
00:56 libstdc++/1826: unexpected program crash (only 37 lines of souce code) ge


Indexes: [Date Index] [Subject Index] [Author Index] [Thread Index]
Site Nav: [Browse other archives for this mailing list]
[Browse other mailing lists at this site]
Search: Limit to:

Mail converted by MHonArc 2.4.6