gcc-bugs archive
date index for January, 2001

This is the mail archive of the gcc-bugs@gcc.gnu.org mailing list for the GCC project.

Indexes: [Date Index] [Subject Index] [Author Index] [Thread Index]
Site Nav: [Browse other archives for this mailing list]
[Browse other mailing lists at this site]
Search: Limit to:

January 31, 2001
23:36 c++/1825: parse error results in Tree check: expected class 't', have 'x' (error_mark) schmid
22:57 REG_DEAD/REG_EQUIV problem. Alan Modra
19:47 Re: libstdc++-v3 bootstrap error: srcdir = objdir Gabriel Dos Reis
17:17 Re: testcase for hppa64 gcc bug Jeffrey A Law
17:13 Re: Hundreds of g++ testsuite failures? lucier
16:23 Re: libstdc++-v3 bootstrap error: srcdir = objdir Gerald Pfeifer
15:21 Problem building gcc 20010122 snapshot on AIX 4.3.2 Bill Deegan
14:47 gcc/g++ snapshot bug D.W.Howells
14:06 c/1824: gcc accepts computed goto's + -fprofile-arcs, gcov barfs lucier
13:03 Re: libstdc++-v3 bootstrap error: srcdir = objdir Alexandre Oliva
12:06 c++/1823: program compiled with -ftrapv aborts in std::queue<>.size() meeberdt
11:26 libstdc++/1822: math function conflicts snyder
08:46 c++/1821: friend decl. shadows forward decl. harri
08:36 debug/1819: severe problems debugging c++-code (libstdc++) schmid
08:36 libstdc++/1818: problems with cout.width, segmentation fault schmid
07:34 Re: libstdc++-v3 bootstrap error: srcdir = objdir Gerald Pfeifer
06:56 c++/1817: gnatsweb.pl has fault -after not accepting empty submitter-id slager
05:56 c/1816: Internal compiler error triggered in function.c:2630 jkelly
02:01 Re: Bootstrap configure failure Mathias Froehlich
01:58 Re: Bootstrap configure failure Alexandre Oliva
01:45 Re: Bootstrap configure failure Mathias Froehlich
01:06 libstdc++/1815: basic_stringbuf<..>:seekpos has wrong signature in libstdc++ jarausch
01:05 Re: cannot compile Alexandre Oliva
00:28 Re: cannot compile Kenichi Okada

January 30, 2001
21:47 gcc-20010129 IRIX 5.3 installation Werner Mausshardt
21:15 Re: Does a resource.h for ming32 (gcc-2.95.2) exist? Mumit Khan
19:05 Re: libstdc++-v3 bootstrap error: srcdir = objdir Alexandre Oliva
18:56 c/1814: fr30-elf 2.97 cross-compiler segmentation faults on FreeBSD 4.2-stable building libgcc dakott
18:21 libstdc++-v3 bootstrap error: srcdir = objdir Gerald Pfeifer
16:06 Does a resource.h for ming32 (gcc-2.95.2) exist? seichler
15:24 inline different sections Pete Wyckoff
14:18 Re: Possible GCC Bug, or I'm missing something major. Michael B. Trausch
13:57 problem on solaris 2.7 Chris Hayner
13:35 Re: cannot compile Alexandre Oliva
13:26 c++/1813: _G_config.h conflicting with glibc (or vice versa?) Shawn.Starr
12:26 java/1812: zextract.c cleanup tromey
11:09 Re: cannot compile Bill Priest
11:09 Re: Bootstrap failure: c++locale.cc:37:22: langinfo.h: No such fileor directory Gerald Pfeifer
09:46 Re: How to declare a global friend function from within a class withi n a namespace Alexandre Oliva
09:43 Re: Possible GCC Bug, or I'm missing something major. Alexandre Oliva
09:42 Re: cannot compile Alexandre Oliva
09:20 Re: Bootstrap failure: c++locale.cc:37:22: langinfo.h: No such file or directory Benjamin Kosnik
08:26 preprocessor/1810: /usr/local/include not searched neil
08:26 c/1811: gcc (cpp0) fails when compiling BIND 8.2.3 david.osborne
07:47 Intermediate expression not rounded to float on x86 Robison, Arch
07:22 Bootstrap failure: c++locale.cc:37:22: langinfo.h: No such file ordirectory Gerald Pfeifer
06:16 How to declare a global friend function from within a class within a namespace Juan Carlos Franzoy
04:37 Whoops, me again Michael B. Trausch
04:36 Possible GCC Bug, or I'm missing something major. Michael B. Trausch

January 29, 2001
23:36 cannot compile Kenichi Okada
21:18 Re: pa.md bugfix Jeffrey A Law
20:18 Re: Recent gcc regression on Solaris Kaveh R. Ghazi
19:56 fortran/1809: Optimiser error with LAPACK routine slaed6.f David.Billinghurst
19:15 Re: Java bootstrap failure for libjava/java/io/FilePermission.java Bryce McKinlay
18:57 Re: Java bootstrap failure for libjava/java/io/FilePermission.java Kaveh R. Ghazi
18:56 c++/1808: Internal compiler error 390. kanitkar
17:28 Re: COFF debugging info bug Richard Henderson
17:10 Re: ANSI compliance bug in Apple C compiler on OS X Zack Weinberg
17:10 Re: ANSI compliance bug in Apple C compiler on OS X Eric Peyton
16:50 Re: ANSI compliance bug in Apple C compiler on OS X Michael Hopkins
16:28 Re: ANSI compliance bug in Apple C compiler on OS X Zack Weinberg
16:18 Re: ANSI compliance bug in Apple C compiler on OS X Michael Hopkins
16:16 Re: Java bootstrap failure for libjava/java/io/FilePermission.java Alexandre Petit-Bianco
16:12 Re: ANSI compliance bug in Apple C compiler on OS X Andrew Pinski
16:08 ANSI compliance bug in Apple C compiler on OS X Drew Reynolds
15:52 ANSI compliance bug in Apple C compiler on OS X Michael Hopkins
15:46 other/1807: make bookstrap fails on HP-UX 10.20 lakata
15:05 Fixinc Question: Patching Irix's limits.h Jeffrey Oldham
14:56 c++/1806: Internal compiler error for template friend in namespace jody
14:21 Re: Java bootstrap failure for libjava/java/io/FilePermission.java Bryce McKinlay
14:11 Re: Java bootstrap failure for libjava/java/io/FilePermission.java Graham Stott
13:53 Re: Possible memory leak in g++ Neil Booth
13:34 Re: Java bootstrap failure for libjava/java/io/FilePermission.java Bryce McKinlay
13:22 Possible memory leak in g++ Daniel Merritt
13:20 Java bootstrap failure for libjava/java/io/FilePermission.java Gerald Pfeifer
12:08 Recent gcc regression on Solaris Tom Tromey
10:55 Recent alpha regression Tom Tromey
08:23 [g++] -O2 and signed/unsigned char conversion Linus Nordberg
08:06 c++/1805: formated 'cout'-output is wrong alexander.kuchler
07:46 c++/1804: c++ -c -I. -I.. -I../liboctave -I../src -I../libcruft/misc -I../glob -I../glob -DHAVE_CONFIG_H -fno-rtti -fno-exceptions -fno-implicit-templates -g -O2 -Wall sighandlers.cc A.Abbing
07:39 cvs bootstrap failure on i686-pc-linux-gnu Markus Werle
05:46 c++/1803: usage of variable declaration inside "for" loop corrupts other variable on stack joseph.barreca
05:01 Re: bootstrap fails with FreeBSD make Martin Buchholz
04:34 Re: bootstrap fails with FreeBSD make Alexandre Oliva
04:24 Re: bootstrap fails with FreeBSD make Martin Buchholz
02:36 c/1801: gcc on AIX 4.3.3 doesn`t support "long double" type levo

January 28, 2001
21:06 middle-end/1800: GCC reported an Internal Compiler Error on possibly legal code castro
17:47 Re: bootstrap2-lean Alexandre Oliva
15:35 bootstrap2-lean John David Anglin
14:53 64-bit ugliness in new-regalloc.c Brad Lucier
09:26 c++/1799: PalmOS Emulator Build Failure; Internal compiler error clamb
07:08 bug winsock? Pietro
07:08 bug winsock? Pietro
05:06 c++/1798: undefined reference to `std::istream::seekg(std::fpos<__mbstate_t>)' rafa
01:36 libstdc++/1797: 1/27 CVS won't make bootstrap. wchar_t not defined mschalit
00:33 Re: c/1793: gcc/gcc/cp/decl.c won't make - lvalue not modifiable Matt Schalit

January 27, 2001
17:03 Re: c/1793: gcc/gcc/cp/decl.c won't make - lvalue not modifiable Nix
13:46 Re: pa.md bugfix John David Anglin
13:37 Re: Problem with compiling gcc-20010122 snapshot brenner
12:54 Re: how to read out binary data Toon Moene
12:12 Re: abort in eliminate_regs compiling glob.c from glibc Richard Henderson
10:40 Problem with compiling gcc-20010122 snapshot brenner
10:13 Re: java.awt.Graphics Alexandre Petit-Bianco
09:16 c/1795: bootstrap fails for linux-m68k zippel
03:46 debug/1794: The compiler gives a Segmentation Fault when debug option is passed (-g) rafa
03:26 c/1793: gcc/gcc/cp/decl.c won't make - lvalue not modifiable mschalit

January 26, 2001
17:06 java.awt.Graphics Tao
16:46 c++/1791: wtf is synopsis? batelcruiser
15:36 c++/1790: g++ does not compile 64Bit integer features davidf
14:06 c++/1789: ICE in switch statement case erik.horsley
13:43 Re: libjava configuration problems Warren Levy
13:36 c++/1788: gcc 2.95.2 gives ICE when declaring variables as static in classes mail
13:16 c++/1787: ICE on using ::std; cesarb
12:56 c/1786: make problems on AIX 4.3.3 using C for AIX V5 ong
11:16 Re: gcc-2.95.3, but not gcc-2.95.2, requires gas on John David Anglin
11:10 Re: [PATCH] Re: COME ON! FIXIT! AGAIN: cvs bootstrap failure on hppa2.0w-hp-hpux11.00 Jeffrey A Law
11:06 Re: gcc-2.95.3, but not gcc-2.95.2, requires gas on hppa2.0-hp-hpux10.20 Jeffrey A Law
10:16 c++/1784: Internal error: Segmentation Fault when optimizing hyrosen
09:56 c++/1783: Many test failures on alphaev6-unknown-linux-gnu lucier
09:36 c++/1782: C++ erroneous requirement for final overrider 520065607613-0001
09:30 Re: libjava configuration problems Tom Tromey
09:09 C++ bug with inheritance Frank Pilhofer
08:56 c++/1781: Internal error: Segmentation Fault on illegal code hyrosen
08:44 gcc internals - TYPE_DECLs for typedefs. Brad King
07:46 libstdc++/1780: max function does not compile if <iostream> is included schmid
06:26 c++/1779: operator new with wrong argument type crashes compiler reichelt
05:39 Re: libjava configuration problems Richard Earnshaw
03:46 c/1778: IRIX 20010126 c_expand_expr compiler error jarausch
03:36 c/1777: -mmx and -msse are broken aj

January 25, 2001
22:42 Re: Invalid asms in libstdc++-v3/config/cpu/alpha/bits/atomicity.h Alexandre Oliva
22:39 Re: Invalid asms in libstdc++-v3/config/cpu/alpha/bits/atomicity.h Benjamin Kosnik
21:54 Re: Invalid asms in libstdc++-v3/config/cpu/alpha/bits/atomicity.h Alexandre Oliva
21:02 AIX c-torture failure from 2000-08-14 emit_group_load() change David Edelsohn
19:26 libstdc++/1776: misc-inst.cc causes ICE on mips-sgi-irix5.3 fleming.151
19:16 c/1775: "fixed or forbidden register 0 (ax) was spilled for class AREG" when compiling Apache kevin
18:54 Re: libjava configuration problems Warren Levy
17:56 c++/1774: parse error with method template of class template bgreen
17:11 Re: main() {char data[10000000];} crashes on alpha Michael Meissner
17:04 Re: main() {char data[10000000];} crashes on alpha Phil Edwards
15:53 gcc for hppa1.1-hp-hpux10.20 doesn't save function arguments correctly John David Anglin
15:19 main() {char data[10000000];} crashes on alpha Matthias Klose
14:14 Re: Invalid asms in libstdc++-v3/config/cpu/alpha/bits/atomicity.h Alexandre Oliva
14:10 Re: Q: Catch a segmentation fault Ross Smith
13:46 Re: Invalid asms in libstdc++-v3/config/cpu/alpha/bits/atomicity.h Benjamin Kosnik
13:26 c++/1773: __cplusplus defined to 1, should be 199711L Jens.Maurer
13:10 Re: Bootstrap configure failure Alexandre Oliva
13:09 Re: Q: Catch a segmentation fault Alexandre Oliva
13:05 Re: Invalid asms in libstdc++-v3/config/cpu/alpha/bits/atomicity.h Alexandre Oliva
11:26 c++/1772: ICE when instantiating templates with "long long" values Jens.Maurer
10:34 Re: FAIL: gcc.c-torture/execute/950628-1.c execution, -O1 Richard Henderson
10:26 c++/1771: Very strange using/const bug hyrosen
10:18 Re: FAIL: gcc.c-torture/execute/950628-1.c execution, -O1 John David Anglin
10:16 c++/1770: G++ incorrectly allows access to private member dje
07:26 c++/1769: Internal error: Segmentation Fault on simple program hyrosen
07:05 Re: gcc-2.95.3, but not gcc-2.95.2, requires gas on John David Anglin
06:12 Bootstrap configure failure Mathias Froehlich
04:16 other/1768: CVS bootstrap fails sefer
02:56 libstdc++/1767: bug with std::deque<T>::const_iterator::operator->() m.duflot
02:41 Q: Catch a segmentation fault Roger Wernersson
02:26 c++/1766: g++ gives ICE on parse error jfb37
01:36 c++/1765: bogus warning with new pod struct () nathan
01:17 Re: gcc-2.95.3, but not gcc-2.95.2, requires gas on hppa2.0-hp-hpux10.20 Martin Buchholz

January 24, 2001
23:48 Re: template pointer operator conversion Neil Booth
21:48 template pointer operator conversion Peter Garrone
18:46 Re: [PATCH] Re: COME ON! FIXIT! AGAIN: cvs bootstrap failure onhppa2.0w-hp-hpux11.00 Alan Modra
18:09 Re: gcc-2.95.3, but not gcc-2.95.2, requires gas on hppa2.0-hp-hpux10.20 Richard Henderson
17:58 Re: Invalid asms in libstdc++-v3/config/cpu/alpha/bits/atomicity.h Richard Henderson
17:32 Re: pa.md bugfix John David Anglin
17:21 Re: [PATCH] Re: COME ON! FIXIT! AGAIN: cvs bootstrap failure on hppa2.0w-hp-hpux11.00 Jeffrey A Law
16:46 Re: libjava configuration problems Warren Levy
15:19 Re: Build failure on sysv5uw7.1.0: wchar_t typedefs in headers. Bruce Korb
14:21 Re: FAIL: gcc.c-torture/execute/950628-1.c execution, -O1 Richard Henderson
14:02 Re: Invalid asms in libstdc++-v3/config/cpu/alpha/bits/atomicity.h Benjamin Kosnik
13:52 Re: Build failure on sysv5uw7.1.0: wchar_t typedefs in headers. RDBrown
13:27 Re: FAIL: gcc.c-torture/execute/950628-1.c execution, -O1 John David Anglin
13:26 c++/1764: g++ reports false warnings then crashes : segmentation fault Sylvain.Lathuy
13:26 java/1763: bad error report for failed `import' tromey
13:11 Re: FAIL: gcc.c-torture/execute/950628-1.c execution, -O1 Richard Henderson
12:56 Re: Invalid asms in libstdc++-v3/config/cpu/alpha/bits/atomicity.h Phil Edwards
11:36 Re: libstdc++/1608: Problem with TREE_PARMLIST Rod Stewart
11:06 Re: FAIL: gcc.c-torture/execute/950628-1.c execution, -O1 John David Anglin
10:56 optimization/1762: treatment of NaNs violates IEEE 754 reichelt
10:13 Re: libjava configuration problems Tom Tromey
10:06 Re: pa.md bugfix John David Anglin
09:50 GCC installation problem Sobotka Petr
09:16 c++/1760: inline asm: "=m" output doesn't force operand in memory mattias
09:16 libgcj/1759: java.io.File lacks several jdk 1.2 methods ptf
09:04 Re: gcc-2.95.3, but not gcc-2.95.2, requires gas on hppa2.0-hp-hpux10.20 John David Anglin
08:52 Re: Preprocessor Problems Alexy Khrabrov
08:46 libgcj/1758: java.util package lacks TreeMap ptf
08:34 Re: Preprocessor Problems Dave Brolley
08:26 Re: libjava configuration problems Richard Earnshaw
08:20 libjava configuration problems Richard Earnshaw
08:04 Re: bb-reorder fix Jeffrey A Law
07:56 c++/1757: ice: new-abi function-inlining friends schmid
06:27 Re: gcc-2.95.3, but not gcc-2.95.2, requires gas on hppa2.0-hp-hpux10.20 Bernd Schmidt
06:07 Re: Preprocessor Problems Alexy Khrabrov
05:50 Regression against last week: nearly infinite memory consumptionand long compile times with -O[12] Wolfgang Bangerth
05:49 ICE in set_designator, at c-typeck.c:5570 Alan Modra
05:28 Re: gcc-2.95.3, but not gcc-2.95.2, requires gas on hppa2.0-hp-hpux10.20 Bernd Schmidt
04:40 Dereference of Null pointer in loop.c Ian Dall
02:16 c++/1756: template in private causes confusion hamid.kharraziha
01:38 Re: ARM problems with the exception unwinder Jason Merrill
01:35 Re: bb-reorder fix Alan Modra

January 23, 2001
23:38 Bug in the Elf-Dwarf2.0- Output MWirth
23:36 libstdc++/1755: libstdc++-v3 gen-num-limits fails on mips-sgi-irix5.3 fleming.151
23:15 Re: top level configure needs rebuild John David Anglin
23:03 Re: snapshot bootstrap fails on hppa1.1-hpux11.00 John David Anglin
23:01 Re: top level configure needs rebuild John David Anglin
22:31 Re: top level configure needs rebuild Zack Weinberg
22:11 top level configure needs rebuild John David Anglin
22:10 Re: snapshot bootstrap fails on hppa1.1-hpux11.00 Alan Modra
21:26 c++/1754: Problem with inner class implementation jeebu19
21:26 c++/1753: g++ 2.95.2 generates incorrect code when __attribute__((packed)) is combined with bitfields cruden
20:04 Invalid asms in libstdc++-v3/config/cpu/alpha/bits/atomicity.h Alexandre Oliva
18:56 c++/1752: libiberty/demangle testsuite failures on i686-pc-cygwin David.Billinghurst
18:41 Re: snapshot bootstrap fails on hppa1.1-hpux11.00 Jeffrey A Law
18:09 Re: FAIL: gcc.c-torture/execute/950628-1.c execution, -O1 Richard Henderson
17:41 Re: [PATCH] Re: COME ON! FIXIT! AGAIN: cvs bootstrap failure on hppa2.0w-hp-hpux11.00 Alan Modra
17:21 Re: FAIL: gcc.c-torture/execute/950628-1.c execution, -O1 Richard Henderson
17:20 Re: [PATCH] Re: COME ON! FIXIT! AGAIN: cvs bootstrap failure on hppa2.0w-hp-hpux11.00 Jeffrey A Law
17:02 snapshot bootstrap fails on hppa1.1-hpux11.00 YU,SAMMY (HP-Roseville,ex1)
16:59 Re: middle-end/1719: Abort in local-alloc.c Jeffrey A Law
16:55 Re: FAIL: gcc.c-torture/execute/950628-1.c execution, -O1 John David Anglin
16:26 c++/1751: parse error results in Internal error #19990916. schmid
16:23 Re: FAIL: gcc.c-torture/execute/950628-1.c execution, -O1 John David Anglin
16:13 C++ possible GC bugs some tree nodes are not registered as roots. Graham Stott
15:51 Re: Preprocessor Problems Dave Brolley
15:17 Re: FAIL: gcc.c-torture/execute/950628-1.c execution, -O1 Richard Henderson
15:08 Internal compiler error (with wrong code, though) Matthias Klose
14:54 Re: FAIL: gcc.c-torture/execute/950628-1.c execution, -O1 Richard Henderson
14:46 Re: Java broken after i386 PIC change Richard Henderson
14:26 c/1750: suprrious warning when using memset jdeifik
14:26 c/1749: suprrious warning when including string.h jdeifik
14:07 Re: FAIL: gcc.c-torture/execute/950628-1.c execution, -O1 John David Anglin
13:59 Segmentation faults using setw() manipulator Simon Pamment
13:55 Re: Preprocessor Problems Neil Booth
13:36 c++/1748: perhaps incorrect type_info class data vsocaciu
13:31 Re: Compilation Errors with GCC on HPUX 11 Alexandre Oliva
12:29 Re: Preprocessor Problems Dave Brolley
12:07 Re: gcc-2.95.3, but not gcc-2.95.2, requires gas on hppa2.0-hp-hpux10.20 Jeffrey A Law
11:06 c++/1746: trapped exceptions causing crash jgibart
11:00 Re: Preprocessor Problems Neil Booth
10:48 Re: Preprocessor Problems Alexy Khrabrov
10:43 Re: Preprocessor Problems Neil Booth
10:30 Re: Preprocessor Problems Neil Booth
09:47 Preprocessor Problems Alexy Khrabrov
09:16 Re: ARM problems with the exception unwinder Richard Earnshaw
09:00 Re: ARM problems with the exception unwinder Jason Merrill
08:59 Re: gcc-2.95.3, but not gcc-2.95.2, requires gas on hppa2.0-hp-hpux10.20 John David Anglin
08:56 java/1745: compiler segfault on bogus code. ptf
08:39 Re: gcc-2.95.3, but not gcc-2.95.2, requires gas on hppa2.0-hp-hpux10.20 Bernd Schmidt
08:35 Re: gcc-2.95.3, but not gcc-2.95.2, requires gas on hppa2.0-hp-hpux10.20 Jeffrey A Law
08:21 Re: Java broken after i386 PIC change Philip Blundell
08:15 Re: g++: virtual function call failes in constructor Gabriel Dos Reis
07:37 Re: Java broken after i386 PIC change Phil Edwards
06:36 c++/1743: iostream::seekg does not reset fail and eof bits tarot
06:22 Re: ARM problems with the exception unwinder Richard Earnshaw
06:03 Re: ARM problems with the exception unwinder Andrew Haley
05:52 GCC 2.96 bug Burn Alting
05:06 Re:g++:virtual function call failes in constructor Martin Reinecke
04:56 c++/1742: bug in gcc 2.95.2 on SunOS 5.6 due to too big function name dants
03:58 Re: ARM problems with the exception unwinder Richard Earnshaw
03:25 g++: virtual function call failes in constructor Martin Weber
01:26 other/1741: GCC make failing with Internal compiler error in 'dump_and_abort' edA-qa
00:46 c++/1740: g++ 2.96 generates illegal operands in assembly file haenni

January 22, 2001
22:31 Re: gcc-2.95.3, but not gcc-2.95.2, requires gas on hppa2.0-hp-hpux10.20 John David Anglin
22:01 gcc-2.95.3, but not gcc-2.95.2, requires gas on hppa2.0-hp-hpux10.20 Martin Buchholz
20:26 2.97 and C++ Carlo Wood
20:05 Installation problem Carlo Wood
19:56 c/1739: "Character constant too long" on irix6.5 with -mabi=64 David.Billinghurst
19:16 [PATCH] Re: COME ON! FIXIT! AGAIN: cvs bootstrap failure on hppa2.0w-hp-hpux11.00 Alan Modra
18:56 c++/1738: template function with volatile formal parameter confuses compiler mps
17:53 C++: namespace resolution bug - retraction Simpson, Kenny
17:43 C++: namespace resolution bug - correction Simpson, Kenny
16:46 c/1737: Parallel make error with cygwin David.Billinghurst
16:30 Re: Mixed success building gcc-2.95.3.test2 John David Anglin
15:58 Re: Java broken after i386 PIC change Philip Blundell
15:56 libgcj/1736: [irix 6.5] Cannot create libgcj - Arg list too long David.Billinghurst
14:55 Re: Java broken after i386 PIC change Richard Henderson
14:48 C++: namespace resolution bug Simpson, Kenny
14:46 optimization/1735: g++ crash in expand_inline_function with optimization snyder
14:06 libstdc++/1734: Use of char_traits::_S_eos() in ostream manipulators will break with user-defined traits. bumgard
13:54 Re: Java broken after i386 PIC change Phil Edwards
13:36 c++/1733: C++ ICE in copy_body_r with optimization on snyder
11:56 Re: FAIL: gcc.c-torture/execute/950628-1.c execution, -O1 John David Anglin
11:21 Re: Java broken after i386 PIC change Jeff Sturm
11:06 libstdc++/1732: g++ does not compile vector<type>(iterator, iterator) schmid
11:05 Re: Java broken after i386 PIC change Richard Henderson
10:24 Re: RFA - C++ new initializers Mark Mitchell
10:05 Compilation Errors with GCC on HPUX 11 Bruno Beaumont
09:56 c++/1731: Internal compiler error 191 for inherited overloaded operator[] on NULL C.vanReeuwijk
09:35 Assignment of long long to long: No Warning with -Wall Meenaradchagan Vishnu
08:31 ARM problems with the exception unwinder Richard Earnshaw
08:16 web/1730: Can I have a copy of your gnatsweb.pl file enzo.balbo
08:00 BUG? Stack size for char variables Soslan Khubetsov
07:46 c++/1729: Internal compiler error jlperez
07:06 Re: Mixed success building gcc-2.95.3.test2 Martin Buchholz
07:05 Re: COME ON! FIXIT! AGAIN: cvs bootstrap failure on hppa2.0w-hp-hpux11.00 Markus Werle
06:51 Re: Mixed success building gcc-2.95.3.test2 Bernd Schmidt
06:47 Re: Mixed success building gcc-2.95.3.test2 Martin Buchholz
06:28 Re: Mixed success building gcc-2.95.3.test2 Bernd Schmidt
06:23 Re: Mixed success building gcc-2.95.3.test2 Martin Buchholz
05:46 c++/1728: Weird behaviour with specialization of inner class constructor of template class wolfgang.bangerth
05:44 COME ON! FIXIT! AGAIN: cvs bootstrap failure on hppa2.0w-hp-hpux11.00 Markus Werle
05:06 libobjc/1727: Invoking methods of instances created with @protocol michael.scheibler
04:52 libobjc: @protocol doesn't retrieve valid class pointer Michael Scheibler
04:36 c++/1726: ?!? johanc
04:17 Re: RFA - C++ new initializers Gabriel Dos Reis
04:09 Re: Mixed success building gcc-2.95.3.test2 Bernd Schmidt
04:01 gcc mmap test fails on Solaris Casper Dik
02:56 c++/1725: Internal compiler error in copy_body_r, at cp/optimize.c:317 pfeifer
02:31 Re: web/1646: The GNATS query filters do not work correctly Gerald Pfeifer
02:20 RFA - C++ new initializers Nathan Sidwell
02:16 libstdc++/1724: Backward compatibility <vector.h> not compilable wolfgang.bangerth

January 21, 2001
20:52 Re: Java broken after i386 PIC change Jeff Sturm
19:36 c++/1722: unsigned int confused with pointer richarda
15:36 c++/1721: typedef fails for template classes in CVS 2001-01-15 richarda
14:40 Re: Java broken after i386 PIC change Alexandre Petit-Bianco
14:35 Re: Java broken after i386 PIC change Richard Henderson
14:33 RE: Hundreds of g++ testsuite failures? Billinghurst, David (CRTS)
12:52 Re: Java broken after i386 PIC change Tom Tromey
12:32 Re: Hundreds of g++ testsuite failures? (long) RDBrown
10:36 libstdc++/1720: Gslices do not work as expected for valarray<double> schmid
06:50 Re: middle-end/1719: Abort in local-alloc.c Ian Dall
04:56 middle-end/1719: Abort in local-alloc.c Ian Dall
04:06 libgcj/1718: ArithmeticException regressions bryce
02:36 libstdc++/1717: some include trouble + wrong output via wcout michael
02:34 bootstrap error for m68k-unknown-linux-gnu (CVS 20010118) Matthias Klose
02:08 Re: system calls in gcc-2.96 under RedHat Linux 7.0 Philipp Thomas

January 20, 2001
23:35 Re: Java broken after i386 PIC change Richard Henderson
23:27 Re: Java broken after i386 PIC change Bryce McKinlay
23:22 Re: Java broken after i386 PIC change Bryce McKinlay
22:39 Re: Java broken after i386 PIC change Richard Henderson
22:20 Re: Java broken after i386 PIC change Per Bothner
22:07 Re: Java broken after i386 PIC change Richard Henderson
22:00 Re: Java broken after i386 PIC change Per Bothner
21:46 Re: Java broken after i386 PIC change Richard Henderson
21:00 Re: Java broken after i386 PIC change Bryce McKinlay
20:19 Re: Java broken after i386 PIC change Richard Henderson
19:58 Re: Java broken after i386 PIC change Bryce McKinlay
18:14 Re: Java broken after i386 PIC change Richard Henderson
17:36 c++/1716: egcs internal compiler error 40 nenad
13:36 c/1715: Tree check: expected class 't', have 'x' (error_mark) schmid
10:56 c/1714: ice in process_init_element __attribute__(__aligned__) schmid
06:14 Hundreds of g++ testsuite failures? Kaveh R. Ghazi
04:57 `make distclean' broken (was failure to bootstap on sparc-sun-solaris2.7) Martin Buchholz
04:24 Re: conditional exec verify_live problem after scheduling Richard Earnshaw
02:26 c/1713: some programs using `bool' from stdbool.h no longer compile jim
01:36 c++/1711: `make -j3 install' fails when $(prefix) directory doesn't exist jim
01:04 Re: Bootstrap failure 2.95.3-test2 for i686-pc-linux-gnu Andris Pavenis
00:05 Mixed success building gcc-2.95.3.test2 Martin Buchholz

January 19, 2001
23:57 Re: gcc-2.95.3-test2 fails to bootstrap on sparc-sun-solaris2.7 Martin Buchholz
18:36 libstdc++/1710: strings.find_last_of() function works only if I explicitly reference the strings.c_str() function after calling it mdh_gcc
16:16 c++/1709: ICE on C++ template code rodrigc
15:26 c/1708: bitfield initializations not skipping anonymous fields andyj
14:16 libstdc++/1707: libstdc++ v3 gets confused by private assignment operators meeberdt
14:15 Issue with small struct return values Andy Johnson
13:58 Conflict between template class name and struct field name Andy Johnson
13:56 debug/1706: Stabs definition for "complex" and "double complex" incorrect sdchen007
13:19 Re: FAIL: gcc.c-torture/execute/950628-1.c execution, -O1 John David Anglin
12:56 c/1705: ice in process_init_element while compiling linux-2.4.0 schmid
12:56 libstdc++/1704: Null output from Josuttis example pcarlini
12:39 Re: system calls in gcc-2.96 under RedHat Linux 7.0 Alexandre Oliva
12:34 Re: system calls in gcc-2.96 under RedHat Linux 7.0 Dirk Petry
12:09 Re: Bootstrap failure 2.95.3-test2 for i686-pc-linux-gnu Graham Stott
11:53 Re: Bootstrap failure 2.95.3-test2 for i686-pc-linux-gnu Andris Pavenis
11:16 test_summary script goes into infiite looploops forever on input file John David Anglin
11:12 Re: system calls in gcc-2.96 under RedHat Linux 7.0 Alexandre Oliva
10:46 system calls in gcc-2.96 under RedHat Linux 7.0 Dirk Petry
10:36 c++/1703: g++ creates default destructor with wrong `throw' signature wolfgang.bangerth
09:24 Re: Bootstrap failure 2.95.3-test2 for i686-pc-linux-gnu Bernd Schmidt
08:56 c++/1702: virtual inheritance initialization bug degreef
08:55 Internal error #122 Nicolas Galan
08:24 Re: Bootstrap failure 2.95.3-test2 for i686-pc-linux-gnu John Wolfe
05:26 Re: c++/1699: can't compile Linux kernels Bernd Schmidt
00:12 Re: Bootstrap failure 2.95.3-test2 for i686-pc-linux-gnu Andris Pavenis
00:00 Re: Update g77.f-torture/compile/20000601-1.f (PR fortran/275) Neil Booth

January 18, 2001
22:56 c++/1701: new-abi bug: bad code generated with complex virtual derivation snyder
21:44 Update g77.f-torture/compile/20000601-1.f (PR fortran/275) Billinghurst, David (CRTS)
20:37 Re: FAIL: gcc.c-torture/execute/950628-1.c execution, -O1 John David Anglin
19:36 c++/1699: can't compile Linux kernels jhurt
18:49 Re: Problems with -MD -MMD preprocessing for dependency information Phil Edwards
17:01 Re: FAIL: gcc.c-torture/execute/950628-1.c execution, -O1 John David Anglin
16:37 Potential link or compiler bug Bregante-Candau, Sharon
15:36 target/1698: compiling optimized code using mips4 on R12000 MIPS mburnham
14:14 FAIL: gcc.c-torture/execute/950628-1.c execution, -O1 John David Anglin
14:06 Bootstrap failure 2.95.3-test2 for i686-pc-linux-gnu jlw
09:53 build_insn_chain Jan Krueger
09:16 other/1697: bootstrapping fails: malformed option `-A system=posix' harri
06:36 c/1696: -fstack-check doesn't seem to be working on intel systems (sigsegv in initialisation phase of function) ungod
05:36 c++/1695: Template non-type arg ICE nathan
05:36 c++/1694: bogus errors during type deduction nathan
05:03 Re: gcc-2.95.3-test2 fails to bootstrap on sparc-sun-solaris2.7 Bernd Schmidt
04:41 gcc-2.95.3-test2 fails to bootstrap on sparc-sun-solaris2.7 Martin Buchholz
03:16 libstdc++/1693: sstream causes linkage error jarausch
03:16 c++/1692: -fvtable-gc flag is only meaningful on ELF targets Richard Earnshaw
03:06 c/1691: Internal compiler error in c_expand_expr, at c-common.c:4072 jarausch
03:02 Java broken after i386 PIC change Bryce McKinlay
02:06 c++/1690: GCC 2.96 gives internal error when compiling filename.cc Lute.Kamstra
01:16 c++/1689: dynamic_cast operator is wrong Jorgen.Sigvardsson

January 17, 2001
23:41 Re: alpha-dec-osf4.0e libstdc++-v3/src/complex_io.cc assembler failures. Brent Verner
22:38 Re: more hpux fun (ICE building libgcc2.c in __fixunsdfdi) John David Anglin
19:15 ICE while bootstrapping on i686-linux with current CVS Edgar Villanueva
16:33 Re: alpha-dec-osf4.0e libstdc++-v3/src/complex_io.cc assembler failures. Benjamin Kosnik
16:29 Re: Build failure on sysv5uw7.1.0: wchar_t typedefs in headers. Benjamin Kosnik
16:29 more hpux fun (ICE building libgcc2.c in __fixunsdfdi) Joe Buck
13:52 alpha-dec-osf4.0e libstdc++-v3/src/complex_io.cc assembler failures. RDBrown
13:51 Build failure on sysv5uw7.1.0: wchar_t typedefs in headers. RDBrown
12:36 c++/1688: Includes causing extern "C" not to behave correctly (?) daniel
12:06 c++/1687: Extreme compile time regression from 2.95.2 kelley.cook
11:54 Re: -fsyntax-only broken? Phil Edwards
11:16 Re: x86 Bootstrap Failure Jeffrey Oldham
11:10 Re: Problems with -MD -MMD preprocessing for dependency information Neil Booth
09:52 gcc-2.95.3.test2: compiler messages Mario Vanoni
09:33 Problems with -MD -MMD preprocessing for dependency information David Mahaffey
09:15 x86 Bootstrap Failure in find_free_freg Mark Mitchell
07:18 -fsyntax-only broken? Stelios Xanthakis
07:08 Re: Bug: Failure to compile legal code (gcc-2.95.2) Mike Harrold
07:00 Re: Bug: Failure to compile legal code (gcc-2.95.2) Loren James Rittle
06:40 Re: Bug: Failure to compile legal code (gcc-2.95.2) Mike Harrold
06:32 Re: Bug: Failure to compile legal code (gcc-2.95.2) Alexandre Oliva
06:28 Re: glibc can't build on linuxppc Franz Sirl
05:47 glibc can't build on linuxppc Janez Zupan
05:41 CVS-version fails on IRIX jarausch
05:36 c++/1685: class java.lang.ThreadLocal is missing p.thio
05:26 java/1684: java.util.treeset and java.util.treemap are missing p.thio
05:25 ICE in set_designator, during kernel build Jeff Garzik
05:20 Bug: Failure to compile legal code (gcc-2.95.2) Mike Harrold
05:16 c++/1683: failure during bootstrap (current CVS) ritzert
05:16 java/1682: internal error during compilation of public final static String members p.thio
04:56 java/1681: Internal error during compilation of assigment expression p.thio
04:35 please review, is it bug ? Artak Avetyan
03:46 c++/1679: c++ -v -save-temps -DHAVE_CONFIG_H -I. -I. -I. -I./.. -isystem /usr/local/X11/include -DNDEBUG -O2 -g -W -Wall -trigraphs -c HelpCB.C zac
01:50 hpux10.20 ICE during bootstrap Christian Iseli
01:46 java/1677: Method.invoke() fails for arguments of type boolean p.thio
00:14 Re: Building error with AIX 4.2 Mark Mitchell
00:06 Re: Building error with AIX 4.2 benjamin kosnik

January 16, 2001
23:48 ICE while bootstrapping on i686-linux with current CVS Andreas Jaeger
23:13 Re: Building error with AIX 4.2 Mark Mitchell
22:23 Re: Building error with AIX 4.2 Mark Mitchell
22:17 Re: libtool vs gcj Alexandre Oliva
20:29 Re: i686 bootstrap failure on libgcc2.c Zack Weinberg
20:14 Re: compiler bug Alexandre Oliva
19:09 how to read out binary data Bomin Sun
18:47 Re: i686 bootstrap failure on libgcc2.c Bryce McKinlay
18:41 x86 ICE in find_free_reg Jeff Garzik
18:31 Re: more hpux 10.20 trouble: bad gencodes.c file John David Anglin
18:16 c++/1675: C++: ambigous overload compile failure Dirk Mueller
18:07 Re: i686 bootstrap failure on libgcc2.c Zack Weinberg
17:40 i686 bootstrap failure on libgcc2.c Bryce McKinlay
17:16 c++/1674: Internal compiler error: fix_lexical_addr dkerns
15:36 c/1673: ICE in rtx_equal_for_memref_p Michael
15:11 Re: c/1624: incorrect stack adjustment with -fomit-frame-pointer on x86 Ulrich Drepper
15:03 RE: compiling GCC 2.95.2 Billinghurst, David (CRTS)
14:26 Re: libtool vs gcj Alexandre Oliva
13:16 c++/1672: dynamic_cast<> gives wrong value under certain circumstances mac
13:00 Re: compiling GCC 2.95.2 Alexandre Oliva
12:59 Re: Here I am again: hpux-11 build failure Alexandre Oliva
12:02 Re: Building error with AIX 4.2 Benjamin Kosnik
11:46 c++/1671: i960gcc crashes when run with Cygnus 1.0 (ok with B20) dstevens
11:26 c/1670: HPUX: call through pointer to static function mangles argument values broeker
10:44 compiling GCC 2.95.2 Richard G. Ball
10:05 Re: libtool vs gcj Alexandre Oliva
08:31 Here I am again: hpux-11 build failure Markus Werle
07:58 Re: Bug in g++ --syntax-only Phil Edwards
07:49 incorrect speculation on ia64-redhat-linux (GCSE pass) Paolo Bonzini
07:36 other/1669: chill compilation failed on solaris ask
07:26 c/1668: Internal compiler error on GNU/Linux alpha Christian Iseli
06:56 c/1667: Internal compiler error in reload on GNU/Linux alpha Christian Iseli
06:26 c++/1666: Internal compiler error on legal code Zsolt.Molnar
05:40 Re: Bug in g++ --syntax-only Jason Merrill
04:56 c++/1665: derived inner class template sylvain.gommier
04:46 c++/1664: minimum value for signed long integers sylvain.gommier
03:29 compiler bug Artak Avetyan
03:11 Re: more hpux 10.20 trouble: bad gencodes.c file (gengenrtl prob) RDBrown
03:06 middle-end/1663: bug in loop.c hpenner
02:17 Re: Bug in g++ --syntax-only Phil Edwards
01:27 Re: Bug in g++ --syntax-only Jason Merrill
01:18 Building error with AIX 4.2 Andreas Conz
01:06 c/1662: C compiler fails when -O option is used. michael.dillard
00:56 c++/1661: internal error meixner
00:42 Re: c/1624: incorrect stack adjustment with -fomit-frame-pointer on x86 Richard Henderson

January 15, 2001
22:16 libstdc++/1660: memory leak in ostrstream r.standish
22:07 Re: Bug in g++ --syntax-only Phil Edwards
21:55 Re: Bug in g++ --syntax-only Richard Henderson
21:15 Re: Bug in g++ --syntax-only Phil Edwards
18:50 Re: bootrapping solaris 2.7 with GNU ld, how? Phil Edwards
17:41 more hpux 10.20 trouble: bad gencodes.c file Joe Buck
17:13 libtool vs gcj Richard Henderson
17:02 GCC 2.96 bug: Internal error #122 Mixter
16:42 build failure on hppa2.0-hp-hpux10.20 Joe Buck
15:36 Re: Error installing CVS GCC Joseph S. Myers
13:23 Error installing CVS GCC Neil Booth
11:36 libstdc++/1658: -O0 -g -fcheck-memory-usage cheusov
11:21 Re: #include MACRO Neil Booth
11:11 Re: Infinite loop while generating gcc.1 Richard Henderson
06:33 [C++] PTRMEM_CSTs Nathan Sidwell
05:26 c++/1657: types weirdness (looks like memory corruption with -ggdb) wolfgang.bangerth
05:20 class member reference to template Markus Werle
04:26 c++/1656: gcc incorrectly accepts template syntax on non-template class wolfgang.bangerth
04:24 Re: 20010112 cstdlib failure on Linux Bernd Schmidt
03:04 #include MACRO Axel Kittenberger
02:54 Re: gcc-20010108 IRIX 5.3 installation Werner Mausshardt
02:13 g77 bug Koos Meijerink
02:06 c++/1654: This (incorrect) code generates an internal compiler error. johan
01:36 optimization/1653: ICE in expand_inline_function martin
01:02 C++: problems with default args and const member functions Wolfgang Bangerth
00:56 c++/1652: CVS20010114 tries to instantiate wrong template wolfgang.bangerth
00:06 Re: Infinite loop while generating gcc.1 Joseph S. Myers

January 14, 2001
21:16 Re: PATCH: PIC_OFFSET_TABLE_REGNUM_SAVED should be call used when John David Anglin
20:36 Re: PATCH: PIC_OFFSET_TABLE_REGNUM_SAVED should be call used when John David Anglin
20:31 Re: glibc 2.1.1pre2 breaks libstdc++-v3 build Jeffrey A Law
20:17 Re: Infinite loop while generating gcc.1 Russ Allbery
20:03 Re: PATCH: PIC_OFFSET_TABLE_REGNUM_SAVED should be call used when Jeffrey A Law
18:02 Re: [c/c++] i686 codegen bugs in tinfo2.cc Richard Henderson
18:00 Re: PATCH: PIC_OFFSET_TABLE_REGNUM_SAVED should be call used when Alan Modra
17:58 Re: [c/c++] i686 codegen bugs in tinfo2.cc Richard Henderson
17:46 c++/1651: Large number of irix6.5/-mabi=64 testsuite failures coincident with V3 abi changes David.Billinghurst
17:16 c/1650: Lack of ansi-C (pedantic) warning in -ansi -pedantic compilation mode s3173243
16:59 Re: [c/c++] i686 codegen bugs in tinfo2.cc Benjamin Kosnik
16:53 Re: [c/c++] i686 codegen bugs in tinfo2.cc Alan Modra
16:14 Re: [c/c++] i686 codegen bugs in tinfo2.cc Richard Henderson
15:49 Re: [c/c++] i686 codegen bugs in tinfo2.cc Richard Henderson
15:14 Re: RFC: Jump to const_int Richard Henderson
14:17 Re: RFC: Jump to const_int John David Anglin
14:02 Re: RFC: Jump to const_int Richard Henderson
13:47 Re: RFC: Jump to const_int John David Anglin
13:04 Re: Infinite loop while generating gcc.1 Richard Henderson
12:32 Re: c++/gcc_update rm stdstreams.cc needed by make Benjamin Kosnik
11:57 c++/gcc_update rm stdstreams.cc needed by make Larry Evans
07:28 Re: libf2c/1644: lapack routine segfaults on i686, but not on sparc Toon Moene
07:16 c/1648: ice: i686-pc-linux-gnu with -march=i686 but not with -march=i586 schmid
06:51 Re: Infinite loop while generating gcc.1 Joseph S. Myers
06:16 target/1647: patch for gcc-2.95.3 on NetBSD/sparc-1.5 bunk
06:08 Re: [c++] explicit instantiations + namespaces Jason Merrill
06:03 Infinite loop while generating gcc.1 Toon Moene
05:24 Re: Patch to expose G++ builtins failures Kaveh R. Ghazi
04:38 Re: web/1646: The GNATS query filters do not work correctly Joseph S. Myers
04:26 web/1646: The GNATS query filters do not work correctly neil
04:06 fortran/1645: cygwin optimization problem David.Billinghurst
02:22 Re: RFC: Jump to const_int Richard Henderson
01:05 Re: RFC: Jump to const_int Richard Henderson

January 13, 2001
23:26 libf2c/1644: lapack routine segfaults on i686, but not on sparc wilkenin
14:56 c/1643: Snapshot GCC-20010108 Internal compiler error trond.bo
12:35 Re: move2add change breaks arm bootstrap Alexandre Oliva
11:12 move2add change breaks arm bootstrap Richard Earnshaw
07:43 Re: fortran/1636: Format strings with identical numbers cause assembler error Toon Moene
07:22 v8qi_ftype_v8qi_di etc unused in i386.c Andreas Jaeger
05:49 20010112 cstdlib failure on Linux jarausch
02:46 c/1642: problem with inline assembler: result variable not finished (?) when used mirar

January 12, 2001
22:27 Re: gcc-20010108 IRIX 5.3 installation Alexandre Oliva
21:56 libgcj/1640: gcj runtime problem: undefined symbol __dso_handle (PR 1178 again, with most recent gcc) wagman
21:10 Re: RFC: Jump to const_int Fergus Henderson
21:08 Re: gencodes.c includes pa.h twice causing bootstrap failure Alexandre Oliva
20:43 gencodes.c includes pa.h twice causing bootstrap failure John David Anglin
19:50 Re: libstdc++/1576: crash before entering main Florian Kainz
19:40 Re: RFC: Jump to const_int John David Anglin
17:30 Re: c++/1631: placement new broken for enumeration types Frederik Schaffalitzky
15:24 Re: Patch to expose G++ builtins failures Mark Mitchell
15:06 c++/1639: template operator != interferes with const expressions kaa
15:06 c++/1638: ICE: two void_type nodes in arg_types list kaa
14:59 Bug in g++ --syntax-only Tom Tromey
14:57 Disable-shared no longer default Michael Eager
14:24 Patch to expose G++ builtins failures Kaveh R. Ghazi
14:13 bootrapping solaris 2.7 with GNU ld, how? Mike Stump
14:06 c++/1637: compiler internal error on unknown exception name in catch() clause wanderer
13:30 Re: [c++] weird mangling issue Benjamin Kosnik
13:19 Re: [c++] weird mangling issue Mike Harrold
13:09 Re: [c++] weird mangling issue Mark Mitchell
13:06 fortran/1636: Format strings with identical numbers cause assembler error peter
12:57 [c++] weird mangling issue Benjamin Kosnik
12:19 Snapshot GCC-20010108 Internal compiler error Trond Bo
12:16 c++/1635: 2 constructors and 3 destructors called for thrown object ouej
12:05 Re: glibc 2.1.1pre2 breaks libstdc++-v3 build Ulrich Drepper
11:45 Re: glibc 2.1.1pre2 breaks libstdc++-v3 build Zack Weinberg
11:33 natClip.cc bug Barnet Wagman
11:33 Re: glibc 2.1.1pre2 breaks libstdc++-v3 build Ulrich Drepper
11:18 Re: gnerating deps with cpp Neil Booth
11:08 Re: glibc 2.1.1pre2 breaks libstdc++-v3 build Neil Booth
10:51 Re: glibc 2.1.1pre2 breaks libstdc++-v3 build Zack Weinberg
10:46 other/1634: Request for gcc-cvs-patches list Joseph Myers
10:43 RFC: Jump to const_int John David Anglin
10:15 Re: ICE - Unrecognizable insn Jan Hubicka
10:12 Re: glibc 2.1.1pre2 breaks libstdc++-v3 build Neil Booth
09:46 c++/1633: Internal compiler error sven.vollbehr
09:34 Re: ICE - Unrecognizable insn Jan Hubicka
08:47 gcc is slow for me Drcadmando
08:16 c++/1632: Invalid and incomprehensible error message wolfgang.bangerth
07:47 Re: conditional exec verify_live problem after scheduling Richard Earnshaw
07:37 Re: conditional exec verify_live problem after scheduling Bernd Schmidt
07:35 ICE - Unrecognizable insn Andreas Jaeger
07:28 Re: conditional exec verify_live problem after scheduling Richard Earnshaw
07:15 Re: conditional exec verify_live problem after scheduling Bernd Schmidt
07:06 c++/1631: placement new broken for enumeration types fsm
06:51 gcc-2.97 internal error nbecker
06:40 gcc version 2.97 20010112 (experimental) internal error nbecker
06:09 CVS: ostringstream failure (urgent please) jarausch
04:46 c++/1630: [temp.deduct.call] allows more lenient qualifcation convs nathan
04:44 Re: glibc 2.1.1pre2 breaks libstdc++-v3 build Jakub Jelinek
04:39 Re: glibc 2.1.1pre2 breaks libstdc++-v3 build Bernd Schmidt
02:26 java/1629: gcj link problem with a simple program Patrik Hagglund
01:37 Re: glibc 2.1.1pre2 breaks libstdc++-v3 build Joseph S. Myers
01:30 Re: glibc 2.1.1pre2 breaks libstdc++-v3 build Nathan Myers
00:56 c++/1628: Bogus (but annoying) warning about unused parameter wolfgang.bangerth

January 11, 2001
23:47 Re: glibc 2.1.1pre2 breaks libstdc++-v3 build Neil Booth
22:42 Re: c/1569: Internal compiler error in print_rtl_and_abort, at flow.c:6502 Igor Schein
21:56 c++/1627: overloading new[] and delete[] and what happens with fstream gccbug
21:39 Re: gcc-20010108 IRIX 5.3 installation Werner Mausshardt
21:36 c/1626: Failure during 'make install' Mike
17:46 c/1625: _Bool initializers bug Joseph Myers
17:26 c/1624: incorrect stack adjustment with -fomit-frame-pointer on x86 drepper
16:49 Re: glibc 2.1.1pre2 breaks libstdc++-v3 build Ulrich Drepper
16:37 Re: glibc 2.1.1pre2 breaks libstdc++-v3 build Joseph S. Myers
16:24 Re: glibc 2.1.1pre2 breaks libstdc++-v3 build Ovidiu Predescu
15:15 Re: libstdc++/1618: lrand48() undefined Benjamin Kosnik
14:56 c/1623: GCC allows void function to return value neel
14:28 Re: glibc 2.1.1pre2 breaks libstdc++-v3 build Kaveh R. Ghazi
14:06 c++/1622: -fvtable-gc flag optimizes away virtual functions even if function is used alex
14:03 Re: glibc 2.1.1pre2 breaks libstdc++-v3 build Ulrich Drepper
13:29 Re: glibc 2.1.1pre2 breaks libstdc++-v3 build Kaveh R. Ghazi
13:06 Re: Fortran compiler does not compile Neil Booth
12:46 Re: c/1613: gcc version 2.97 20010110 (experimental) does not build sh-linux-gnu-gcc Michael Eager
12:13 Re: glibc 2.1.1pre2 breaks libstdc++-v3 build Joseph S. Myers
11:40 Fortran compiler does not compile Peter Schmid
11:22 Re: [c/c++] i686 codegen bugs in tinfo2.cc Richard Henderson
11:14 Re: glibc 2.1.1pre2 breaks libstdc++-v3 build Benjamin Kosnik
11:06 libstdc++/1620: excessive striking <Enter> for cin and incorrect string input wanderer
11:06 debug/1621: Debugging with complex numbers Joseph Myers
10:50 Re: gcc-20010108 IRIX 5.3 installation Gabriel Dos Reis
10:22 Re: glibc 2.1.1pre2 breaks libstdc++-v3 build Ulrich Drepper
10:18 Re: glibc 2.1.1pre2 breaks libstdc++-v3 build Kaveh R. Ghazi
10:18 Re: [c/c++] i686 codegen bugs in tinfo2.cc Benjamin Kosnik
09:55 Re: glibc 2.1.1pre2 breaks libstdc++-v3 build Benjamin Kosnik
09:27 glibc 2.1.1pre2 breaks libstdc++-v3 build Joseph S. Myers
08:44 Re: gcc-20010108 IRIX 5.3 installation Alexandre Oliva
08:24 Re: bug? Alexandre Oliva
08:16 c++/1619: c++ 2.95.2: Problem with `c++ -O' on template-based code Eric Eide
08:08 Re: gcc-20010108 IRIX 5.3 installation Werner Mausshardt
08:06 libstdc++/1618: lrand48() undefined david.eller
06:42 bug? Eerola Olavi
06:08 Re: armv4l bootstrap problem in libstdc++-v3 Richard Earnshaw
05:26 c++/1617: partial ordering of function templates nathan
05:23 RE: Internal compiler error building apache 1.3.14 using gcc 2.95 on SunOS 5.7 Kenneth sterberg
04:06 c++/1616: gcc allows access to private variable in enclosing scope wolfgang.bangerth
03:16 libgcj/1615: java.math.BigInteger.modPow produces bogus results w/ certain input data mjr
03:03 Re: Internal compiler error building apache 1.3.14 using gcc 2.95 on SunOS 5.7 Alexandre Oliva
02:34 Internal compiler error building apache 1.3.14 using gcc 2.95 on SunOS 5.7 Kenneth sterberg
01:34 Re: [c/c++] i686 codegen bugs in tinfo2.cc Richard Henderson
01:16 c/1613: gcc version 2.97 20010110 (experimental) does not build sh-linux-gnu-gcc soka

January 10, 2001
23:50 Re: java install bug Neil Booth
22:54 Re: bug in g77 -O2 optimization found -- resending with attachment Toon Moene
22:01 Re: libstdc++/1605: exception::what() declares no exception list Benjamin Kosnik
21:55 [c++] adding empty throw specs in <typeinfo> creates havoc Benjamin Kosnik
21:18 Re: gcc-20010108 IRIX 5.3 installation Alexandre Oliva
21:09 Re: gcc-20010108 IRIX 5.3 installation Werner Mausshardt
20:29 Problems overriding underflow() and overflow() in derived streambuf. sondheim
20:16 c++/1611: c++ new-abi generates bad code with virtual derivation snyder
19:44 Re: java install bug Zack Weinberg
19:26 Re: java install bug Bryce McKinlay
18:58 [c/c++] i686 codegen bugs in tinfo2.cc Benjamin Kosnik
17:53 Re: gcc-20010108 IRIX 5.3 installation Alexandre Oliva
17:25 Compiling current CVS fails Philipp Thomas
15:59 Re: armv4l bootstrap problem in libstdc++-v3 Mark Mitchell
15:58 Re: armv4l bootstrap problem in libstdc++-v3 Mark Mitchell
14:02 Re: armv4l bootstrap problem in libstdc++-v3 Mark Mitchell
13:52 Re: gcc DWARF debug info for PowerPC Geoff Keating
13:06 Re: bug in g77 -O2 optimization found -- resending with attachment Jonathan DeSena
12:46 c/1610: multiplication bug in Intel PII + linux + gcc soren
11:56 c/1609: -funsigned-char -fsigned-char defines __CHAR_UNSIGNED__ Joseph Myers
11:44 Re: libstdc++-v3 and --enable-version-specific-runtime-libs Benjamin Kosnik
11:43 libstdc++-v3 and --enable-version-specific-runtime-libs Magnus Fromreide
11:35 C++ Internal compiler error in copy_body_r, at cp/optimize.c 317 Gerald Pfeifer
11:25 Re: partial ordering of function templates Gabriel Dos Reis
11:03 Re: armv4l bootstrap problem in libstdc++-v3 Mark Mitchell
10:59 Re: armv4l bootstrap problem in libstdc++-v3 Richard Earnshaw
10:57 Re: armv4l bootstrap problem in libstdc++-v3 Rod Stewart
10:54 Re: armv4l bootstrap problem in libstdc++-v3 Mark Mitchell
10:51 Re: armv4l bootstrap problem in libstdc++-v3 Richard Earnshaw
10:46 Re: partial ordering of function templates Martin Sebor
10:38 Re: armv4l bootstrap problem in libstdc++-v3 Nick Clifton
10:26 conditional exec verify_live problem after scheduling Richard Earnshaw
10:06 libstdc++/1608: Problem with TREE_PARMLIST stewart
09:36 c++/1607: Format attributes on methods undocumented Joseph Myers
08:36 Re: gcj: Is this a bug? Alexandre Petit-Bianco
08:29 gcc-20010108 IRIX 5.3 installation Werner Mausshardt
08:21 Re: gcj: Is this a bug? Graham Stott
07:57 Re: gcj: Is this a bug? Alexandre Petit-Bianco
06:08 Re: armv4l bootstrap problem in libstdc++-v3 Richard Earnshaw
05:36 c++/1606: Internal compiler error when accessing a stl-map through a pointe to a class containing it linkclau
05:26 libstdc++/1605: exception::what() declares no exception list wolfgang.bangerth
04:16 c++/1604: error returning classes by value from an expression block richard
03:38 cvs-version build failure on IRIX jarausch
02:14 gcc-2.97 20010109: gcc assumes default argument in constructor where it's not specified Andris Pavenis
00:56 optimization/1603: Optimization of any kind produces bad code. jcmcknny
00:46 Re: libstdc++/1576: crash before entering main Benjamin Kosnik

January 09, 2001
23:16 c++/1602: include/g++-3/std/complext.h:314 ot14
20:26 c/1601: A static inline function as a parameter of another static inline function is not inlined. jodaman
19:06 c++/1600: The placement of __attribute__ confuses g++ fgouget
17:36 libstdc++/1599: valarry<T>(size_t n) constructor does not conform to standard charlton
15:24 Re: g77 optimizer bug ??? Toon Moene
15:16 libstdc++/1598: istream::ignore() fails to discard a character m
15:14 Re: bug in g77 -O2 optimization found -- resending with attachment Toon Moene
14:10 Re: java install bug Alexandre Petit-Bianco
14:03 g77 optimizer bug ??? Ivan Powis
13:16 c/1597: gcc-2.95.2 fails on Sparc/Solaris 7, using sunfreeware package leam
12:56 libgcj/1596: setScale() missing from java.math.BigDecimal jeff.sturm
12:27 Re: bug in g77 -O2 optimization found -- resending with attachment Jonathan DeSena
11:48 Internal Compiler Error - typeid() of unknown type Philippe Bouchard
10:43 building on solaris and linker problems Mike Stump
10:31 Re: no output from -MF Neil Booth
09:46 Re: no output from -MF Alexandre Oliva
09:32 Re: bug in g77 -O2 optimization found -- resending with attachment Bernd Schmidt
09:17 no output from -MF Harri Porten
09:16 RE: bit shift bug with GCC 2.95.2 19991024 under Solaris 7 Andrew Trotman
08:16 c++/1595: g++ reports internal error instead of code error danbr
07:46 c++/1594: Invalid .stabs/.stabn directive manz
07:41 partial ordering of function templates Nathan Sidwell
06:36 c++/1593: Internal compiler error using -gdwarf or -gdwarf-2 option Bruno.Zoppis
04:43 20010108 ICE at resource.c:229 on hppa2.0-hp-hpux10.20 RDBrown
04:28 20010108 ICE at resource.c:229 compiling on hppa2.0-hp-hpux10.20 RDBrown
02:56 c++/1592: unable to complie code which used simple virtual functions. syam
01:46 c/1590: -Wp,-MDfoo.o no longer works -- as of 2001-01-07 change jim
00:38 Re: bit shift bug with GCC 2.95.2 19991024 under Solaris 7 Richard Henderson
00:28 java install bug Martin Kahlert
00:26 Re: g77: read/write file access Eli Zaretskii

January 08, 2001
23:16 c++/1588: 2.95.2 (and later) Internal compiler error on template instantiation Hugues.Talbot
19:04 Re: gcc-20001218 IRIX 5.3 installation Alexandre Oliva
19:00 Re: libgcc2.h:99: no data type for mode `TI' Alexandre Oliva
18:48 Re: libgcc2.h:99: no data type for mode `TI' Jeffrey A Law
18:42 Re: gcc-20001218 IRIX 5.3 installation Gabriel Dos Reis
17:30 Re: bug in g77 -O2 optimization found Toon Moene
17:30 Re: bug in g77 -O2 optimization found -- resending with attachment Toon Moene
17:10 Re: xgcc passing incorrect options halts bootstrap Mark E.
17:06 c++/1587: gcc segfaulting on undeclared member functions of a class syam
16:51 Re: g77: read/write file access Toon Moene
16:31 Re: What's up with the line numbers? Phil Edwards
16:11 Re: What's up with the line numbers? Phil Edwards
16:02 Re: What's up with the line numbers? Neil Booth
15:31 xgcc passing incorrect options halts bootstrap Mark E.
15:25 Re: libstdc++/1574: cin.imbue() generates a segmentation fault (named locales) Benjamin Kosnik
15:18 bug in g77 -O2 optimization found Jonathan DeSena
15:15 Re: What's up with the line numbers? Benjamin Kosnik
15:11 Re: c++/1583: with -ggdb breaks with static & template code Benjamin Kosnik
14:50 More missing documentation Richard Earnshaw
14:49 Re: gcc-20010101 IRIX 6.5 installation Brian R. Gaeke
14:48 bug in g77 -O2 optimization found -- resending with attachment Jonathan DeSena
14:43 bit shift bug with GCC 2.95.2 19991024 under Solaris 7 John S. J. Anderson
14:42 Abort when shared libary (g++) function should catch thrown exception Dave Knight
14:40 Re: gcc-20001218 IRIX 5.3 installation Benjamin Kosnik
13:08 Re: ss2001/01/01 bootstrap failure on Sun Solaris 5.7 (Sparc) -- wrong REGISTER_MOVE_COST taken Alexandre Oliva
13:07 Re: gcc-20010101 IRIX 6.5 installation Alexandre Oliva
13:05 Re: gcc-20001218 IRIX 5.3 installation Alexandre Oliva
11:07 Re: armv4l bootstrap problem in libstdc++-v3 Benjamin Kosnik
11:02 Re: armv4l bootstrap problem in libstdc++-v3 Rod Stewart
10:39 Re: armv4l bootstrap problem in libstdc++-v3 Benjamin Kosnik
10:09 are you STILL renting Adult videos from the store? LolitaXXX
10:02 C++ problem with virtual inheritance accessibility Kenny Simpson
09:59 Re: FSTREAM and VECTOR Benjamin Kosnik
09:57 Re: Illegal optimization in presence of setjmp Richard Earnshaw
09:41 Re: Illegal optimization in presence of setjmp Luc Bouge
08:56 java/1586: linux build problem for libjava - cpplib (?) Patrik Hagglund
08:16 c++/1585: An ICE caused by an illegal template definition warp
07:58 g77: read/write file access Thomas Henlich
07:19 ss2001/01/01 bootstrap failure on Sun Solaris 5.7 (Sparc) -- wrongREGISTER_MOVE_COST taken Wolfgang Bangerth
05:32 Re: Illegal optimization in presence of setjmp Richard Earnshaw
04:29 Illegal optimization in presence of setjmp Luc Bouge
04:06 c++/1584: Qt library crashes on sgi IRIX siggelkow
02:41 gcc-20010101 IRIX 6.5 installation Werner Mausshardt

January 07, 2001
23:36 c++/1583: with -ggdb breaks with static & template code ymedini
21:45 gcc-20001218 IRIX 5.3 installation Werner Mausshardt
21:08 Re: C++:default template arguments for template specialization(was:Fix for bug 68) Kriang Lerdsuwanakij
21:06 c++/1582: Internal error #122 forsythe
17:05 Re: What's up with the line numbers? Phil Edwards
12:36 web/1581: configure web page out of date Brian R. Gaeke
11:00 Re: What's up with the line numbers? Neil Booth
10:38 ln: /opt/gcc-2.97.test/lib/libgcc_s.so: Andreas Jaeger
08:33 Re: BOOTSTRAP FAILURE: segementation fault in genattrtab under hpux John David Anglin
06:56 c/1580: ICE with -O3 ask
04:06 c++/1579: 2.95.2 fails when compiling mySQL package with 'internal compiler error' mike
00:36 c/1578: mipsel-linux bootstrap fails in libgcc w/ current cvs Brian R. Gaeke

January 06, 2001
23:23 What's up with the line numbers? Phil Edwards
22:16 c/1577: Bootstrap fails in libgcc2 on Solaris lucier
21:50 Re: bootstrap comparison failure on alpha Mark Mitchell
21:43 Re: bootstrap comparison failure on alpha Brad Lucier
21:32 Re: bootstrap comparison failure on alpha Mark Mitchell
17:26 libstdc++/1576: crash before entering main kainz
16:58 gcc-2.96-69 still buggy in redhat 7 Greg Badros
15:16 c/1575: 12-line C program coredumps gcc version 2.96 esr
13:56 libstdc++/1574: cin.imbue() generates a segmentation fault (named locales) schmid
07:28 c++:ICE on typename ::template scoperef combo Larry Evans
01:58 Re: BOOTSTRAP FAILURE: segementation fault in genattrtab under hpux Richard Henderson
01:26 c++/1573: g++ internal compiler error with large data structures berdahl

January 05, 2001
23:48 Re: bootstrap comparison failure on alpha Brad Lucier
19:26 libgcj/1572: make boot fails building libgcj due to missing include dir Per Bothner
19:10 Re: BOOTSTRAP FAILURE: segementation fault in genattrtab under hpux John David Anglin
17:46 c++/1571: g++ is confused with by code that typedef's wchar_t. cgd
17:16 c/1570: gcc 2.8.1 has autoincrement bug rglan
17:12 Re: BOOTSTRAP FAILURE: segementation fault in genattrtab under hpux 10.20 Jeffrey A Law
16:49 Re: Problem Installing Gnu on Compaq AlphaStation Alexandre Oliva
15:53 [c++] i686 toolchain additional shared fails Benjamin Kosnik
15:43 core dump in getenv() Tom McHugh
15:36 c/1569: Internal compiler error in print_rtl_and_abort, at flow.c:6502 igor
13:58 Re: bootstrap comparison failure on alpha Mark Mitchell
13:45 Re: bootstrap comparison failure on alpha Brad Lucier
13:44 Re: g++ 2.97 20010103 strange bug w/blitz++ Artem Khodush
13:26 c/1567: gcc crashes when compiling a simple file that generates many errors. dave
13:26 bug-gcc. "߼". ųλ帳ϴ. showgirl
13:19 Problem Installing Gnu on Compaq AlphaStation Chuck Fisher
12:43 Re: bootstrap comparison failure on alpha Mark Mitchell
12:06 c/1566: bootstrap - fails libgcc.a on hpux-10.20 nneul
12:04 Re: bug report: std::cout and posix threads Dima Volodin
12:01 Re: bootstrap comparison failure on alpha Brad Lucier
11:59 compiling on AIX 4.3.3.0 Grigor, Amadeus
11:59 Re: Builds failing on Sparcs Richard Earnshaw
11:52 Re: bootstrap comparison failure on alpha Brad Lucier
11:16 preprocessor/1565: nested expansion of macros broken in current cvs kreckel
11:06 java/1564: build problems patha
11:05 Re: Another build problem under hpux 10.20 with current cvs source Jeffrey A Law
10:58 Re: bug report: std::cout and posix threads Benjamin Kosnik
10:54 Re: Another build problem under hpux 10.20 with current cvs source Richard Earnshaw
10:50 Re: Builds failing on Sparcs Mark Mitchell
10:40 Re: Another build problem under hpux 10.20 with current cvs source John David Anglin
10:06 other/1563: --help broken Joseph Myers
09:58 Re: gnats locks Jeffrey A Law
09:26 c++/1562: g++ 2.96 x86 Code Generation bug for 64-bit integers colohan+gcc
08:36 Re: Bootstrap comparison failure on gcc-2.95.3.test1 'David Scott Urban
08:32 Re: Bad sparc64 code when returning structure with leading float Olivier Hainque
08:27 Re: gnats locks Nathan Sidwell
08:19 gnats locks Nathan Sidwell
08:16 c++/1561: pointer not initialised to 0 david
07:56 Bad sparc64 code when returning structure with leading float Olivier Hainque
07:56 c++/1560: segmentation fault of a program throwing an exception when compiled with option -fomit-frame-pointer gilles.chanteperdrix
07:50 Re: Bootstrap comparison failure on gcc-2.95.3.test1 Bernd Schmidt
07:28 Bootstrap comparison failure on gcc-2.95.3.test1 'David Scott Urban
06:32 Builds failing on Sparcs Richard Earnshaw
05:56 c++/1559: gcc 2.95.2: Internal compiler error in `gen_lowpart', at emit-rtl.c:1064 paul
05:21 missing help from gcc-current with internal cpp Boris Zentner
04:10 Re: Compile error: 2.95.2 on Tru64 V5.1 Alexandre Oliva
03:59 Compile error: 2.95.2 on Tru64 V5.1 Dom, Kris
03:56 other/1558: Different definitions for REGISTER_MOVE_COST in headers and sources patrick.hildenbrand
03:26 middle-end/1557: Regrename macro not documented Richard Earnshaw
02:26 c++/1556: parse error when accessing global typenames in template argument robt
02:18 gcj: Is this a bug? Martin Kahlert
01:16 c/1555: Virtual memory Overflow shivsundar.nadar

January 04, 2001
22:14 bug report: std::cout and posix threads BlakWolf
21:12 Re: Another build problem under hpux 10.20 with current cvs source Jeffrey A Law
20:50 bootstrap comparison failure on alpha Brad Lucier
20:26 c/1554: seg fault while in stage1/xgcc ... c-decl.c pete
20:12 Re: Another build problem under hpux 10.20 with current cvs source John David Anglin
19:45 Re: Another build problem under hpux 10.20 with current cvs source Alexandre Oliva
19:02 Another build problem under hpux 10.20 with current cvs source John David Anglin
16:43 Re: Latest gencodes.c is not ISO C compatible Russ Allbery
14:45 Re: gcc bug/quirk with left shifts on i386 family. Toshi Morita
14:16 c++/1553: Internal Compiler Error #373 mark_jordan
14:12 Re: pa reload problem John David Anglin
13:46 fastjar build problems John David Anglin
13:26 c/1552: CR-LF not handled correctly when using #pragma pack bruce
13:18 Re: pa reload problem Alexandre Oliva
13:06 Re: pa reload problem John David Anglin
13:06 c++/1551: explicit specialization of constructor causes dementia fsm
11:52 Re: gcc bug/quirk with left shifts on i386 family. Alexandre Oliva
11:48 Re: pa reload problem Alexandre Oliva
11:48 Re: Latest gencodes.c is not ISO C compatible Michael Meissner
11:46 abort in verify_local_live_at_start on ARM Philip Blundell
11:42 Re: Latest gencodes.c is not ISO C compatible Alexandre Oliva
11:35 Re: pa reload problem John David Anglin
11:14 gcc bug/quirk with left shifts on i386 family. Peter Wemm
11:11 Re: pa reload problem John David Anglin
11:06 bootstrap fails on sparc-sun-solaris2.7 Igor Schein
10:56 Re: lookup error message Martin Sebor
10:31 Re: Latest gencodes.c is not ISO C compatible Michael Meissner
10:17 Re: Latest gencodes.c is not ISO C compatible Kaveh R. Ghazi
10:03 Re: Latest gencodes.c is not ISO C compatible Alexandre Oliva
09:55 Re: pa reload problem Jeffrey A Law
09:05 Latest gencodes.c is not ISO C compatible Kaveh R. Ghazi
07:24 Re: register renaming causes many ARM testsuite failures Richard Earnshaw
06:24 Re: register renaming causes many ARM testsuite failures Bernd Schmidt
06:13 Re: gcc 2.96, red hat 7.0, do not compile Ben Collins
06:08 g++ 2.97 20010103 strange bug w/blitz++ nbecker
05:20 gcc 2.96, red hat 7.0, do not compile Giuseppe Leto
02:16 c++/1548: Internal error caused by vitual inheritance and templates s000401
02:06 c++/1547: problems with templates and inheritance from virtual class dm

January 03, 2001
22:16 c++/1546: 2.95 compiler barf using vector class jrgraham
22:08 Re: pa reload problem John David Anglin
20:57 Re: pa reload problem Jeffrey A Law
19:33 type mismatch in conditional expression...used to compile fine Robby Dermody (Nova)
19:20 Re: libstdc++/1545: Out of a complex number generates a segmentation fault Benjamin Kosnik
16:27 Legal code rejection: member pointer to non-static member array element Tuukka Tikkanen
15:59 C++ : default template arguments for template specialization (was: Fix for bug 68) Artem Khodush
15:56 libstdc++/1545: Out of a complex number generates a segmentation fault schmid
15:47 Re: scores of unrecognized names in gnu/linux insn-recog.c Alexandre Oliva
15:07 Re: register renaming causes many ARM testsuite failures Michael Meissner
14:56 optimization/1544: Optimzation -O3 breaks exception handling schmid
14:52 scores of unrecognized names in gnu/linux insn-recog.c Phil Edwards
14:33 Re: register renaming causes many ARM testsuite failures Richard Henderson
14:31 Re: Build failure with gcc-ss-20010101 David Ronis
14:30 Re: register renaming causes many ARM testsuite failures Michael Meissner
14:05 Re: register renaming causes many ARM testsuite failures Richard Henderson
12:30 The placement of __attribute__ confuses g++ Francois Gouget
12:12 Re: problem in mangling 'extern "java"' function in libjava Tom Tromey
12:12 [c++] explicit instantiations + namespaces Benjamin Kosnik
11:58 Re: register renaming causes many ARM testsuite failures Philip Blundell
11:56 preprocessor/1542: g++ -I../myfltkx -E filtx.cpp >z.cpp yohng
11:55 Re: c++/pt.c mixing-up inner/outer template args Larry Evans
11:40 RE: problem in mangling 'extern "java"' function in libjava Jeff Sparkes
11:03 Re: armv4l bootstrap problem in libstdc++-v3 Rod Stewart
10:58 Re: Build failure with gcc-ss-20010101 Alexandre Oliva
10:50 Re: problem in mangling 'extern "java"' function in libjava Tom Tromey
10:19 Are any G++ builtin functions working? Kaveh R. Ghazi
09:28 Re: Build failure with gcc-ss-20010101 David Ronis
09:18 Re: Build failure with gcc-ss-20010101 David Ronis
08:50 Re: 'cvs co gcc' reports error. Mark E.
08:06 c/1541: ICE on legal code: "insn does not satisfy its constraints" rohloff
07:57 Problem with 12-30 change Bernd Schmidt
07:49 problem in mangling 'extern "java"' function in libjava Jeff Sparkes
07:24 lookup error message Dimitri PAPADOPOULOS-ORFANOS
05:56 c/1540: Strange effects whe defining 2-dimensional arrays lampe
05:49 Bug report Sannier, David G
03:13 can't catch exceptions on shared libs krahmer
03:12 Re: register renaming causes many ARM testsuite failures Bernd Schmidt

January 02, 2001
18:16 Re: Build failure with gcc-ss-20010101 Alexandre Oliva
18:15 Re: 'cvs co gcc' reports error. Alexandre Oliva
16:26 c/1538: cannot compile with #include <sys/varargs.h> garrett
16:25 Re: Build failure with gcc-ss-20010101 David Ronis
16:19 Re: gcc-20010101 fails to build on i386/i686, REGISTER_MOVE_COST no. args Alexandre Oliva
16:19 Re: Build failure with gcc-ss-20010101 Alexandre Oliva
15:24 Re: register renaming causes many ARM testsuite failures Jeffrey A Law
15:16 other/1537: Obvious typo in 2.95.3-test1 for mips-wrs-vxworks cmetz
14:40 'cvs co gcc' reports error. Mark E.
14:26 c/1536: -L and -I with bad paths do not raise a warning eyal
12:56 gcc fails to rename inline asm registers Ghadi Shayban
10:49 Re: register renaming causes many ARM testsuite failures Philip Blundell
10:38 Re: c/1534: ICE probably due to uninitialized memory Bernd Schmidt
09:24 Re: register renaming causes many ARM testsuite failures Bernd Schmidt
09:08 Build failure with gcc-ss-20010101 David Ronis
08:57 Re: libstdc++/1533: iostream long long operators not defined Benjamin Kosnik
08:55 Re: PATCH: Adjust label usage count for new insns [was Re: pa reload problem] Jeffrey A Law
08:36 optimization/1535: Function parameter becomes NULL during throw (optimized code only) eytan.segal
00:43 2.95.3 x86 missed optimization bug-gcc
00:06 c/1534: ICE probably due to uninitialized memory drepper

January 01, 2001
20:50 gcc-20010101 fails to build on i386/i686, REGISTER_MOVE_COST no. args JDonner
16:44 Re: pa reload problem Jeffrey A Law
16:37 Re: pa reload problem John David Anglin
15:46 libstdc++/1533: iostream long long operators not defined cljanss
12:08 Re: bug report Tim Prince
12:04 Re: 2.95.3 20001229 fails enable-checking bootstrap on mips-sgi-irix6.2 Franz Sirl
12:02 Re: Getting GCC's testsuite, i.e., dejagnu, under cygwin-1.1.7 Tim Prince
11:37 bug report Alan Rojer
10:04 Re: 2.95.3 20001229 fails enable-checking bootstrap on mips-sgi-irix6.2 Franz Sirl
09:06 c++/1532: -O3 generates (obviously) redundant tests and jumps duchier


Indexes: [Date Index] [Subject Index] [Author Index] [Thread Index]
Site Nav: [Browse other archives for this mailing list]
[Browse other mailing lists at this site]
Search: Limit to:

Mail converted by MHonArc 2.4.6