gcc-bugs archive
date index for December, 2000

This is the mail archive of the gcc-bugs@gcc.gnu.org mailing list for the GCC project.

Indexes: [Date Index] [Subject Index] [Author Index] [Thread Index]
Site Nav: [Browse other archives for this mailing list]
[Browse other mailing lists at this site]
Search: Limit to:

December 31, 2000
12:16 c++/1529: internal compiler error after reporting parse error ajb44.geo
08:24 Re: other/1528: perl path in contrib/texi2pod.pl Joseph S. Myers

December 30, 2000
22:16 other/1528: perl path in contrib/texi2pod.pl igor
21:44 -m64 fixed on Solaris 2.7 !! Igor Schein
11:24 Re: 2.95.3 20001229 fails enable-checking bootstrap on mips-sgi-irix6.2 Kaveh R. Ghazi
11:06 Re: pa reload problem John David Anglin
08:01 register renaming causes many ARM testsuite failures Philip Blundell
07:52 Re: 2.95.3 20001229 fails enable-checking bootstrap on mips-sgi-irix6.2 Bernd Schmidt
07:26 Re: armv4l bootstrap problem in libstdc++-v3 Jason Merrill
06:02 2.95.3 20001229 fails enable-checking bootstrap on mips-sgi-irix6.2 Kaveh R. Ghazi

December 29, 2000
14:15 Re: c++/v2.97 ice when inner template arg has default Larry Evans
13:44 [Patch] gcc/testsuite/ Billinghurst, David (CRTS)
12:46 c/1527: initialization in zero-length array inside a nested structure ac9410
12:06 c++/1526: Failure in function cplus_demangle david
11:26 c/1525: Internal compiler error in array_size_for_constructor ac9410
09:40 Re: gcc 2.95.3 20001229 builtins.c does not exist Bernd Schmidt
09:38 gcc 2.95.3 20001229 builtins.c does not exist David Edelsohn
04:52 '1225 snap: Compare failure on rs6000-ibm-aix4.2.0.0 RDBrown
01:00 gcc-2.97 20001228: error if including iostream after cstdio Andris Pavenis

December 28, 2000
21:52 A couple of bugs. Magnus Fromreide
17:30 sparcv9 target was broken on Sep 21 Igor Schein
16:57 Binutils v gcc problems Dave Gilbert
06:26 c/1524: problem with libgcc.so on sol 27, but not sol26 nneul
04:16 c/1523: GCC 2.97 miscompiles with -fomit-frame-pointer Andreas Franck
04:15 GCC 2.97 miscompiles with -fomit-frame-pointer Andreas Franck
02:58 bug Ben-Nes Michael
02:36 c++/1522: template inheritage korimort

December 27, 2000
22:59 RE: Need your help. Prasad, Sreenivasa
22:43 Re: Need your help. Alexandre Oliva
22:36 RE: Need your help. Prasad, Sreenivasa
22:26 Re: Need your help. Alexandre Oliva
21:56 RE: Need your help. Prasad, Sreenivasa
21:18 Re: pa reload problem John David Anglin
21:06 optimization/1521: Misleading documentation lucier
19:36 c++/1520: cout prints in the wrong order. magnus
12:26 c/1517: Erroneous warnings for nested functions with -Wmissing-declarations aj
12:17 Re: pa reload problem Jeffrey A Law
08:56 libgcj/1516: Method.invoke won't accept boolean parameters jeff.sturm
07:46 Re: Need your help. Alexandre Oliva
06:36 c/1515: segmentation fault while bootstrapping gcc-20001225 staelin
05:07 Re: build failure from 27/12/00 CVS Phil Edwards
03:56 build failure from 27/12/00 CVS Dave Gilbert
03:06 Need your help. Prasad, Sreenivasa
02:36 c++/1514: template operator<< call within constructor neil.pearce

December 26, 2000
14:16 c/1513: lots of 'would have deleted prologue epilogue insn' on hpux nneul
13:26 other/1512: Path confusion w/ -print-prog-name + autoconf nneul
11:38 test Igor Schein
01:08 Re: empty initialization of zero-length array Kaoru Fukui
00:53 empty initialization of zero-length array Paul Laufer

December 25, 2000
21:52 subscribe gcc-bugs linuxrat
21:46 c++/1511: Doesn't give "variable undeclared" error. vikram
21:26 c/1510: Internal compiler error in `build_insn_chain', at global.c:1756 foom
04:16 c++/1509: compiler internal error on function template parameter wanderer

December 24, 2000
11:26 c++/1508: crashes when seeing unrecognized variable name. gilsh
01:06 target/1507: Latest GCC dec 12th doesn't bootstrap on i686. sefer

December 23, 2000
22:49 Re: PR 749 Ben Elliston
22:00 c++/v2.97 ice when inner template arg has default Larry Evans
20:39 Re: PR 749 Joseph S. Myers
20:16 c++/1506: g++ internal error wanderer
20:14 PR 749 Ben Elliston
20:06 c++/1505: g++ internal error wanderer
20:03 problem with wchar_t on c++, not on C Don Bowman
18:42 Internal compiler error Matthew Toseland
15:52 Re: [g++] cannot debug static const data members Jason Merrill
14:11 gcc --help -v prints cpp help instead of cpp+cc1 help Herman ten Brugge

December 22, 2000
20:25 [BUG/PATCH 2.95.3] [V3 also] rs6000.c tests TREE_ASM_WRITTEN too early. Dave Korn
17:46 c++/1503: Internal Compiler Error compiling omniORB3.0.2 on Alpha-Linux vic
15:38 bug: ios_base::sync_with_stdio(false) creates empty files Phil Edwards
14:33 Not exactly a bug Ral Nez de Arenas Coronado
14:11 G++ Segmentation fault Vladimir A. Merzliakov
13:16 Re: [g++] cannot debug static const data members Benjamin Kosnik
12:46 other/1502: Nonexistent -W options not diagnosed Joseph Myers
11:02 Re: [g++] cannot debug static const data members Daniel Berlin
09:22 Re: pa reload problem John David Anglin
07:56 c/1501: Complex conjugation ICE Joseph Myers
07:01 #include <fstream> causes "call of overloaded `vector()' is ambiguous" Gerald Pfeifer
06:56 c/1499: bad assembly code with use of inline functions vincent_radivoniuk
06:56 c/1500: bad assembly code with use of inline functions (added forgotten ZIP file) vincent_radivoniuk
06:50 Re: PATCH: Missing return_label using g++ CVS under vax ultrix. Jason Merrill
06:46 c++/1498: Internal compiler error in pop_binding, at cp/decl.c:1179 Gerald Pfeifer
06:02 LD bug Slegers, Walter
04:56 c++/1497: Exceptions thrown in a shared library cannot be caught under Linux steger
04:11 Re: trouble installing gnu gcc 2.95 Alexandre Oliva
03:56 c/1496: gcc 2.95.2 results in runtime segmentation fault murali
03:28 Re: libstdc++/1066: bad use of strchr() in std::string Brad Garcia
03:07 a bug :-> KITLEI Robert Laszlo
02:57 Re: [g++] cannot debug static const data members Benjamin Kosnik
02:42 trouble installing gnu gcc 2.95 benoit LOOF
02:34 [g++] cannot debug static const data members Benjamin Kosnik

December 21, 2000
16:59 Re: libstdc++/1066: bad use of strchr() in std::string Benjamin Kosnik
16:43 Re: libstdc++/1070: incorrect specialization of std::complex<float> Benjamin Kosnik
16:38 Re: c++/1076: g++ 2.96 formatting doubles outputs nulls Benjamin Kosnik
16:34 Re: why does gcc-20001218 insist on /usr/ccs/bin/as on solaris 2.7? Alexandre Oliva
14:36 c/1495: Internal compiler error in distribute_notes, at combine.c:12572 gilles.rajaobelina
14:33 why does gcc-20001218 insist on /usr/ccs/bin/as on solaris 2.7? Marty Leisner
13:57 Re: g++ not finding the V3 target include dir Alexandre Oliva
12:46 other/1494: Residual EGCS references in comments Joseph Myers
12:46 other/1493: Residual EGCS references in user documentation Joseph Myers
11:23 Re: armv4l bootstrap problem in libstdc++-v3 Mark Mitchell
10:22 Re: armv4l bootstrap problem in libstdc++-v3 Jason Merrill
09:56 Re: armv4l bootstrap problem in libstdc++-v3 Nick Clifton
09:46 other/1492: gccbug security Joseph Myers
08:46 c++/1491: Stupid syntax error causes a compiler internal error cfernandez
08:42 Re: armv4l bootstrap problem in libstdc++-v3 Jason Merrill
07:56 c/1490: gcc's invaild option : -mno-486 fsl
07:56 c/1489: gcc's invaild option -mno-486 fsl
06:28 Re: c++/1488: No C++ warning option to guard against bogus returntypes for C linkage Joseph S. Myers
06:06 c++/1488: No C++ warning option to guard against bogus return types for C linkage jon.connell
05:16 c/1487: CVS gcc can't compile Haruhiko Okumura

December 20, 2000
18:56 c++/1486: dosen't take good code ICE 122, none
18:16 c/1485: Internal compiler error in print_rtl_and_abort tmuller
15:50 ice/sig 11 with structs gcc 2.95.2 Peter Bauer
15:26 c++/1484: ICE referencing a template function with -fno-honor-std sebor
14:56 c++/1483: c++ reports "internal compiler error" on "new" oprerator when -syntax-only is on favorov
14:16 c++/1482: va_start generates call to memcpy andyj
13:44 Re: g++ not finding the V3 target include dir Phil Edwards
13:41 Re: armv4l bootstrap problem in libstdc++-v3 Nick Clifton
12:19 Re: g++ not finding the V3 target include dir Benjamin Kosnik
11:05 Re: C++ crash with -fno-exceptions Gabriel Dos Reis
10:58 Re: C++ crash with -fno-exceptions Phil Edwards
10:14 Re: C++ crash with -fno-exceptions Gabriel Dos Reis
10:06 Re: g++ not finding the V3 target include dir Benjamin Kosnik
09:39 g++ not finding the V3 target include dir Phil Edwards
09:06 C++ crash with -fno-exceptions Gerald Pfeifer
08:51 Re: gcc-2.95.3 && Glibc 2.2: wprintf problem with g++ Bernd Schmidt
07:56 c++/1103: G++ creates parse error when a member template is called within a template function a.d.parkins
07:54 Re: gcc-2.95.3 && Glibc 2.2: wprintf problem with g++ Andreas Jaeger
07:50 Re: gcc-2.95.3 && Glibc 2.2: wprintf problem with g++ Bernd Schmidt
07:48 Re: gcc-2.95.3 && Glibc 2.2: wprintf problem with g++ Andreas Jaeger
07:38 Help - cross-compiler for powerpc-linux Gentry, Jeff
07:29 Re: c++/pt.c mixing-up inner/outer template args Larry Evans
05:07 Re: gcc-2.95.3 && Glibc 2.2: wprintf problem with g++ Bernd Schmidt
05:02 Re: 2.95: next patch kit Bernd Schmidt
02:36 c++/1102: unable to assemble g++ output on Solaris 2.6 Luc.Maisonobe
01:53 bugreport (requested from compiler output) CYRIL

December 19, 2000
20:02 2.95: next patch kit bregor
18:36 c++/1101: c++ errors in building libjava yoda
17:35 Re: question about msgrcv() Alexandre Oliva
17:12 Re: C++ Evaluation Order Gabriel Dos Reis
17:06 c++/1100: g++ 2.97 20001113 error declaring bad_alloc sebor
16:16 c++/1099: g++ -O3 optimization bug found, test case included. mdejong
16:06 c/1098: inconsisten fp behavior i386 vs. most others green
16:02 libintl? John David Anglin
15:05 Re: C++ Evaluation Order Dima Volodin
14:36 c/1097: current gcc misbehaves with fputc & fputs prototypes cgd
14:00 cvs [server aborted]: head attribute does not match John David Anglin
13:31 c++/pt.c mixing-up inner/outer template args Larry Evans
12:36 optimization/1096: bug when using -O2 option lennychen
12:27 C++ Evaluation Order Marc A. Lepage
12:16 c++/1095: bootstrap comparison failure lucier
11:36 c++/1094: Build error on RedHat 7.0 Linux dave
10:39 Re: armv4l bootstrap problem in libstdc++-v3 Rod Stewart
10:33 Re: armv4l bootstrap problem in libstdc++-v3 Benjamin Kosnik
10:30 Re: Can't compile gcc 2000-12-14 cvs on win2k/pro with cygwin. Richard Henderson
09:55 Build failure in gcc-ss-0001218 David Ronis
06:03 current CVS <cstdlib> + <stdlib.h> = disaster nbecker
03:36 c++/1092: gcc failed to compile multiline macro define joseft
02:48 cvs-version build failure (libiberty) jarausch
00:16 c++/1091: internal compiler error (but on erroneous program) rovf

December 18, 2000
16:16 c++/1090: g++ 20001218 generates wrong optimized code on alpha ovi
15:37 question about msgrcv() Randall G Chan
15:31 question about msgrcv() Randall G Chan
14:18 Re: Revised patch: Re: PATCH 1: Re: BOOTSTRAP FAILURE: segementation fault in genattrtab John David Anglin
13:53 GNU C++ bug report Peter A. Buhr
13:26 libstdc++/1089: ios_base::_M_grow_words(int ix) SEGV's w/fix cljanss
11:06 c++/1088: Internal compiler error: (default argument in template class) desmond
09:24 libstdc++, sparc-sun-solaris8, and -ansi Gerald Pfeifer
08:18 Re: Documentation bug: list of builtin functions Joseph S. Myers
07:35 Documentation bug: list of builtin functions Niels Mller
07:16 c++/1086: gcc v2.95.2.1 rejects legal code jack_reeves
05:06 c++/1085: GCC rejects correct code jack_reeves
04:56 c++/1084: GCC 2.97 rejects correct code jack_reeves
02:56 c/1083: Internal compiler error (fixup_memory_subreg) gcc 2.95.2/Solaris7 matze

December 17, 2000
23:26 c++/1082: Open office compile failing - no help from them... waratah
15:56 other/1081: Copyrights on manuals Joseph Myers
11:53 Re: Can't compile gcc 2000-12-14 cvs on win2k/pro with cygwin. R. Kelley Cook
06:45 Illegal instruction nbecker

December 16, 2000
17:36 c++/1080: Programs using QT won't compile. joeeagar
15:36 other/1078: Problems with attributes documentation Joseph Myers
13:26 libobjc/1077: libobjc's Makefile tries to make thr-.o from thr-.c haasse
12:46 c++/1076: g++ 2.96 formatting doubles outputs nulls sullivan
12:38 PATCH: Adjust label usage count for new insns [was Re: pa reload problem] John David Anglin
12:06 Re: ./depcomp' not found Alexandre Oliva
11:57 Re: ./depcomp' not found John David Anglin
11:43 Re: ./depcomp' not found Alexandre Oliva
10:56 Re: ./depcomp' not found John David Anglin
07:29 Re: Build failure due to java libraries if java not built Manfred Hollstein
07:12 Re: Build failure due to java libraries if java not built Manfred Hollstein
06:45 Re: Solaris2.7 hundreds of new G++ failures, (missing copysignf) Kaveh R. Ghazi
04:49 Re: ./depcomp' not found Alexandre Oliva
04:48 Re: debugging info broken (at least on irix?) Alexandre Oliva

December 15, 2000
20:36 c++/1075: Internal Compiler Error rforte
17:57 Re: Bug in gcj-20001211 with error message and try without catch Alexandre Petit-Bianco
14:06 java/1074: jv-scan fails on ArrayClass.java tromey
14:06 c/1073: Internal compiler error in `create_reg_dead_note' wilco
13:56 libstdc++/1072: Exception-unsafe code in locale peturr
12:26 c++/1071: Internal compiler error in pop_binding, at cp/decl.c:1179 ritzert
10:55 Re: armv4l bootstrap problem in libstdc++-v3 Richard Earnshaw
10:55 Re: ./depcomp' not found John David Anglin
08:26 fastjar/jargrep.c fails to compile under cygwin R. Kelley Cook
08:19 Can't compile gcc 2000-12-14 cvs on win2k/pro with cygwin. Christian Jnsson
06:52 debugging info broken (at least on irix?) jarausch
05:28 Bug in gcj-20001211 with error message and try without catch Martin Kahlert
05:06 libstdc++/1070: incorrect specialization of std::complex<float> fsm
00:43 Re: irix partially dropped? Alexandre Oliva
00:25 irix partially dropped? jarausch

December 14, 2000
23:24 Re: -Wno-long-long does not suppress all long long msgs Richard Henderson
22:10 Re: ./depcomp' not found Alexandre Oliva
21:15 ./depcomp' not found John David Anglin
16:32 Re: -Wno-long-long does not suppress all long long msgs Joseph S. Myers
16:26 c/1069: Internal compiler error in gcc-20001211 Thorsten Kranzkowski
15:40 Re: Solaris2.7 hundreds of new G++ failures, (missing copysignf) Benjamin Kosnik
14:19 Re: pathological C++ case.. Jeff Garzik
13:46 objc/1068: Protocols broken after 2.95.2 mgd
12:42 Re: Solaris2.7 hundreds of new G++ failures, (missing copysignf) Benjamin Kosnik
12:36 c++/1067: g++ ICE on bogus code bagnara
12:17 Re: fastjar build failure Alexandre Petit-Bianco
12:07 Re: Java: Blank static final variable `TRUE' may not have be initialized. Alexandre Petit-Bianco
11:54 -Wno-long-long does not suppress all long long msgs Tim Josling
11:39 Re: Internal COmpiler Error when compiling QT2.2.3 on TruUnix64 Eric Christopher
11:26 libstdc++/1066: bad use of strchr() in std::string bgarcia
11:15 Re: [c++] parameter passing bug Jason Merrill
11:06 Re: Irix build fails in gcc/fixinc Bruce Korb
10:55 Internal COmpiler Error when compiling QT2.2.3 on TruUnix64 Eric Depagne
10:39 Re: fastjar build failure Alexandre Oliva
10:20 Re: Irix build fails in gcc/fixinc Kaveh R. Ghazi
09:57 Re: fastjar build failure Nathan Sidwell
09:44 Re: PATCH: Missing return_label using g++ CVS under vax ultrix. Richard Henderson
09:06 Re: PATCH: Missing return_label using g++ CVS under vax ultrix. Jason Merrill
08:46 c++/1065: Internal compiler error 191 in gcc 2.95.2 C.vanReeuwijk
08:40 Re: pa reload problem John David Anglin
08:26 c++/1064: "friend" fails on partially specialized template functions ballabio
08:05 Re: fastjar build failure Alexandre Oliva
08:05 SegFault in jc1 of ss-20001211 Martin Kahlert
07:35 Solaris2.7 hundreds of new G++ failures, (missing copysignf) Kaveh R. Ghazi
06:46 c++/1062: bug report in the field Sonne
05:46 c/1061: bug in short arithmetic matsc
02:38 fastjar build failure Nathan Sidwell
00:20 Re: ICE with alpha linux native Richard Henderson

December 13, 2000
23:56 c/1060: gcc 2.95.3 ICE in build_insn_chain at global.c:1756 staelin
21:52 Irix build fails in gcc/fixinc Billinghurst, David (CRTS)
21:00 Re: pa reload problem Jeffrey A Law
19:45 problem in fold()? Brad Lucier
17:06 [c++] parameter passing bug Benjamin Kosnik
16:49 Re: pa reload problem John David Anglin
15:56 c++/1058: gcc version 2.95.2 produces "parse error before `>'" haule
15:40 Re: Java: Blank static final variable `TRUE' may not have be initialized. Phil Edwards
15:28 Re: Java: Blank static final variable `TRUE' may not have be initialized. Tom Tromey
15:09 Re: pathological C++ case.. Phil Edwards
14:54 pathological C++ case.. Jeff Garzik
14:06 libstdc++/1057: Buffer overflow in basic_streambuf<>::xsputn and sputc peturr
13:04 Java: Blank static final variable `TRUE' may not have be initialized. Toon Moene
12:37 Re: Problems building gcc-2.95.2 on SGI Indy Irix 5.3 Alexandre Oliva
11:30 Re: cpp crash with gcc-2.95.2 and cpplib Neil Booth
11:28 Re: cpp crash with gcc-2.95.2 and cpplib Niels M=f6ller
11:13 Re: cpp crash with gcc-2.95.2 and cpplib Neil Booth
10:17 Re: PATCH: Missing return_label using g++ CVS under vax ultrix. Richard Henderson
10:03 Re: irix build dies in fastjar Tom Tromey
09:16 c++/1056: spurious warning on implicit conversion followed by promotion and comparison martin.dorey
08:16 c++/1055: can not build the 20001211 snapshot (misc-inst.cc) mi+gcc
04:56 c++/1054: Compilation with `-fno-exceptions' cause `Internal error: anonymous
03:13 Re: PATCH: Missing return_label using g++ CVS under vax ultrix. Jason Merrill
02:32 Problems building gcc-2.95.2 on SGI Indy Irix 5.3 Johns, Steve
02:32 gcc-2.95.3 && Glibc 2.2: wprintf problem with g++ Andreas Jaeger
01:39 Re: cpp crash with gcc-2.95.2 and cpplib Niels M=f6ller
01:14 misaligned local variables (double) Nikolaus Meine

December 12, 2000
23:12 Cannot bootstrap gcc-2.95.3 CVS version on i686-pc-linux-gnu Andris Pavenis
20:55 Re: Build failure due to java libraries if java not built Alexandre Oliva
20:52 Build failure due to java libraries if java not built Tim Josling
17:05 irix build dies in fastjar Billinghurst, David (CRTS)
14:24 Solaris Intel stdarg problem David Thompson
13:26 c++/1053: g++ runs out of memory on Really Simple Input gustav
12:46 c++/1052: Internal compiler error in print_operand_address cet
12:20 Re: recent implicit functions patch (C++) Alexandre Oliva
12:12 Re: cpp crash with gcc-2.95.2 and cpplib Neil Booth
11:45 Re: cpp crash with gcc-2.95.2 and cpplib Niels M=f6ller
11:22 recent implicit functions patch (C++) Simpson, Kenny
10:58 Re: cpp crash with gcc-2.95.2 and cpplib Neil Booth
10:26 c/1051: gcc fails (seg fault) with example code in getopt man page harry.dolan
09:56 c++/1050: trouble with dynamic_cast wka
09:29 Re: error building m68k cross compiler Jeff Garzik
09:16 Re: error building m68k cross compiler Alexandre Oliva
08:38 Re: macros parsed wrong DJ Delorie
08:26 c++/1049: Compiler egcs-2.91.66 crashes on template class fcn. defn. robert.c.armstrong
08:15 error building m68k cross compiler Jeff Garzik
06:26 c/1048: Seems to mis-compile for loop init expression nik
05:16 c++/1047: make bootstrap fails near end: /bin/sh: gperf command not found ads294
04:42 Re: cpp crash with gcc-2.95.2 and cpplib Niels M=f6ller
03:06 Problems with g++ and __attribute__((regparm(3))) Rimantas Plaipa
02:56 c/1046: gcc less efficient than jdk for recursion! bouchard
00:56 c/1045: asm label for C label misplaced drepper

December 11, 2000
23:36 c++/1044: Building gcc(from cvs) crashes with internal error #20000409 mmatus
23:31 Re: macros parsed wrong Neil Booth
22:15 ARM elf cygwin installation problem - cpp.texi Elwyn Campbell
20:09 Re: make check error Alexandre Petit-Bianco
19:16 c/1043: line information unmatch(ELF dwarf format) uchi
17:05 Re: PPC and comparison reversal with -ffast-math Geoff Keating
16:46 c/1042: Internal compiler error in `create_reg_dead_note', at haifa-sched.c:4496 bruno.vetel
15:53 macros parsed wrong DJ Delorie
15:15 Re: gcc -E -traditional broken Neil Booth
14:54 Re: gcc -E -traditional broken Zack Weinberg
14:52 gcc-2.95 branch sh-elf bug Toshi Morita
14:40 Re: gcc -E -traditional broken Neil Booth
14:39 PPC and comparison reversal with -ffast-math Franz Sirl
14:28 Re: gcc -E -traditional broken Zack Weinberg
13:27 Re: pa reload problem Michael Meissner
13:06 c/1041: claims "-undef" is invalid otion eweber
12:08 Re: c++/1039: cout does not give correct output with pointer ++ Benjamin Kosnik
11:38 Re: gcc -E -traditional broken Neil Booth
11:35 warning when using macro varargs on gcc 2.96 Tsafrir Dan
11:06 c++/1040: accepts illegal code: cv-quals on member function pointers bh
10:48 Re: pa reload problem John David Anglin
10:25 Re: cpp crash with gcc-2.95.2 and cpplib Neil Booth
10:19 Re: c/1027: slightly misleading printf format warning Kaveh R. Ghazi
09:49 Re: c/1027: slightly misleading printf format warning Kaveh R. Ghazi
09:29 Re: pa reload problem Jeffrey A Law
08:46 problem with fputc and fputs prototypes Herman ten Brugge
08:16 c++/1039: cout does not give correct output with pointer ++ lid
07:46 c++/1038: Sorry, don't know what to type in here..... sdr
07:26 target/1037: failed to compile crosscimpiler for gcc2.95.2 --tartget=powerpc-unknown-eabi zheng.yin
07:20 Re: fix-header cores in cpp code Richard Earnshaw
07:09 cpp crash with gcc-2.95.2 and cpplib Niels M=f6ller
06:53 fix-header cores in cpp code Robert Lipe
06:40 Re: instalation Eric Christopher
06:28 Re: Can't bootstrap gcc-20001204 under cygwin-1.1.6/win2kpro Tim Prince
04:46 c++/1036: Internal compiler error. ack
04:36 c++/1035: internal error (seg fault) in bits/std_iostream.h ritzert
03:38 instalation ig
03:13 Can't bootstrap gcc-20001204 under cygwin-1.1.6/win2kpro Christian Jnsson

December 10, 2000
22:05 bug report for setup_vtbl_ptr, /gcc/cp/semantics.c:1203 Charlie Zender
21:36 c++/1034: unknown compiler error tcheadle
20:56 c++/1033: ICE when a non-template class is declared as a template friend biordanov
19:21 Re: proto conflict, dwarf1 err, cpp oddity, Re: libstdc++v3 portability problems Robert Lipe
17:04 make check error Neil Booth
14:56 other/1032: Building gcc-2.95.2 on AIX 4.1.5.0 proceeds without finding cpp isisx2
14:23 gcc 2.95.2: incorrect C++ codegen at -O1 on HPPA Tom Lane
12:58 Re: proto conflict, dwarf1 err, cpp oddity, Re: libstdc++v3 portability problems Robert Lipe
11:41 Re: gcc -E -traditional broken Zack Weinberg
11:36 Re: gcc -E -traditional broken Andreas Jaeger
11:36 c++/1031: Internal compiler error when using virtual methods in class that is subclass of template of self kkunzelm
10:01 Re: gcc -E -traditional broken Neil Booth
07:17 gcc -E -traditional broken Andreas Jaeger
06:36 Re: Problems with ./genrecog while bootstrapping gcc-2000-12-10 Kaveh R. Ghazi
06:36 c++/1030: libstdc++.so.3: undefined symbol: __dso_handle ritzert
06:16 c++/1029: ICE at -O3 in overloaded operator Peter.Bienstman
06:15 Re: c/1027: slightly misleading printf format warning Gabriel Dos_Reis
06:14 Re: c/1027: slightly misleading printf format warning Joseph S. Myers
05:43 Re: c/1027: slightly misleading printf format warning Kaveh R. Ghazi
04:55 Re: c/1027: slightly misleading printf format warning Joseph S. Myers
04:45 Re: c/1027: slightly misleading printf format warning Gabriel Dos_Reis
04:10 Re: c/1027: slightly misleading printf format warning Joseph S. Myers
04:06 other/1028: unable to use config.guess after installing gcc 2.95.2 bobson
03:57 Re: c/1027: slightly misleading printf format warning Gabriel Dos Reis
03:41 Re: c/1027: slightly misleading printf format warning Joseph S. Myers
01:19 Re: proto conflict, dwarf1 err, cpp oddity, Re: libstdc++v3 portability problems Gabriel Dos Reis

December 09, 2000
17:46 c/1027: slightly misleading printf format warning cwitty
16:36 preprocessor/1026: ICE on missing #define in typedef pognant.sylvain
16:24 Re: ICE with alpha linux native Richard Henderson
16:03 ICE with alpha linux native Anthony Green
15:36 Re: pa reload problem Alan Modra
14:26 web/1025: gnatsweb login page not virtualised Joseph Myers
14:16 web/1024: libstdc++ web pages reference sources.redhat.com mirror list Joseph Myers
14:06 web/1023: Search form does not cover all lists Joseph Myers
14:06 web/1022: libstdc++ list archives references to sources.redhat.com Joseph Myers
13:35 armv4l bootstrap problem in libstdc++-v3 Rod Stewart
13:26 Re: problem with regrename pass on c4x Herman ten Brugge
10:56 Re: pa reload problem Richard Henderson
08:16 java/1021: fastjar files not in gcc_update Joseph Myers
06:50 Re: libstdc++ bootstrap failure: Colon in objdir-name Gerald Pfeifer
06:46 c++/1020: g++ Crash on default template parameters marcus.geiger
05:57 Re: pa reload problem Alan Modra
05:24 Re: libstdc++ bootstrap failure: Colon in objdir-name Gerald Pfeifer
04:26 libstdc++/1019: setw() effect on operator>> for strings off by one? pcarlini
04:17 Re: problem with regrename pass on c4x Bernd Schmidt
00:35 Re: pa reload problem Alan Modra
00:18 problem with regrename pass on c4x Herman ten Brugge

December 08, 2000
23:55 Re: pa reload problem Richard Henderson
23:52 Re: pa reload problem Alan Modra
22:55 Re: pa reload problem Richard Henderson
20:04 Re: pa reload problem Jeffrey A Law
19:13 Re: pa reload problem John David Anglin
17:56 other/1018: "make dvi" breaks on the languages part bobson
17:39 Re: pa reload problem Richard Henderson
17:07 Re: pa reload problem John David Anglin
15:45 Re: pa reload problem Richard Henderson
14:06 Re: pa reload problem John David Anglin
13:19 Re: g++-20001127: bug with forward declaration and vector Alexandre Oliva
12:28 Re: c/1017: -Wmissing-format-attribute gives too many warnings Andreas Jaeger
11:20 Re: c/1017: -Wmissing-format-attribute gives too many warnings Joseph S. Myers
11:17 Re: c/1017: -Wmissing-format-attribute gives too many warnings Andreas Jaeger
11:07 Re: c/1017: -Wmissing-format-attribute gives too many warnings Joseph S. Myers
10:23 Re: libstdc++ bootstrap failure: Colon in objdir-name Benjamin Kosnik
09:46 c/1017: -Wmissing-format-attribute gives too many warnings aj
09:00 g++-20001127: segmentation fault on bogus code Laurent Bonnaud
08:51 g++-20001127: bug with forward declaration and vector Laurent Bonnaud
06:41 libstdc++ bootstrap failure: Colon in objdir-name Gerald Pfeifer
04:41 Thank You For Your Email Robert & Ione Kealy
03:39 Re: Problem with g++ 2.95.2 ? Static methods and templates Matt Gumbley
01:19 using sockets by the fstream interface Andrey Tkachuk

December 07, 2000
21:46 c++/1016: friend class declarations not observing namespace rules. jaycox
19:56 c++/1015: Internal Compiler Error joe
19:46 c++/1014: Virtual memory exhausted while compiling small program kosak
15:46 c/1013: hello.c:0: Internal compiler error in get_insn_template, at final.c:2069 mmitchel
14:28 Re: build problems on sun sparc solaris 2.7 Geoff Keating
13:32 Re: libstdc++/1005: setw() does not work with doubles Benjamin Kosnik
13:16 c/1012: Linker output error; cannot find a description peter.dufault
11:16 preprocessor/1011: __VA_ARGS__ warning in #if-ed out code harinath
10:26 c++/1010: g++ 2.97: problems w/ static const members as rhs in assignment lsh
10:06 Solaris Intel stdarg.h problem David Thompson
08:34 Re: Problem with g++ 2.95.2 ? Static methods and templates Alexandre Oliva
07:59 Problem with g++ 2.95.2 ? Static methods and templates Matt Gumbley
06:56 c++/1008: compiler segfaults on unrecognised templates Peter.Bienstman
06:56 c++/1007: Bogus error message resolving overloaded operators Peter.Bienstman
02:44 Re: libstc++-v3 vs. c99 vendor headers Gabriel Dos Reis
02:26 libstdc++/1005: setw() does not work with doubles klima
02:16 other/1004: building makeinfo assumes -lz is magically available Will Partain
01:40 Re: Delayed evaluation of __builtin_constant_p not supported on this target. Richard Henderson
01:35 Re: Inline assembler can't return 64-bit values in registers Richard Henderson

December 06, 2000
19:39 Delayed evaluation of __builtin_constant_p not supported on this target. der Mouse
19:31 libstc++-v3 vs. c99 vendor headers Robert Lipe
18:01 Re: Inline assembler can't return 64-bit values in registers Michael Meissner
17:21 Re: pa reload problem John David Anglin
17:18 Re: pa reload problem John David Anglin
16:45 Re: Inline assembler can't return 64-bit values in registers Alan Modra
16:43 Re: PATCH: sjlj exceptions Jeffrey A Law
16:41 Re: Inline assembler can't return 64-bit values in registers Timur Tabi
16:33 Re: Inline assembler can't return 64-bit values in registers Richard Henderson
16:20 Re: PATCH: sjlj exceptions Richard Henderson
16:16 Re: pa reload problem Richard Henderson
15:58 Inline assembler can't return 64-bit values in registers Timur Tabi
14:36 c++/1003: functions do not correctly return char/unsigned char objects. jeffrey.s.meyer
12:58 Re: PATCH: sjlj exceptions John David Anglin
12:56 c++/1002: No debug-info about inner-types bobsky
12:41 Re: pa reload problem John David Anglin
12:25 Re: PATCH: sjlj exceptions Jeffrey A Law
12:02 Re: [PATCH] Java: fix to gcj/232, gcj/163 + others. Alexandre Petit-Bianco
11:53 Re: [PATCH] Java: fix to gcj/232, gcj/163 + others. Joseph S. Myers
09:56 c/1001: gcc 2.95.2 doesn't work on Sun workstation khanhxn
09:11 in_system_header warning not suppressed Robert Lipe
09:06 c++/1000: <limits> problem, ICE on legal abbott
08:51 Re: Sh-hms distribution problems Alexandre Oliva
08:26 c++/999: internal error, snapshot 20001204, hppa-hpux11 Will Partain
07:25 Bootstrap failure in gcc version 2.97 20001204 David Ronis
07:23 Sh-hms distribution problems Research Electronics
05:26 c++/998: internal compiler error meixner
04:15 [C++]v3 streambuf::xsputn restricts underflow too much Larry Evans
03:55 Re: Is this a bug? Joseph S. Myers
03:42 Is this a bug? Martin Kahlert
01:15 Re: Today's source cannot build on NetBSD Richard Earnshaw

December 05, 2000
23:56 optimization/997: Incorrect behavior in presence of glibc memset optimization dana
22:59 Re: optimization/966: snapshots slower than 2.95.2 on i386 on this code dana
21:36 c++/996: Internal compiler error during compile of mozilla snapshot willard.dawson
21:28 Re: testcase for hppa64 gcc bug Alan Modra
20:32 Re: PATCH: sjlj exceptions John David Anglin
20:15 Re: testcase for hppa64 gcc bug John David Anglin
20:11 Re: testcase for hppa64 gcc bug Jeffrey A Law
19:46 c++/995: internal compiler error 18 caldwell
18:52 Re: PATCH: sjlj exceptions Jeffrey A Law
17:46 c++/994: Creating a string with NULL seg faults coop1
15:46 c/993: option -mmmx causes ice on all files deman
14:16 Re: PATCH: Move REG pointer flag into rtx [was Re: PATCH 2: Re: Jeffrey A Law
13:26 target/992: i386 cc1 crashes if passed '-msse' stephen.kennedy
11:44 Re: pa reload problem John David Anglin
11:28 Re: Qt 2.2.2 problem on PPC/Linux Alexandre Oliva
11:25 Re: Qt 2.2.2 problem on PPC/Linux Franz Sirl
11:02 Qt 2.2.2 problem on PPC/Linux Petter Reinholdtsen
10:49 Comparison failure. Theodore Papadopoulo
10:27 Re: Today's source cannot build on NetBSD Jason R Thorpe
10:26 overloading template members sts
10:00 Re: Today's source cannot build on NetBSD Richard Earnshaw
09:25 Re: Another fixincludes problem Richard Earnshaw
08:53 Re: No limitsMEMBERS.cc causes bootstrap failure on alphaev6-unknown-linux-gnu Gabriel Dos Reis
08:39 Re: No limitsMEMBERS.cc causes bootstrap failure on alphaev6-unknown-linux-gnu Phil Edwards
07:55 stabs sections seem too large Alex Hornby
07:26 Re: Another fixincludes problem Richard Earnshaw
07:20 Re: Another fixincludes problem Bruce Korb
07:08 Re: ICE in V3/gen-num-limits on sparc-sun-solaris2.8 Jason Merrill
07:06 c/991: win envirolment fail ur4ukj
06:48 Re: Another fixincludes problem Richard Earnshaw
06:39 Re: Another fixincludes problem Bruce Korb
06:36 c++/990: "gcc 2.95 internal compiler error ". BSUBHAS
06:14 Re: Your recent change to cp/pt.c Jason Merrill
05:06 c/989: Internal error: Floating point exception. terlouw
03:56 optimization/988: functions with static variables aren't inlined bbaetz
03:25 Another fixincludes problem Richard Earnshaw
03:09 Re: fixincl.x being blown away Richard Earnshaw
02:46 c/987: gcc does not compile this with "-O2". marten_stromberg
01:22 Your recent change to cp/pt.c Gabriel Dos Reis
00:16 Re: No limitsMEMBERS.cc causes bootstrap failure on alphaev6-unknown-linux-gnu Gabriel Dos Reis
00:16 c++/986: g++ misses warning for & on temporary wolfgang.bangerth
00:05 Re: No limitsMEMBERS.cc causes bootstrap failure on alphaev6-unknown-linux-gnu Loren James Rittle

December 04, 2000
22:32 Re: No limitsMEMBERS.cc causes bootstrap failure on alphaev6-unknown-linux-gnu Richard Henderson
21:07 Re: No limitsMEMBERS.cc causes bootstrap failure on alphaev6-unknown-linux-gnu Gabriel Dos Reis
20:53 No limitsMEMBERS.cc causes bootstrap failure on alphaev6-unknown-linux-gnu Brad Lucier
17:48 Re: Fwd: ["Re: fixincl.x being blown away "] Alexandre Oliva
17:44 Re: Something's wrong with recent g++ include files Alexandre Oliva
17:36 c++/985: can't build CVS head - GNU_V3_DEMANGLING_STYLE_STRING undeclared here (not in a function) olivier
17:25 ICE in V3/gen-num-limits on sparc-sun-solaris2.8 Phil Edwards
15:56 c++/984: GCC cannot efficently initialize a big array wscott
15:36 c++/983: Internal compiler error kost
14:59 Where's the axe? Can't walk_tree. John David Anglin
14:46 c++/982: c++ compiler over agressive optimizatoin alfonso
13:06 c++/981: g++: missing semicolon causes ice in cp_finish_decl:8218 schmid
12:46 web/980: Unified contributing instructions Joseph Myers
12:46 other/979: make bootstrap fails with segmentation fault jjohnson
11:06 c/978: 2.95.2 warings when including <unistd.h> <GL/glx.h> jeff.deifik
10:36 c/976: warings when using strcpy jeff.deifik
10:36 c/977: warings when including <GL/glu.h> or <GL/glx.h> jeff.deifik
10:16 Re: fixincl.x being blown away Bruce Korb
10:00 Re: fixincl.x being blown away Richard Earnshaw
09:58 Re: gcc problem. Eric Christopher
09:47 Re: Fwd: ["Re: fixincl.x being blown away "] Richard Earnshaw
09:38 Fwd: ["Re: fixincl.x being blown away "] Manfred Hollstein
09:33 Re: fixincl.x being blown away Richard Earnshaw
09:26 Re: fixincl.x being blown away Manfred Hollstein
09:16 Re: fixincl.x being blown away Richard Earnshaw
09:06 Re: fixincl.x being blown away Manfred Hollstein
07:05 fixincl.x being blown away Richard Earnshaw
06:58 Re: g77 parsing bug still present Toon Moene
05:25 gcc problem. mohamed farid
05:17 Re: c++/970: Function execution order problem when using return value of funtions as parameter to another function. Jason Merrill
05:11 g77 parsing bug still present Dominic-Luc Webb molmed
04:36 c++/974: bug with nested class/ friend interaction robt
03:36 web/973: Junk in the FOM Joseph Myers
03:03 GCC crashes with "internal error--unrecognizable insn" Beat Mueller
02:24 Meet us on Wine Alley francois.xavier.bodin
01:06 c++/972: parse error on initialization rovf
00:56 c++/971: variable name treated as function pointer rovf

December 03, 2000
23:39 problem with ftp download page Ronald Fischer
23:10 gcc-20001127 snapshot Richard KHOO Guan Chen
23:06 c++/970: Function execution order problem when using return value of funtions as parameter to another function. skander
22:36 c/969: streampos != int pmana
17:36 web/968: Multiple last modified dates Joseph Myers
16:59 Re: Something's wrong with recent g++ include files Benjamin Kosnik
16:36 c++/967: egcs 2.91 ice mark
09:31 Re: Something's wrong with recent g++ include files David Ronis
07:42 BUG: -fomit-frame-pointer & C++ w/ exceptions still broken on i?86-linux-gnu Manfred Hollstein
04:47 Re: crlf in multiple line defines Neil Booth
04:28 crlf in multiple line defines David Er-el

December 02, 2000
21:16 optimization/966: snapshots slower than 2.95.2 on i386 on this code dana
19:26 preprocessor/965: Preprocessor varargs fails in some casess omegahacker
17:54 Re: flexible array member size Richard Henderson
16:56 optimization/964: missed warning and optimization bh
14:36 c/963: SSE/MMX extensions on PIII ge204
14:26 preprocessor/962: Recursive expansion fails marcus
14:21 Re: flexible array member size Geoff Keating
14:06 Internal Compiler Error + Question Philippe A. Bouchard
08:42 Ǫ Ǫ ü [Ǫ]Դϴ.
07:46 web/961: GNATSweb doesn't escape <foo> and similar in synopses Joseph Myers
07:16 c++/960: Cannot compile anything sami.vaaraniemi
06:16 c++/959: Problems with template specialisation and namespaces kmshanah
00:08 Re: + operator Alexandre Oliva
00:07 Re: flexible array member size Alexandre Oliva

December 01, 2000
23:41 + operator Shishir Mondal
22:31 Bootstrap fails on alpha Brad Lucier
16:47 Re: flexible array member size Geoff Keating
16:38 Re: flexible array member size Joseph S. Myers
16:20 flexible array member size Richard Henderson
16:06 c++/958: ice #123 in pop_binding_level, at cp/decl.c:609 schmid
15:42 Re: c++/955: missing Benjamin Kosnik
14:16 Re: New bootstrap failure on mips-sgi-irix6.2 (comparison failure) Kaveh R. Ghazi
13:36 libf2c/957: List directed input with underfilled array read incorrectly toon
13:21 Re: bug in namelist read Toon Moene
12:06 c++/956: Unaligned traps on alpha 21264 lucier
11:21 Re: Something's wrong with recent g++ include files Phil Edwards
10:52 Re: Something's wrong with recent g++ include files Neil Booth
10:39 Something's wrong with recent g++ include files David Ronis
10:36 c++/955: missing mboedigh
08:20 Re: implicit destructors and assignment operators (C++) Nathan Sidwell
08:15 New bootstrap failure on mips-sgi-irix6.2 (comparison failure) Kaveh R. Ghazi
07:45 minor correction (re:implicit destructors...) Simpson, Kenny
07:37 implicit destructors and assignment operators (C++) Simpson, Kenny
07:26 c++/954: Internal compiler error in extract_insn, at recog.c:2106 pook
07:06 java/953: refering the outer class instance durr
07:06 c++/952: Internal compiler error in extract_insn, at recog.c:2106 pook
06:06 other/951: Documentation of compiler passes and sources very out of date Joseph Myers
03:59 problem with gcc 2.95.2 - anonymous/typeinfo Heiko Nardmann
03:21 how to locate data in fixed address ? chengwei_zhu


Indexes: [Date Index] [Subject Index] [Author Index] [Thread Index]
Site Nav: [Browse other archives for this mailing list]
[Browse other mailing lists at this site]
Search: Limit to:

Mail converted by MHonArc 2.4.6