gcc-bugs archive
date index for November, 2000

This is the mail archive of the gcc-bugs@gcc.gnu.org mailing list for the GCC project.

Indexes: [Date Index] [Subject Index] [Author Index] [Thread Index]
Site Nav: [Browse other archives for this mailing list]
[Browse other mailing lists at this site]
Search: Limit to:

November 30, 2000
22:48 Re: `float_t' previously declared here Kriang Lerdsuwanakij
22:16 c++/950: Template compilation failure peteb
21:36 c++/949: __typeof__ extension broken gregod
20:09 Re: `float_t' previously declared here John David Anglin
19:05 Re: `float_t' previously declared here Larry Evans
16:33 Re: [C++] current_function_is_thunk Richard Henderson
14:29 Re: bug report Alexandre Oliva
14:26 c++/947: Data statement initialization of an array element whose index is anonymous
14:26 c++/948: internal compiler error in "dwarfout_finish" Doug.Henderson
14:07 bug report Edoardo Costa
14:01 bug in namelist read Harper, Christie
12:40 Re: PATCH: Move REG pointer flag into rtx [was Re: PATCH 2: Re: John David Anglin
12:11 Re: What does this build failure mean? Alexandre Oliva
11:46 fortran/946: Fails with -Os toon
11:36 c/945: Preprocessor errors for long long integer constants under wrong conditions Joseph Myers
11:30 What does this build failure mean? Bruce Korb
11:24 gcc 2.95.2 build fails building jc1 AshCan
11:11 Re: BOOTSTRAP FAILURE: segementation fault in genattrtab under hpux 10.20 Richard Henderson
10:55 Re: PATCH 2: Re: BOOTSTRAP FAILURE: segementation fault in genattrtab John David Anglin
10:45 Re: PATCH 1: Re: BOOTSTRAP FAILURE: segementation fault in genattrtab John David Anglin
10:41 Re: BOOTSTRAP FAILURE: segementation fault in genattrtab under hpux John David Anglin
10:16 libstdc++/944: Problems reading in doubles from a file (EOF related) schmid
09:57 ICE `gen_reload_inhi', at insn-emit.c:5550 on alpha-linux (2.95.2) Andreas Jaeger
09:26 libstdc++/943: Problems reading in complex numbers in a loop schmid
08:16 c/942: sparc Solaris 2.6 gcc 2.95.2 exits with "unrecognizable insn" ice for legal code Georgi Kuzmanov
08:06 libf2c/941: Configuration fails when cross-compiling zastai
08:06 c/940: sparc Solaris 2.6 gcc 2.95.2 exits with "unrecognizable insn" ice for legal code Georgi Kuzmanov
08:06 c/939: sparc Solaris 2.6 gcc 2.95.2 exits with "unrecognizable insn" ice for legal code Georgi Kuzmanov
06:06 c/938: inline nested functions not compiled correctly when using -O0 stephen.thomas
06:01 Re: New RTL check failures (Re: SH: use register names instead of numbers) Kaveh R. Ghazi
05:56 c++/937: gcc 2.95 refused to instantiat template miron
02:56 c++/936: gcc-2.95.2 would not compile manuca
02:46 optimization/935: potimization broken for : conversion : intmax_t -> double -> intmax_t amgastineau
00:06 profileing apache,mod_ssl, openssl, with -a -g James Harris

November 29, 2000
22:52 Re: BOOTSTRAP FAILURE: segementation fault in genattrtab under hpux 10.20 Jeffrey A Law
22:48 Re: PATCH 1: Re: BOOTSTRAP FAILURE: segementation fault in genattrtab Jeffrey A Law
22:39 Re: PATCH 2: Re: BOOTSTRAP FAILURE: segementation fault in genattrtab Jeffrey A Law
22:30 Re: PATCH: Move REG pointer flag into rtx [was Re: PATCH 2: Re: BOOTSTRAP FAILURE: segementation fault in genattrtab] Jeffrey A Law
21:48 Re: PATCH: Re: ../../../libio/stream.cc:60: Internal error: Segmentation fault. Jeffrey A Law
21:26 c++/934: new-abi bug: collisions between flag variables for local statics snyder
21:26 c++/933: new-abi crash with virtual derivation snyder
19:06 c/932: gcc compiler internal error jbourg
18:30 Re: fortran/893: Preliminary loop exit compiled wrongly Tim Prince
17:26 Joseph S. Myers - fixinc v. glibc <values.h> Bruce Korb
16:52 [C++] current_function_is_thunk Richard Henderson
16:14 Re: g++:what is use of scope_ref in template type unification Kriang Lerdsuwanakij
13:33 Re: fortran/893: Preliminary loop exit compiled wrongly Alfredo Ferrari
12:48 Re: fortran/893: Preliminary loop exit compiled wrongly Toon Moene
12:47 Re: fortran/892: -Wunused complains unnecessarily for COMMON block items Toon Moene
12:47 Re: fortran/893: Preliminary loop exit compiled wrongly Toon Moene
11:56 other/931: VMS support looks bitrotten Joseph Myers
11:12 Re: PATCH: Prototype for getopt in system.h Kelley Cook
10:14 PATCH: Missing return_label using g++ CVS under vax ultrix. John David Anglin
09:56 other/930: Out of date docs for C99 features as extensions Joseph Myers
09:56 c/929: Incorrect code generation on Sparc under -O3 christophe.lyon
09:56 other/928: Out of date preprocessor docs in extend.texi Joseph Myers
09:26 c/927: stage1/xgcc from branch 1.256.2 crashes when compiling gcc/global.c version 1.63.2.2 John Palkovic
07:46 c++/926: Internal compiler error in expand_expr, at expr.c:5992 binder
07:16 c++/925: Follow-up to c++/909 with more info rmgiroux
06:07 Re: /zlib/inftrees.c:291: Internal compiler error in wrap_constant,at simplify-rtx.c:2523 Gerald Pfeifer
02:26 c++/924: -Wuninitialized does not seem to warn on uninitialize class members. mdejong
00:36 c/922: asm("%%eax"::) gives "%%eax" instead of "%eax" Fergus Henderson
00:36 c/923: gcc crashes on empty .c files Fergus Henderson
00:22 Re: bug or feature?: egcs dies too late on syntax error Markus Werle
00:15 Re: fortran/893: Preliminary loop exit compiled wrongly List subscription

November 28, 2000
18:40 Re: libstdc++ related bootstrap failure on Solaris Alexandre Oliva
18:03 Re: libstdc++ related bootstrap failure on Solaris Benjamin Kosnik
16:21 Re: New RTL check failures (Re: SH: use register names instead of numbers) Richard Henderson
16:13 Re: New RTL check failures (Re: SH: use register names instead of numbers) Joern Rennecke
14:57 Re: fortran/892: -Wunused complains unnecessarily for COMMON block items Richard Henderson
13:47 Re: fortran/893: Preliminary loop exit compiled wrongly Richard Henderson
11:55 Re: bug or feature?: egcs dies too late on syntax error Philipp Thomas
11:16 bug-gcc ȳϼ? Online Korea
10:06 c++/921: 2.95.2 generates incorrect ref to static initialized char[] in classes. 2.8.1 works fine ejm
09:46 c/920: Error while building cross gcc for m68k target fandrieu
07:56 c++/919: segfault in setup_class_bindings jakub
07:32 C++, sparc-sun-solaris2.8 and stdio.h: -ansi and fixincl Gerald Pfeifer
06:36 libobjc/917: Build failed ask
06:36 c++/916: Internal compiler error gcc on HPUX 10.20 Petra.Knopf
05:46 c++/915: -frepo doesn't work martin.brown
05:13 internal error: tst-printf.c:305: buffers still stacked in cpp_finish Andreas Jaeger
03:48 Re: c/900: `gcc -O2' takes 30x as long to compile certain files Franz Sirl
02:30 Re: /zlib/inftrees.c:291: Internal compiler error in wrap_constant,at simplify-rtx.c:2523 Bernd Schmidt
02:06 c/914: libgcc2 compile causes internal error for mips-wrs-vxworks cmetz
01:39 Re: c++/795 Nathan Sidwell
01:34 Re: libstdc++ related bootstrap failure on Solaris Gerald Pfeifer

November 27, 2000
23:44 Re: fortran/893: Preliminary loop exit compiled wrongly Martin Kahlert
23:33 Re: new libstdc++ bug - urgent Benjamin Kosnik
22:56 c++/913: ice in poplevel_class, at cp/decl.c:1682 schmid
22:36 c/912: 64-bit cross compiler failure on 32-bit hosts matthew green
21:11 Re: c++/795 Martin Sebor
21:07 Re: fortran/893: Preliminary loop exit compiled wrongly List subscription
17:13 /zlib/inftrees.c:291: Internal compiler error in wrap_constant, atsimplify-rtx.c:2523 Gerald Pfeifer
17:00 ia64 bootstrap failure, C++ front-end and md builtin function conflict Jim Wilson
16:29 Re: Fwd: Re: other/823: gcc -U does not undef a macro Zack Weinberg
16:06 c++/911: ice in maybe_process_partial_specialization (error mark) schmid
15:19 Re: Configuration bug Eric Christopher
15:08 Re: libstdc++/887: libstdc++-v3 modulator setw does not work benjamin kosnik
14:24 Configuration bug Guillaume PAIS
14:08 Re: c++/795 Martin Sebor
13:56 Re: fortran/893: Preliminary loop exit compiled wrongly List subscription
13:50 '1120 snap: libstdc++-v3 build failure on rs6000-ibm-aix4.2.0.0 RDBrown
13:40 Re: `float_t' previously declared here John David Anglin
13:14 Re: Fwd: Re: other/823: gcc -U does not undef a macro Neil Booth
13:14 Re: fortran/893: Preliminary loop exit compiled wrongly Phil Edwards
13:14 Re: Fwd: Re: other/823: gcc -U does not undef a macro Richard Earnshaw
12:58 `float_t' previously declared here John David Anglin
12:56 java/910: gcj compiler crashes when compiling initializer statement without paranthesis after constructor simon.brenner
12:47 Re: fortran/893: Preliminary loop exit compiled wrongly Toon Moene
12:45 Re: Fwd: Re: other/823: gcc -U does not undef a macro Zack Weinberg
12:36 c++/909: Spurious error using nested classes in constructor calls rmgiroux
10:50 undefined reference to `__cxa_bad_typeid' John David Anglin
10:46 c++/908: Bogus program creates ICE Richard Earnshaw
10:36 c++/907: __attribute__((stdcall)) does not affect C++ Methods, rendering __attribute__(com_interface) nonsensical. rerdavies
09:48 Missed optimization Zack Weinberg
09:31 Re: COFF debugging info bug Laurynas Biveinis
08:56 c++/905: gcc 2.95.2 accepts wrong syntax: a comma where a semicolon i required. amo99
08:07 Re: Current CVS has not bootstrapped for 72hrs as i586 Manfred Hollstein
08:07 Re: What is the status of the testsuite? Jeffrey A Law
07:29 COFF debugging info bug Laurynas Biveinis
06:50 Re: c/900: `gcc -O2' takes 30x as long to compile certain files Bernd Schmidt
05:56 Re: fortran/893: Preliminary loop exit compiled wrongly List subscription
05:43 Re: an unusual bug in gcc - how to report Alexandre Oliva
05:16 c/904: sparc64-elf compiler has internal error while building. matthew green
05:06 c/903: gcc compiler cannot find log10 function aach
04:40 an unusual bug in gcc - how to report Mark Galecki
04:18 bug in gcc Francisco Martn
03:46 Re: Hashing algorithm for cselib causes bootstrap differences Bernd Schmidt
03:16 optimization/902: x86 optimization bug with sibling call and -fomit-frame-pointer Fergus Henderson
02:46 target/901: Illegal instruction generated in libgcc2.a for a m68k target panto
01:56 c/900: `gcc -O2' takes 30x as long to compile certain files meyering
01:06 Re: c++/795 Nathan Sidwell

November 26, 2000
23:45 Re: c++/846: stream types non-const members Benjamin Kosnik
22:27 Re: -frename-registers on d30v Michael Meissner
22:16 c++/899: ICE in static initialization with -fno-elide-constructors suckfish
19:26 libstdc++/898: libstdc++-v3 configuration sets @EXEEXT@ incorrectly on cygwin David.Billinghurst
19:16 c/897: segmentation fault caused by unknown internal error during kernel compilation unix_based_punk
17:37 new-abi bug: names for local static vbl flags scott snyder
16:06 c++/896: ice function-inlining g++ Segmentation fault schmid
11:46 Re: GNATS classes. Toon Moene
11:30 Re: Integrated preprocessor bug Neil Booth
11:16 other/895: NEWS out of date and confusing Joseph Myers
10:56 c++/894: register asm spec may be ignored rth
09:25 Re: PATCH 2: Re: BOOTSTRAP FAILURE: segementation fault in genattrtab John David Anglin
09:14 Re: GNATS classes. Neil Booth
09:14 Revised patch: Re: PATCH 1: Re: BOOTSTRAP FAILURE: segementation fault in genattrtab John David Anglin
08:42 GNATS classes. Toon Moene
08:36 fortran/893: Preliminary loop exit compiled wrongly toon
08:36 fortran/892: -Wunused complains unnecessarily for COMMON block items toon
08:26 New RTL check failures (Re: SH: use register names instead of numbers) Kaveh R. Ghazi
08:01 bug report Anne-Marie GASTINEAU

November 25, 2000
22:12 compilation problem with -fno-exceptions Pasha Murat (630)840-8237 FNAL
19:15 Re: code generation bug in x86 PIC Mark Mitchell
18:15 Re: LC_MESSAGES problem ? Paul Eggert
17:40 Re: PATCH: Re: ../../../libio/stream.cc:60: Internal error: Segmentation fault. John David Anglin
17:39 PATCH: Re: ../../../libio/stream.cc:60: Internal error: Segmentation fault. John David Anglin
16:40 Re: code generation bug in x86 PIC Richard Henderson
14:46 c++/890: Forward declarations are rejected for types used in throw clauses. djm
14:02 Re: CVS gcc/tree.c: still broken for zero length arrays Richard Henderson
12:36 c++/889: ice #390 error in arg_assoc_type, at cp/decl2.c:4930 schmid
11:56 c++/888: ice #122 error in finish_function, at cp/decl.c:14147 schmid
11:16 libstdc++/887: libstdc++-v3 modulator setw does not work writing to a file schmid
10:56 web/886: libstdc++-prs web archives broken Joseph Myers
10:52 code generation bug in x86 PIC Ulrich Drepper
10:41 ../../../libio/stream.cc:60: Internal error: Segmentation fault. John David Anglin
10:40 Re: LC_MESSAGES problem ? Philipp Thomas
10:16 c++/885: c++: ice #283 in instantiate_template at cp/pt.c:7441 schmid
06:25 bootstrap error, when configured with --enable-c-mbchar Matthias Klose
06:25 What is the status of the testsuite? leam
05:36 Re: Current CVS has not bootstrapped for 72hrs as i586 Andris Pavenis
04:12 Current CVS has not bootstrapped for 72hrs as i586 Neil Booth
02:46 c++/883: int. comp. err. #122, while parsing try,catch() georg.ritter
02:16 c++/882: Segmentation fault due to syntax error nukije
01:18 Re: STL vector with gcc 2.97 20001119 Benjamin Kosnik
01:06 Re: Problem porting libstc++-v3 Benjamin Kosnik
01:04 Re: More libstdc++-v3 lossage Benjamin Kosnik

November 24, 2000
22:24 Re: Irix6 bootstrap failure, intl dir depends on insn-codes.h now Alexandre Oliva
19:45 Re: Irix6 bootstrap failure, intl dir depends on insn-codes.h now Alexandre Oliva
18:56 c++/881: ICE in tree_low_cst harinath
15:20 Re: ../tm.h:4: insn-codes.h: No such file or directory John David Anglin
15:14 Re: Irix6 bootstrap failure, intl dir depends on insn-codes.h now Joern Rennecke
14:55 ../tm.h:4: insn-codes.h: No such file or directory John David Anglin
14:07 Re: Irix6 bootstrap failure, intl dir depends on insn-codes.h now Alexandre Oliva
14:01 Re: Irix6 bootstrap failure, intl dir depends on insn-codes.h now Joern Rennecke
13:55 Re: Irix6 bootstrap failure, intl dir depends on insn-codes.h now Alexandre Oliva
13:38 Re: Template as template argument: typename vs class keywords Alexandre Oliva
13:34 Re: Irix6 bootstrap failure, intl dir depends on insn-codes.h now Joern Rennecke
13:21 Template as template argument: typename vs class keywords Philippe Bouchard
12:46 Re: virtual memory exhausted Alexandre Oliva
12:44 Re: Irix6 bootstrap failure, intl dir depends on insn-codes.h now Kaveh R. Ghazi
12:11 Re: ../tm.h:3: insn-codes.h: No such file or directory (bootstrap Joern Rennecke
11:56 c++/880: Return type of type operator is not equivalent to return type of member function. johan
11:37 Re: ../tm.h:3: insn-codes.h: No such file or directory (bootstrapfailure Gerald Pfeifer
11:34 Re: Irix6 bootstrap failure, intl dir depends on insn-codes.h now Joern Rennecke
11:14 Re: ../tm.h:3: insn-codes.h: No such file or directory (bootstrap failure Joern Rennecke
11:11 ../tm.h:3: insn-codes.h: No such file or directory (bootstrap failureon i386-unknown-freebsd4.2) Gerald Pfeifer
10:41 Re: c++/795 Martin Sebor
08:25 More libstdc++-v3 lossage Richard Earnshaw
07:40 Re: c/877: gcc 2.95.2 generates incorrect code on i386 Bernd Schmidt
07:35 Irix6 bootstrap failure, intl dir depends on insn-codes.h now Kaveh R. Ghazi
07:00 Problem porting libstc++-v3 Richard Earnshaw
06:55 Re: gcc for ARM Richard Earnshaw
05:26 c++/878: g++ fails to create multi-dimensional arrays of const objects. jeremy
05:19 gcc 2.95.2: nested stdcall typedefs => sig 11 Fergus Henderson
05:06 c/877: gcc 2.95.2 generates incorrect code on i386 aeb
04:03 gcc for ARM Ilko Iliev
03:51 gcc 2.95.2: Internal compiler error in `lookup_attribute' Fergus Henderson
02:11 Re: Hashing algorithm for cselib causes bootstrap differences Richard Earnshaw
01:56 Re: Hashing algorithm for cselib causes bootstrap differences Bernd Schmidt
01:55 gcc 2.95.2: attribute((regparm(N))) and function ptr type casts Fergus Henderson

November 23, 2000
23:26 c/876: Segmentation fault while compiling (RH 7.0/Kernel 2.2/PII) bjarke_bug
21:43 gcc 2.95.2, regparm(3), and >> Fergus Henderson
18:48 CVS gcc/tree.c: still broken for zero length arrays Craig Newell
13:36 Answer, was: Question Toon Moene
13:30 Hashing algorithm for cselib causes bootstrap differences Richard Earnshaw
13:26 c/875: Code generation error on UltraSPARC ( Ultra 5 ) davide_libenzi
11:15 Question Philippe Bouchard
10:47 Re: c/859: sparc-specific pessimal code for simple loop Richard Henderson
10:34 PATCH: Move REG pointer flag into rtx [was Re: PATCH 2: Re: BOOTSTRAP FAILURE: segementation fault in genattrtab] John David Anglin
10:01 bug-gcc ȳϼ? Online Korea
09:52 virtual memory exhausted Issac Alphonso
08:56 Re: c/859: sparc-specific pessimal code for simple loop Geoff Keating
04:53 fixinc v. glibc <values.h> Joseph S. Myers
00:40 STL vector with gcc 2.97 20001119 Jean-Marc Valin

November 22, 2000
22:17 g++ Linker error Ratheesh K
20:46 optimization/873: Problem on HPPA inlining fcns with throw() specifiers cheath
18:06 c++/872: Internal compiler error junkmail
17:46 c/871: build failed Tuan.N.Truong
17:36 optimization/870: Internal error: Segmentation fault. igor
17:23 Re: -frename-registers on d30v Richard Henderson
17:23 Error building libobjc in gcc-20001120 bootstrap on Solaris 8 x86 Bernard Michaud
16:16 other/869: Cross-compiled cross-assembler causes coredump jfaith
15:13 Re: Please close gnats PR 329 Toon Moene
14:15 Re: c/859: sparc-specific pessimal code for simple loop Richard Henderson
13:24 Re: polymorphism - virtual memory exhausted Alexandre Oliva
13:19 Re: c/859: sparc-specific pessimal code for simple loop Geoff Keating
13:17 Re: polymorphism - virtual memory exhausted Eric Christopher
13:13 polymorphism - virtual memory exhausted Issac Alphonso
13:12 Re: Reason for cygwin GCC 2.97 non-bootstrap found Phil Edwards
12:58 Re: c/859: sparc-specific pessimal code for simple loop Jim Wilson
12:34 Re: Reason for cygwin GCC 2.97 non-bootstrap found Zack Weinberg
10:18 -frename-registers on d30v Michael Meissner
10:10 Re: Bug in sparc.md Jakub Jelinek
09:52 Re: Preprocessor bug Martin Sebor
09:46 Bug in sparc.md Martin Ohmacht
09:17 Re: Preprocessor bug Alexandre Oliva
08:36 c++/868: Macro && template class && member argument == ICE sadowski
08:16 c++/867: g++ does not compile qt library's kernel/moc_qnetworkprotocol.cpp Thomas.Soddemann
08:02 Re: Reason for cygwin GCC 2.97 non-bootstrap found McNulty Junior Bobby
08:01 Re: cc1 failure on simple int declaration law
07:56 c++/866: Internal compiler error in `build_insn_chain' james.perrin
07:55 Re: cc1 failure on simple int declaration Markus Werle
07:40 Re: PATCH 2: Re: BOOTSTRAP FAILURE: segementation fault in genattrtab John David Anglin
07:38 cc1 failure on simple int declaration Markus Werle
07:05 Re: Garbled iostream output using libstdc++-v3 Gerald Pfeifer
06:55 multiple declarations of j in gcc.c Markus Werle
05:50 Build failure: 20001120 snap on i586-sco-sysv5uw7.1.0 RDBrown
05:22 Re: c/859: sparc-specific pessimal code for simple loop law
04:30 Re: duplicate symbols on HP-PA Marco Franzen
04:14 Re: Garbled iostream output using libstdc++-v3 Loren James Rittle
03:02 Garbled iostream output using libstdc++-v3 Gerald Pfeifer
02:50 Re: c/859: sparc-specific pessimal code for simple loop Bernd Schmidt
02:36 bug or feature?: egcs dies too late on syntax error Markus Werle
02:19 internal error in gcc Eivind Midtgrd
00:36 preprocessor/865: -include doesn't search from "." tor
00:09 Re: [c++] wchar_t instantiations missing now Benjamin Kosnik

November 21, 2000
23:21 Re: c/859: sparc-specific pessimal code for simple loop Richard Henderson
23:17 Re: c/859: sparc-specific pessimal code for simple loop David S. Miller
23:01 Re: c/859: sparc-specific pessimal code for simple loop Richard Henderson
20:00 RE: Reason for cygwin GCC 2.97 non-bootstrap found Billinghurst, David (CRTS)
19:36 other/864: --program-suffix is ignored bh
18:44 mips -membedded-pic fails on ref to global func Jeff Long
18:15 Re: Reason for cygwin GCC 2.97 non-bootstrap found Chris Abbey
17:17 Re: Reason for cygwin GCC 2.97 non-bootstrap found Zack Weinberg
17:10 Re: Reason for cygwin GCC 2.97 non-bootstrap found DJ Delorie
17:06 optimization/863: wrong optimization of STL's find() algorithm by g++ reichelt
16:46 c++/862: Undocumented options, part 2 Joseph Myers
16:43 Re: Reason for cygwin GCC 2.97 non-bootstrap found Phil Edwards
16:25 Re: Reason for cygwin GCC 2.97 non-bootstrap found Zack Weinberg
16:07 Re: PATCH 2: Re: BOOTSTRAP FAILURE: segementation fault in genattrtab law
15:29 Re: Preprocessor bug Martin Sebor
15:26 Re: tradtradcpp0, cpp spec bugs, and use of '|' Richard Henderson
15:14 Re: tradtradcpp0, cpp spec bugs, and use of '|' Neil Booth
15:11 Re: Preprocessor bug Neil Booth
14:56 web/861: broken link: www.gnu.org/software/gcc/gcc-3.0/criteria.html bh
14:52 RE: Preprocessor bug John Hinke
14:30 ia64-linux bootstrap failure, long double string table breakage Jim Wilson
14:08 Re: Preprocessor bug Geoff Keating
13:52 Re: alpha.md version 1.130 breaks bootstrap on alphaev6-dec-osf5.0 Andrew Hobson
13:46 c/860: gcc 2.95.2 fatal error on IMAP-2000 (Solaris 7, sparc) eggert
13:41 c/859: sparc-specific pessimal code for simple loop Joe Buck
13:36 c/859: sparc-specific pessimal code for simple loop jbuck
13:09 fixincl and SCCS directories Franz Sirl
12:41 new-abi crash with virtual derivation scott snyder
12:29 Re: Preprocessor bug Neil Booth
12:19 Re: Preprocessor bug Neil Booth
12:17 Re: PATCH 2: Re: BOOTSTRAP FAILURE: segementation fault in genattrtab John David Anglin
12:06 optimization/858: Internal compiler error in scan_rtx_reg, at regrename.c:334 igor
11:25 Re: PATCH 2: Re: BOOTSTRAP FAILURE: segementation fault in genattrtab John David Anglin
10:59 Re: Preprocessor bug Martin Sebor
10:50 make check problem with last 2 snapshots David Ronis
10:39 Re: Reason for cygwin GCC 2.97 non-bootstrap found Kelley Cook
10:33 Re: tradtradcpp0, cpp spec bugs, and use of '|' Chris G. Demetriou
10:30 Re: tradtradcpp0, cpp spec bugs, and use of '|' Richard Henderson
10:24 Re: tradtradcpp0, cpp spec bugs, and use of '|' Neil Booth
10:20 Re: tradtradcpp0, cpp spec bugs, and use of '|' Richard Henderson
10:16 Re: tradtradcpp0, cpp spec bugs, and use of '|' Chris G. Demetriou
10:03 Re: tradtradcpp0, cpp spec bugs, and use of '|' Richard Henderson
09:36 c++/857: ICE in output_operand_lossage bagnara
09:35 new libstdc++ bug - urgent jarausch
09:26 target/856: configure fails to detect linux i686 system turrisi
07:33 Question on dynamic casting scope Philippe Bouchard
07:16 c++/855: 2.97: internal error: missing "}" in namespace decl m_schnei
06:54 libio/libtool bootstrap failure Robert Lipe
06:46 c++/854: internal compiler error. claude.simon
05:53 Re: tradtradcpp0, cpp spec bugs, and use of '|' Neil Booth
05:32 Re: make mail-report.log doesn't extract libstdc++v3 test info Alexandre Oliva
05:25 make mail-report.log doesn't extract libstdc++v3 test info Brad Lucier
05:22 libstdc++-v3 testsuite fails on alpha Brad Lucier
05:16 c++/853: Error "`class X::Y' is private" reported at wrong line olly
04:04 Re: Preprocessor bug Neil Booth
04:00 Re: Preprocessor bug Neil Booth
03:31 Re: PATCH 1: Re: BOOTSTRAP FAILURE: segementation fault in genattrtab Bernd Schmidt
02:54 Please close gnats PR 329 Billinghurst, David (CRTS)
01:14 Re: ICE with current mainline version Richard Henderson
00:46 middle-end/852: -ggdb -O causes ICE in dwarf2out.c jwm

November 20, 2000
22:45 Re: PATCH 1: Re: BOOTSTRAP FAILURE: segementation fault in genattrtab John David Anglin
22:03 Re: forced dependency on libtsdc++ Alexandre Oliva
21:55 Re: Errors in streambuf.h Alexandre Oliva
21:52 internal error segfaults Steven Homolya
21:47 Re: forced dependency on libtsdc++ Daniel Berlin
20:42 Re: Reason for cygwin GCC 2.97 non-bootstrap found DJ Delorie
20:41 forced dependency on libtsdc++ Martin Sebor
20:40 Re: PATCH 1: Re: BOOTSTRAP FAILURE: segementation fault in genattrtab under hpux law
20:38 Re: PATCH 2: Re: BOOTSTRAP FAILURE: segementation fault in genattrtab under hpux law
20:24 Re: Reason for cygwin GCC 2.97 non-bootstrap found Richard Henderson
20:22 Re: Reason for cygwin GCC 2.97 non-bootstrap found DJ Delorie
19:44 Re: Reason for cygwin GCC 2.97 non-bootstrap found Richard Henderson
19:35 Re: Reason for cygwin GCC 2.97 non-bootstrap found Zack Weinberg
19:24 Re: Reason for cygwin GCC 2.97 non-bootstrap found Richard Henderson
19:12 Re: Preprocessor bug Martin Sebor
18:56 Re: Reason for cygwin GCC 2.97 non-bootstrap found Zack Weinberg
18:41 Re: Reason for cygwin GCC 2.97 non-bootstrap found Christopher Faylor
18:29 Re: Reason for cygwin GCC 2.97 non-bootstrap found Zack Weinberg
18:11 Re: tradtradcpp0, cpp spec bugs, and use of '|' Chris G. Demetriou
17:21 Preprocessor bug John Hinke
17:14 Re: Reason for cygwin GCC 2.97 non-bootstrap found Christopher Faylor
15:47 Re: tradtradcpp0, cpp spec bugs, and use of '|' Zack Weinberg
15:42 Re: Reason for cygwin GCC 2.97 non-bootstrap found Zack Weinberg
15:33 g++ regressions on irix with -mabi=64 for V3 ABI Billinghurst, David (CRTS)
15:31 alpha.md version 1.130 breaks bootstrap on alphaev6-osf-5.0 Andrew Hobson
14:54 Re: tradtradcpp0, cpp spec bugs, and use of '|' Chris G. Demetriou
14:48 Re: tradtradcpp0, cpp spec bugs, and use of '|' Neil Booth
14:47 Re: dwarf bootstrap ICE w/ reduced testcase Robert Lipe
14:46 Reason for cygwin GCC 2.97 non-bootstrap found Kelley Cook
14:15 Re: gcc -traditional doesn't pass recognition of system headers to cc1 Neil Booth
14:11 Re: gcc -traditional doesn't pass recognition of system headers to cc1 Kaveh R. Ghazi
13:43 Re: dwarf bootstrap ICE w/ reduced testcase Richard Henderson
12:34 Re: [c++] wchar_t instantiations missing now Benjamin Kosnik
12:08 Re: [c++] wchar_t instantiations missing now Mark Mitchell
12:05 tradtradcpp0, cpp spec bugs, and use of '|' Chris G. Demetriou
11:55 Re: [c++] wchar_t instantiations missing now Benjamin Kosnik
11:46 c++/851: ICE in concatenated string constant "expression" Jonathan Thornburg
11:26 Re: [c++] wchar_t instantiations missing now Mark Mitchell
11:08 Errors in streambuf.h rmccrac
09:55 [c++] wchar_t instantiations missing now Benjamin Kosnik
08:27 dwarf bootstrap ICE w/ reduced testcase Robert Lipe
04:36 target/850: cross compilation problem vasu
02:40 PR 523, 524 fixed Thomas Kunert
02:28 gcc v2.95.2 bug... Pankaj Mitra

November 19, 2000
20:42 Re: configure fails for libstdc++-v3 under hpux 10.20 DCE threads law
19:26 c++/849: gcc internal error stimulated by use of struct timeval count0
18:25 mips-linux-elf -membedded-pic doesn't emit case statements Jeff Long
18:06 c/848: [enable-checking] ICE in store_constructor, at expr.c:4412 David.Billinghurst
17:26 c++/847: templated operators in <iterator> conflict with rel_ops richarda
15:16 c++/846: stream types non-const members richarda
10:39 gcc -traditional doesn't pass recognition of system headers to cc1 Kaveh R. Ghazi
06:41 Re: web/830: gnatsweb creates PRs with bogus version information Gerald Pfeifer
05:56 c++/845: postfix operators don't work with va_arg() calls fuchsia.groan
04:36 libstdc++/844: iostream bug (LFS related) in libstdc++ jlaako
04:06 target/843: ARM g77 `Unrecognizable insn' from const_double with -fPIC philb
01:36 c++/842: Internal compiler error for overloaded functions from different base classes Joachim.Eibl

November 18, 2000
19:04 g++-3 bitset bug... Andrew Lundgren
18:48 compiling gcc on mac os x (darwin 1.2) andy agena
16:26 c++/841: Internal Compiler Error mkochano
13:56 c++/840: internal compiler error problem in qcstring.h I got 2 separate errors, 2 separate times, both from qcstring.h jax21
13:24 PATCH: Prototype for getopt in system.h John David Anglin
11:47 PATCH 2: Re: BOOTSTRAP FAILURE: segementation fault in genattrtab under hpux John David Anglin
11:39 PATCH 1: Re: BOOTSTRAP FAILURE: segementation fault in genattrtab under hpux John David Anglin
09:41 Re: Mangling in ObjC class and protocol names Ovidiu Predescu
07:52 Re: u++ bug? Alexandre Oliva
05:26 c++/839: Internal error: Segmentation fault hammondb
05:09 PATCH for Re: Should people need bison or is that a bug? Gerald Pfeifer
04:42 Re: parse tree too big - build error on hppa64-hp-hpux11.00 Alexandre Oliva
04:15 Mangling in ObjC class and protocol names Matthias Klose

November 17, 2000
22:16 u++ bug? Peter Musial
16:01 Re: gcc-2.9[67]: C++: extern "C" functions with empty argument-lists refuse to accept arguments. Martin Sebor
15:51 Peculiar handling of -fsigned-char options in gcc 2.95.2 Tom Lane
15:48 Elements of ridpointers[] inappropriately tested for equality Matthew Hiller
15:30 Re: bug or illegal code??? Neil Booth
15:23 Re: bug or illegal code??? Richard Henderson
15:19 bug or illegal code??? Scott Bambrough
14:57 Re: libstdc++-v3 build failures Phil Edwards
14:45 Re: C++: const_iterator not comparable to iterator for map<>s Gerald Pfeifer
14:09 Re: C++: const_iterator not comparable to iterator for map<>s Benjamin Kosnik
14:01 Re: C++: const_iterator not comparable to iterator for map<>s Gabriel Dos_Reis
13:51 Re: C++: const_iterator not comparable to iterator for map<>s Gabriel Dos_Reis
13:49 Re: libstdc++-v3 build failures Gabriel Dos_Reis
13:25 Re: C++: const_iterator not comparable to iterator for map<>s Benjamin Kosnik
13:22 Re: C++: const_iterator not comparable to iterator for map<>s Benjamin Kosnik
13:20 Re: C++: const_iterator not comparable to iterator for map<>s Gerald Pfeifer
13:19 libstdc++-v3 build failures Tim Josling
13:16 Re: C++: const_iterator not comparable to iterator for map<>s Theodore Papadopoulo
13:10 Re: C++: const_iterator not comparable to iterator for map<>s Benjamin Kosnik
13:06 gcc reports syntax errors before doing a segmentation fault. Ken Fuchs
12:58 Re: C++: const_iterator not comparable to iterator for map<>s Theodore Papadopoulo
12:40 C++: const_iterator not comparable to iterator for map<>s Gerald Pfeifer
12:30 gcc-2.9[67]: C++: extern "C" functions with empty argument-lists refuse to accept arguments. peter miller
12:06 c/838: sparc-solaris2.7 extra testsuite failures when RTL checking ghazi
11:43 Re: configure fails for libstdc++-v3 under hpux 10.20 DCE threads John David Anglin
11:36 c/837: RTL checking bootstrap fails on i686-pc-linux-gnu ghazi
11:25 Re: configure fails for libstdc++-v3 under hpux 10.20 DCE threads Phil Edwards
11:06 other/836: bootstrap comparison fails with: emit-rtl.o differs make error during make bootstrap pdelyani
11:01 Re: Problem with cross compilation ! Eric Christopher
10:44 Re: duplicate symbols on HP-PA John David Anglin
10:42 a bug report Mark Galecki
10:26 c++/835: overloaded functions Richard.Kreckel
10:16 optimization/834: gcc badly optimizes ptr incrementation due to cast in lvalue Daniel.Diaz
10:06 Re: PR 764 Martin Sebor
09:30 configure fails for libstdc++-v3 under hpux 10.20 DCE threads John David Anglin
09:23 Re: duplicate symbols on HP-PA John David Anglin
09:17 Re: Wrong optimization in current CVS Richard Henderson
08:54 Re: parse tree too big - build error on hppa64-hp-hpux11.00 law
08:48 Re: duplicate symbols on HP-PA Marco Franzen
08:30 Re: parse tree too big - build error on hppa64-hp-hpux11.00 Markus Werle
08:23 Re: parse tree too big - build error on hppa64-hp-hpux11.00 law
08:18 Re: Bison vs. const vs. AIX Kaveh R. Ghazi
06:36 c++/833: ICE related to missing typename keyword with -pedantic-errors ljrittle
05:26 c++/832: Internal compiler error rjleathley
04:18 Re: Wrong optimization in current CVS Franz Sirl
04:10 Re: c++/565 nathan
04:06 c++/831: g++ const initializer failure jakub
03:46 web/830: gnatsweb creates PRs with bogus version information Joseph Myers
03:38 Problem with cross compilation ! Vasudev Mulchandani
03:36 c/829: building cross compiler for m68k-rtems vasu
03:26 other/828: gcc/config/x-linux is wrong flee
02:56 c++/827: g++ ICEs when trying to print warning jakub
02:56 c++/826: g++ ICEs on static class member with the same type as its class jakub
02:40 PR 764 Nathan Sidwell
02:35 Re: libstdc++ related bootstrap failure on Solaris Gerald Pfeifer
02:35 Re: other/823: gcc -U does not undef a macro Richard Earnshaw
01:44 Re: other/823: gcc -U does not undef a macro Richard Earnshaw
01:42 Re: Wrong optimization in current CVS Richard Henderson
01:09 Soory: wrong ml: Re: parse tree too big - build error on hppa64-hp-hpux11.00 Markus Werle
00:49 Re: C parser breakage due to c99 block scopes Zack Weinberg
00:47 parse tree too big - build error on hppa64-hp-hpux11.00 Markus Werle
00:44 --disable-libstdcxx-v3 has inverse meaning on hppa2.0w-hp-hpux11.00 Markus Werle
00:29 Re: C parser breakage due to c99 block scopes Joseph S. Myers

November 16, 2000
22:38 Re: [RFA] Integrated cpp -include -g fix Zack Weinberg
22:29 Gcc 2.96 Segmentation fault [ extended ] Jonathan Ryshpan
19:24 Re: Bison vs. const vs. AIX David Edelsohn
18:56 Bison vs. const vs. AIX Mark Mitchell
18:17 C parser breakage due to c99 block scopes Zack Weinberg
16:13 Re: other/823: gcc -U does not undef a macro Neil Booth
16:06 c++/824: Simple Exception-prog seg.faults arne.sorli
15:51 Re: duplicate symbols on HP-PA law
15:36 other/823: gcc -U does not undef a macro Richard Earnshaw
14:26 c++/822: ICE (fix_lexical_addr) dougk
12:17 Re: libstdc++ related bootstrap failure on Solaris Phil Edwards
10:41 Re: duplicate symbols on HP-PA John David Anglin
10:26 Re: BOOTSTRAP FAILURE: segementation fault in genattrtab under hpux law
10:23 Re: BOOTSTRAP FAILURE: segementation fault in genattrtab under hpux John David Anglin
02:46 c++/821: erreur of compilater baczje
02:36 c++/820: erreur of compilater baczje
01:46 c++/819: Wrong deafult include path in the last snapshot (gcc-20001113) simonis
00:28 g++ whith template and friend lglastre

November 15, 2000
17:42 Re: libstdc++-v3 fails to build Eric Christopher
17:35 Re: libstdc++-v3 fails to build Alexandre Oliva
17:28 Re: libstdc++-v3 fails to build Eric Christopher
17:14 Recent changes to irix LD_LIBRARY_PATH for running testsuite Billinghurst, David (CRTS)
16:54 Re: libstdc++-v3 fails to build Alexandre Oliva
16:53 Re: Wrong optimization in current CVS Alexandre Oliva
16:35 Re: libstdc++ related bootstrap failure on Solaris Gerald Pfeifer
16:12 Re: BOOTSTRAP FAILURE: segementation fault in genattrtab under hpux John David Anglin
16:08 Re: Wrong optimization in current CVS Franz Sirl
15:59 printf bug Vahe Avedissian
15:52 Wrong optimization in current CVS Franz Sirl
15:32 Re: preprocessor/818 neil
15:25 Re: libstdc++-v3 fails to build Eric Christopher
15:14 Re: BOOTSTRAP FAILURE: segementation fault in genattrtab under hpux law
15:09 [RFA] Integrated cpp -include -g fix Neil Booth
15:09 Re: BOOTSTRAP FAILURE: segementation fault in genattrtab under hpux John David Anglin
15:02 Re: BOOTSTRAP FAILURE: segementation fault in genattrtab under hpux 10.20 law
14:46 preprocessor/818: With -O2, preprocessor gives fatal error psmith
14:16 Re: libstdc++ related bootstrap failure on Solaris Phil Edwards
14:10 Re: BOOTSTRAP FAILURE: segementation fault in genattrtab under hpux 10.20 John David Anglin
14:06 target/817: ARM compiler generates out-of-range accesses to constant pool data philb
13:58 Re: libstdc++-v3 fails to build Rod Stewart
13:44 Re: libstdc++-v3 fails to build Alexandre Oliva
13:43 Re: possible bug in g++ Alexandre Oliva
13:33 Re: libstdc++ related bootstrap failure on Solaris Benjamin Kosnik
13:16 c++/816: function parameters incorrect order when using ++ as a parameter super.aorta
12:26 GCC-SH: Hitachi SH build failure Toshi Morita
12:26 Re: build error on sparc solaris 2.7, with GNU ld and GNU as Phil Edwards
12:07 build error on sparc solaris 2.7, with GNU ld and GNU as Mike Stump
10:54 Re: Supress newlines in gcc -E macro expansion? Neil Booth
10:50 Re: new cpp preprocessor fails Neil Booth
10:37 Re: GNU GCC's f77 [tempnam -> mkstemp; proposed patch] Toon Moene
10:36 Re: c/814 neil
10:34 Re: c/813 neil
09:35 RE: Bootstrap failure: cxxmain.c:930: syntax error before `(' Gerald Pfeifer
09:16 c/814: preprocessing error: concatination of negative integers as parameter in constants sashak
09:06 c/813: preprocessing error: concatination of negative integers as parameter in constants sashak
09:06 c++/812: C++ doesnt work with threads on AIX nparpand
08:15 hppa2.0w-hp-hpux11.00: standard headers are not installed Markus Werle
08:13 Missing Online Manuals Jeffrey Oldham
07:34 Stale links at gcc.gnu.org/onlinedocs Pierre Sarrazin
07:07 This little "one file program" puts gcc 2.95.2 into an infinite loop. Jos Angel Sanchz Caso
06:53 Re: Bootstrap failure: cxxmain.c:930: syntax error before `(' Hans-Peter Nilsson
06:06 c++/811: g++/i686-pc-linux-gnu: -O0 generate bad code (faulty temporary ?) homann
06:05 RE: Bootstrap failure: cxxmain.c:930: syntax error before `(' Kenneth Block
05:49 Re: gcc.c: line 3385: declare vars before use? Markus Werle
05:27 Re: libstdc++-v3 testsuite results for irix6.5 Gabriel Dos Reis
04:38 Bootstrap failure: cxxmain.c:930: syntax error before `(' Gerald Pfeifer
03:25 Segfault on empty file James Macnicol
03:22 Re: Nested functions on ARM (mk II) Richard Earnshaw
03:22 Re: Nested functions on ARM Richard Earnshaw
02:57 Problem with online-doc Using and Porting the GNU Compiler Collection (GCC) Canisius, Joachim
02:10 Re: gcc.c: line 3385: declare vars before use? Markus Werle
01:55 gcc.c: line 3385: declare vars before use? Markus Werle
01:43 Re: GNU GCC's f77 [tempnam -> mkstemp; proposed patch] Richard Henderson
00:54 Re: new cpp preprocessor fails jarausch
00:16 possible bug in g++ D-Man
00:14 Re: libstdc++-v3 fails to build Eric Christopher
00:07 libstdc++-v3 fails to build jarausch

November 14, 2000
23:13 Re: GNU GCC's f77 [tempnam -> mkstemp; proposed patch] Zack Weinberg
20:46 c/808: &&error is calculated incorrectly under -O2 wstearns
19:27 Re: Nested functions on ARM (mk II) Richard Henderson
19:04 Re: BOOTSTRAP FAILURE: segementation fault in genattrtab under hpux 10.20 John David Anglin
18:15 Re: Nested functions on ARM Richard Henderson
17:41 Nested functions on ARM (mk II) Nick Clifton
17:40 Re: libstdc++ related bootstrap failure on Solaris Gerald Pfeifer
17:07 Re: libstdc++ related bootstrap failure on Solaris Benjamin Kosnik
16:34 Re: Supress newlines in gcc -E macro expansion? Neil Booth
16:27 Supress newlines in gcc -E macro expansion? Todd Plessel
15:22 libstdc++ related bootstrap failure on Solaris Gerald Pfeifer
14:56 c++/807: g++ 2.96 (20000731) + 2.97 (20001112) name resolution bug in friend definition in specialized template class. bgreen
14:52 Re: GNU GCC's f77 [tempnam -> mkstemp; proposed patch] Richard Henderson
14:36 middle-end/806: gcc on glibc-2.1.3 linuxes rejects to build shared objects Stanislav Brabec
14:36 c/805: gcc 2.95.2 reorders subexpressions of boolean operators felix
14:35 Speaking of 'make bootstrap' on Windows... Kelley Cook
14:03 RE: Bootstrapping GCC snapshots fails under Cygwin Billinghurst, David (CRTS)
13:52 Re: GNU GCC's f77 [tempnam -> mkstemp; proposed patch] Toon Moene
13:41 Re: abort in eliminate_regs compiling glob.c from glibc John David Anglin
12:46 c++/804: problem building gcc on alpha rob
12:26 optimization/803: Internal compiler error balay
12:03 namespace and STL (and 2.97) Carlo Wood
11:45 Pointer to const member functions Philippe Bouchard
11:43 Re: libstdc++-v3 testsuite results for irix6.5 Benjamin Kosnik
11:33 Re: libstdc++-v3 testsuite results for irix6.5 Franz Sirl
10:50 Re: libstdc++-v3 testsuite results for irix6.5 Benjamin Kosnik
10:33 Re: Nested functions on ARM Richard Earnshaw
10:28 Re: Nested functions on ARM Nick Clifton
10:27 Re: c++/764 Martin Sebor
10:21 Re: Nested functions on ARM Richard Earnshaw
10:19 Re: BOOTSTRAP FAILURE: segementation fault in genattrtab under hpux 10.20 Richard Henderson
10:17 Re: new cpp preprocessor fails Neil Booth
10:11 Re: Gcc and message catalogs Philipp Thomas
10:04 Re: Code that used to compile Geoff Keating
10:04 Re: BOOTSTRAP FAILURE: segementation fault in genattrtab under hpux 10.20 John David Anglin
09:54 Re: BOOTSTRAP FAILURE: segementation fault in genattrtab under hpux 10.20 Richard Henderson
09:48 Re: libstdc++-v3 script mkcheck problem with multilibs Alexandre Oliva
09:26 c++/802: More installation problems carlo
09:03 Re: Nested functions on ARM law
09:02 Re: BOOTSTRAP FAILURE: segementation fault in genattrtab under hpux 10.20 law
08:41 Re: duplicate symbols on HP-PA law
08:32 Re: plotutils Alexandre Oliva
08:32 Re: libstdc++-v3 script mkcheck problem with multilibs Phil Edwards
08:30 Re: libstdc++-v3 script mkcheck doesn't run on irix6.5 Phil Edwards
07:36 c++/800: installation names of libstdc++ and sym links are screwed carlo
07:36 c++/801: 'new' operator aborts on failure instead of throwing exception godless
07:01 Re: Major problems with cross-compiling libstdc++-v3 Richard Earnshaw
06:52 integrated preprocessor & cc1plus Nathan Sidwell
06:42 Re: Major problems with cross-compiling libstdc++-v3 Gabriel Dos Reis
06:42 plotutils Todd Krzeminski
06:29 Major problems with cross-compiling libstdc++-v3 Richard Earnshaw
06:26 libstdc++/799: More libstdc++-v3 cross-configuration problems (localization) Richard Earnshaw
05:59 Re: g++ testresult problem on i686 David Ronis
05:57 Re: g++ testresult problem on i686 Franz Sirl
05:47 g++ testresult problem on i686 David Ronis
05:16 c++/798: wrong templated operator lookup in custom namespace Nicola.Musatti
05:10 Re: Code that used to compile Tim Prince
04:46 libstdc++-v3 test results for irix6.5/-mabi=64 Billinghurst, David (CRTS)
04:46 c++/797: g++ produces incorrect code draeger
04:42 coff: Alignment not a power of 2 Emmanuel Blot
04:12 libstdc++-v3 script mkcheck problem with multilibs Billinghurst, David (CRTS)
03:51 libstdc++-v3 testsuite results for irix6.5 Billinghurst, David (CRTS)
03:36 libstdc++/796: libstdc++-v3 fails to configure when threads not available Richard Earnshaw
03:23 libstdc++-v3 script mkcheck doesn't run on irix6.5 Billinghurst, David (CRTS)
03:03 Code that used to compile Laurent.Kersten
02:36 new cpp preprocessor fails jarausch
02:32 Re: sizetype overflow? Richard Kenner
01:46 c++/795: parse error in member template method sadowski
01:17 Re: BOOTSTRAP FAILURE: segementation fault in genattrtab under hpux 10.20 Richard Henderson

November 13, 2000
22:38 Sizeof behaves incorrectly with some unions Jason Stokes
21:38 Re: BOOTSTRAP FAILURE: segementation fault in genattrtab under hpux 10.20 John David Anglin
19:50 RE: Cannot build libstdc++-v3 on irix Billinghurst, David (CRTS)
19:41 Re: make versionitis? (OpenBSD) QUESTION TO MAINTAINERS IMBEDD ED Alexandre Oliva
19:34 Re: gcc-2.95.2 fails to build under Redhat 7.0 Alexandre Oliva
19:31 Re: Your recent change to gcc/configure.in Alexandre Oliva
18:47 Re: Nested functions on ARM Ulrich Drepper
18:02 Nested functions on ARM Nick Clifton
17:26 c/794: gcc 2.95.2 reorders subexpressions of boolean operators felix
17:06 c++/793: Internal compiler error mrousseau
17:06 c++/792: Internal compiler error mrousseau
16:27 Re: Latest CVS; solaris2.7; gcc version 2.97 20001003; build failure Phil Edwards
16:19 Re: sizetype overflow? Richard Henderson
16:05 sizetype overflow? Richard Henderson
15:20 Compiler error OR missing error message Philippe Bouchard
15:12 CVS infinite loop? Neil Booth
15:09 Re: BOOTSTRAP FAILURE: segementation fault in genattrtab under hpux 10.20 Richard Henderson
14:52 Re: make versionitis? (OpenBSD) QUESTION TO MAINTAINERS IMBEDD ED Richard Henderson
14:43 Re: gnerating deps with cpp Franz Sirl
14:40 Re: GNU GCC's f77 Zack Weinberg
14:33 Re: error "macro or #include recusion too deep" ... ad infinitium Neil Booth
14:26 Re: CPP warning while compiling linux-kernel-2.4, correct? Franz Sirl
14:25 Re: CPP warning while compiling linux-kernel-2.4, correct? Geoff Keating
14:16 libstdc++/791: gcc/libstdc++-v3/libsupc++/Makefile.am: bug for --disable-static Stanislav Brabec
14:12 C++/ICE#97 on curry template get_subj Larry Evans
14:10 Re: CPP warning while compiling linux-kernel-2.4, correct? Zack Weinberg
14:07 Re: GNU GCC's f77 Toon Moene
14:06 c++/790: Linking errors on attempts to access static members of classes and structs hoopak
13:36 CPP warning while compiling linux-kernel-2.4, correct? Franz Sirl
12:22 Latest CVS; solaris2.7; gcc version 2.97 20001003; build failure Jim McKelvey
11:36 c++/789: ICE with inner class template instanciation from a template class. Theodore.Papadopoulo
10:33 gcc-2.95.2 fails to build under Redhat 7.0 John G. Shaw
09:54 Re: Your recent change to gcc/configure.in Phil Edwards
09:45 Re: Your recent change to gcc/configure.in Richard Earnshaw
09:38 Re: Your recent change to gcc/configure.in Joseph S. Myers
09:36 target/788: Code accessing double arg crashes for SPARC when arg is split over register/frame and -O1 is used fridi
08:59 Re: Your recent change to gcc/configure.in Richard Earnshaw
08:56 c++/787: g++ calls function multiple times for multiple pre-increment celtschk
08:26 Re: -include -g broken with current CVS (testcase for PR 771) Zack Weinberg
07:36 other/786: failed bootstrap on solaris 2.8 lucier
07:27 Sparc issue in GCC 2.95.2 Josh Fryman
07:14 Your recent change to gcc/configure.in Richard Earnshaw
06:06 c++/785: Crash Raphael Bossek
04:28 Re: -include -g broken with current CVS (testcase for PR 771) Neil Booth
02:47 Re: Build problems on Solaris 2.5.1 Richard Earnshaw
02:18 gcc 2.95.2 fixincludes on IRIX, curses.h Ralf Fassel
02:16 c++/783: "internal compiler error" while trying to compile MICO phil
02:06 c++/782: "internal compiler error" while trying to compile MICO phil
01:16 c++/781: fPIC and exception spec pessimises code suckfish

November 12, 2000
20:14 RE: irix bootstrap fails with ICE ininstantiate_virtual_regs_1, at f unction.c:4021 Mark Mitchell
20:01 Bug report Anthony Lee
17:43 RE: irix bootstrap fails with ICE in instantiate_virtual_regs_1, at f unction.c:4021 Billinghurst, David (CRTS)
17:26 Re: linuxppc Michael Meissner
17:22 Re: gcc bug ? Phil Edwards
17:09 irix bootstrap fails with ICE in instantiate_virtual_regs_1, at function.c:4021 Billinghurst, David (CRTS)
16:49 Re: V3: Problem on Solaris Mark Mitchell
16:49 gcc bug ? LOOK, Peter
16:39 Re: -include -g broken with current CVS (testcase for PR 771) Zack Weinberg
16:26 Re: V3: Problem on Solaris Mark Mitchell
16:23 Re: V3: Problem on Solaris Alexandre Oliva
16:10 Re: V3: Problem on Solaris Mark Mitchell
16:02 Re: -include -g broken with current CVS (testcase for PR 771) Neil Booth
15:32 Re: V3: Problem on Solaris Alexandre Oliva
15:18 Re: Your change to wchar_t Eric Christopher
14:38 V3: Problem on Solaris Mark Mitchell
12:42 Re: Automated testing framework (was: V3: SPARC bug and tree freeze) Alexandre Oliva
11:49 Re: BOOTSTRAP FAILURE: segementation fault in genattrtab under hpux 10.20 John David Anglin
10:56 c/780: bad code generation on i386 lucier
10:50 Automated testing framework (was: V3: SPARC bug and tree freeze) Laurent Guerby
10:01 g++ bug report Charlie Zender
08:56 other/779: --target-help broken Joseph Myers
08:16 c/778: ice for -g + -include switch roman
07:36 c++/777: Unrecognizable insn: Mark_Johnson
06:18 Re: V3: SPARC bug and tree freeze Robert Dewar
06:06 c/776: large arrays causes Internal compiler error in `assign_stack_temp_for_type' b.judd
06:00 Re: V3: SPARC bug and tree freeze Richard Kenner
05:36 Re: V3: SPARC bug and tree freeze Robert Dewar
05:32 Re: V3: SPARC bug and tree freeze Joseph S. Myers
05:29 Re: V3: SPARC bug and tree freeze Robert Dewar
05:18 Re: V3: SPARC bug and tree freeze Alexandre Oliva
05:16 Re: V3: SPARC bug and tree freeze Robert Dewar
05:11 Re: V3: SPARC bug and tree freeze Robert Dewar
05:06 Re: V3: SPARC bug and tree freeze Robert Dewar
05:03 Re: V3: SPARC bug and tree freeze Mark Mitchell
05:01 Re: V3: SPARC bug and tree freeze Robert Dewar
04:55 Re: V3: SPARC bug and tree freeze Robert Dewar
04:55 Re: linuxppc Alexandre Oliva
04:50 Re: V3: SPARC bug and tree freeze Alexandre Oliva
04:50 Re: V3: SPARC bug and tree freeze Mark Mitchell
04:42 Re: V3: SPARC bug and tree freeze Robert Dewar
02:57 Re: V3: SPARC bug and tree freeze Mark Mitchell
02:46 Re: V3: SPARC bug and tree freeze Andreas Jaeger
02:31 V3: SPARC bug and tree freeze Mark Mitchell

November 11, 2000
23:58 linuxppc Magnus gren
16:00 Gcc 2.96 Segmentation fault Jonathan Ryshpan
13:36 c++/775: 2.97 error declaring nested class a friend sebor
13:23 Your change to wchar_t Mark Mitchell
12:09 Re: Optimization bug in current snapshot Toon Moene
12:06 c++/774: g++: ice segmentation fault schmid
11:30 Re: BOOTSTRAP FAILURE: segementation fault in genattrtab under hpux 10.20 John David Anglin
10:23 BOOTSTRAP FAILURE: segementation fault in genattrtab under hpux 10.20 John David Anglin
09:39 -include -g broken with current CVS (testcase for PR 771) Andreas Jaeger
05:56 c/773: Bugs with -gdwarf options Joseph Myers
04:36 c/772: Statement expressions issues Joseph Myers
04:01 Re: c++/770: Memory allocated by new remains accessible even after calling delete. Neil Booth
00:36 c/771: ICE in dbxout_resume_previous_source_file while compiling glibc aj

November 10, 2000
21:46 c++/770: Memory allocated by new remains accessible even after calling delete. Tathagato.Rai.Dastidar
17:17 Re: make versionitis? (OpenBSD) QUESTION TO MAINTAINERS IMBEDD ED Zack Weinberg
16:53 libstdc++-v3/selective string copy CTOR undefined in lib Larry Evans
16:09 RE: make versionitis? (OpenBSD) QUESTION TO MAINTAINERS IMBEDD ED Donn Terry
15:50 gcc v 2.95.2 on sparc-sun-solaris2.6 crashes with internal error Colin Surprenant
15:38 Re: make versionitis? (OpenBSD) QUESTION TO MAINTAINERS IMBEDD ED Marc Espie
13:18 Re: Stack Alignment Bug Richard Henderson
12:26 optimization/769: loop index at for loop exit is wrong eric.pouech
11:47 Re: c++ test Alexandre Oliva
11:44 Re: Stack Alignment Bug David Ronis
11:32 Re: c++ test Eric Christopher
11:23 Re: c++ test Alexandre Oliva
11:20 Re: string::reserve() is not implemented Alexandre Oliva
11:07 Re: c++ test Eric Christopher
10:57 Re: Build problems on Solaris 2.5.1 Richard Henderson
10:54 Re: c++ test Alexandre Oliva
10:46 Re: Build problems on Solaris 2.5.1 Geoff Keating
09:00 RE: make versionitis? (OpenBSD) QUESTION TO MAINTAINERS IMBEDD ED Donn Terry
07:46 c/768: Internal Compiler error in haifa-scheduler markus.eble
07:36 Re: Build problems on Solaris 2.5.1 Richard Earnshaw
06:02 cvs: bootstrap failure on hppa2.0w-hp-hpux11.00 Markus Werle
05:56 c++/767: -fno-honor-std impossible on Linux wolfgang.bangerth
05:50 Build problems on Solaris 2.5.1 Richard Earnshaw
02:21 test Stephan.Kumnick
01:55 string::reserve() is not implemented Kammerloher Josef
00:20 Re: make versionitis? (OpenBSD) QUESTION TO MAINTAINERS IMBEDD ED Marc Espie

November 09, 2000
23:06 c++/766: Error : "Field out of range" arasu
21:56 c++/765: Friend function can not have same name of a memeber function xiao
19:36 c++/764: g++ 2.95.2 fails to find a friend operator when dereferencing a pointer sebor
18:33 Re: Stack Alignment Bug Richard Henderson
17:58 RE: make versionitis? (OpenBSD) QUESTION TO MAINTAINERS IMBEDDED Donn Terry
17:36 optimization/763: GCC generates incorrect code when optimising richard.mitton
15:58 c++ test Eric Christopher
15:57 Re: abort in eliminate_regs compiling glob.c from glibc John David Anglin
15:16 c/762: can not calculate x *=x++ correctly on GNU 2.8.1 in sparc-sun-solaris2.6 environment chuchunxin
14:51 Bug Report for GCC 2.96 Prasad
14:26 c/761: Undocumented options, part 1 Joseph Myers
12:16 preprocessor/760: 'dos' format files upset cpp when using '\' to continue macros tony.luck
11:54 abort in eliminate_regs compiling glob.c from glibc John David Anglin
11:46 libstdc++/759: Segmentation Fault Bug in modulators setw and ios::left schmid
11:03 Internal compiler error in fix_lexical_addr Petr Prazak
11:01 2.95.2: exception handling - some missing! Dr. David Gilbert
09:50 Re: installation problem: bug or not ? Alexandre Oliva
09:40 Re: testcase for hppa64 gcc bug John David Anglin
09:35 installation problem: bug or not ? Dusan Turk
09:07 Re: Make madness on irix6.5 Mark Mitchell
09:06 preprocessor/758: -AQUESTION(ANSWER) seg fault under gcc-2.96 (RedHat 7.0) sbytnar
08:51 Re: Make madness on irix6.5 Alexandre Oliva
08:49 Re: make bug Alexandre Oliva
08:22 Re: Make madness on irix6.5 Mark Mitchell
08:21 Re: make versionitis? (OpenBSD) Zack Weinberg
08:07 make bug J LeBlanc
07:46 c++/757: gcc gets a seg. fault after a ~parse error before 'if'~ error. overholt
07:44 Incorrect ARM code generation ... Craig Newell
06:56 c++/756: internal comp. error cees
05:36 optimization/755: Unitialized variable in cse_insn hpenner
05:16 Re: compiling gcc-2.95.2 source Alexandre Oliva
05:15 Re: Make madness on irix6.5 Alexandre Oliva
05:09 Re: Follow-up to: optimization problem in g++ snapshot 2.97-2000103 Alexandre Oliva
05:02 compiling gcc-2.95.2 source David Tok
04:19 flow ICE in current CVS Franz Sirl
04:05 Possible bug in gcc-2.95.2 J. A. Landamore
03:42 Follow-up to: optimization problem in g++ snapshot 2.97-2000103 Reichelt
03:34 Re: make versionitis? (OpenBSD) Marc Espie
01:35 Re: PATCH: don't warn about types defined in casts for sys headers Nathan Sidwell
01:16 c++/754: name lookup performed incorrectly in presence of enumerator names rovf
00:53 Re: Make madness on irix6.5 Alexandre Oliva
00:50 Re: Make madness on irix6.5 Mark Mitchell
00:12 Re: Make madness on irix6.5 Alexandre Oliva
00:08 Re: Make madness on irix6.5 Mark Mitchell

November 08, 2000
22:55 Re: Make madness on irix6.5 Alexandre Oliva
22:48 Re: Make madness on irix6.5 Alexandre Oliva
22:34 RE: Make madness on irix6.5 Mark Mitchell
21:23 RE: Make madness on irix6.5 Billinghurst, David (CRTS)
20:49 Re: Make madness on irix6.5 Alexandre Oliva
19:42 Make madness on irix6.5 Billinghurst, David (CRTS)
18:45 Bug: destructor called too many times s c o t t
18:09 Re: PATCH: new flag to say when things are synthesized Gabriel Dos Reis
18:06 Re: PATCH: new flag to say when things are instantiated Gabriel Dos Reis
14:39 Re: PATCH: new flag to say when things are instantiated Phil Edwards
14:32 Re: PATCH: new flag to say when things are instantiated Joseph S. Myers
13:17 Re: Optimization bug in current snapshot Toon Moene
12:56 c++/753: Internal compiler error 108 (NULL + i) sbaker
12:14 PATCH: new flag to say when things are synthesized Brendan Kehoe
12:14 PATCH: don't warn about types defined in casts for sys headers Brendan Kehoe
12:13 PATCH: new flag to say when things are instantiated Brendan Kehoe
11:46 c++/752: template function cannot access embedded type of parameter type rutt
11:36 Re: signed/unsigned conversions Chris Evans
09:57 Re: using c compiler: cpp appears to be looping - no output Zack Weinberg
09:27 Stack Alignment Bug David Ronis
09:11 using c compiler: cpp appears to be looping - no output Kate Evans-Jones - RSG
09:02 Re: signed/unsigned conversions Michael Meissner
08:09 signed/unsigned conversions Chris Evans
04:36 c++/751: NULL-something kills compiler pb
04:14 Problems while building gcc-2.95.2 under Digital Unix 4.0F rakesh
04:10 FYI: 20001106 snapshot on rs6000-ibm-aix4.2.0.0 needs -Wl,-bbigtoc RDBrown
03:31 compiling error mohamed safwat mahfouz
02:46 c++/749: Compiler switch not recognized rovf
00:39 Re: problems with the compilation of programs Eric Christopher
00:25 problems with the compilation of programs Joaquin Lpez

November 07, 2000
23:48 Re: Internel compiler error on invalid template code (1/2) Stefan Bund
23:48 Re: Internel compiler error on invalid template code (2/2) Stefan Bund
18:14 g++ 2.95.2 on Alpha miscompiles Qt with -O2 (CSE) Tom Holroyd
17:46 target/747: __unorddf2 not in libgcc.a oldham
14:38 Bus error in the linker, possibly caused by tail-calls Phil Edwards
12:00 Re: Internel compiler error on invalid template code Alexandre Oliva
10:56 Re: RFA [Re: Bug in integrated cpp] Richard Henderson
09:43 C++ wrong-code bug: Inheritance & destructors Brad Aagaard
09:36 c++/746: GCC doesn't seem to like asmallfunction(time(NULL-1000); pb
09:26 c++/745: ICE when using 'while' as a 'for' statement carll
09:12 Re: gcc.dg/20000614-1.c exit code? DJ Delorie
08:30 Bug/crash while compiling a 2.2.17 kernel Cipriano Groenendal
08:16 other/744: SUNWlibm also required when bootstrapping GCC eubrafo
07:00 g++-2.95.2 bug Martin Schweiger
06:41 Re: Gnu c++ Martin Kahlert
06:36 Wrong warnings with g77-20001106 Martin Kahlert
06:36 optimization/743: -mpreferred-stack-boundary doesn't work in all cases on ix86 ronis
06:31 Gnu c++ c958179
06:24 Optimization bug in current snapshot Martin Kahlert
04:38 Internal compiler error 390 on IRIX 6.5 Soeren Sandmann
02:57 i386 fistp ? Marc Espie
01:18 Internel compiler error on invalid template code Stefan Bund

November 06, 2000
23:17 Cannot build libstdc++-v3 on irix Billinghurst, David (CRTS)
20:06 c++/740: Internal compiler error for Sxl-GCC/include/xtree anil
18:48 incomplete symbols in a .o file related to stl silvanop
18:16 c++/739: Warnings generated by standard library -- should be corrected dperkins
17:40 Re: Patch to use CXX_libstdcxx breaks V3 Alexandre Oliva
13:01 RE: gcc-20001101 rejects legal c++ code Jan Reimers
12:42 gcc-20001101 rejects legal c++ code Al Elgert
12:01 ICE in recent snapshots: Tree check: expected class 'd', have 'x' , (overload) Richard B. Kreckel
11:09 Re: integrated cpplib and nonexistant input Neil Booth
10:59 [NeilB@earthling.net: Re: Possible bug in tradcpp.c?] Neil Booth
10:56 c/738: The displacement must be greater than or equal to -32768 and less than or equal to 32767 nzhu
09:12 Re: duplicate symbols on HP-PA Jeffrey A Law
08:59 Re: Possible bug in tradcpp.c? Zack Weinberg
08:11 Possible bug in tradcpp.c? Kaveh R. Ghazi
05:26 libstdc++/737: Regression with maps Theodore.Papadopoulo
03:52 g++ on LINUX : in-compability problem Abramov, Evgenia
02:48 cvs build on mips-sgi-irix6.5 fails jan p. springer

November 05, 2000
23:16 Re: i*86 structure assignment bug with global register vars Fergus Henderson
16:24 CommonC++ manifesting bugs in g++ horos
16:24 specs created incorrectly for crossly built native compiler Burt Silverman
10:47 core dumps when I try to compile Bob Sumner
10:44 core dumps when I try to compile Bob Sumner
09:46 c++/736: Premature template method instantiation during specialization m
05:14 hp-ux, c++, pthread, sigsegv Laszlo, Robert

November 04, 2000
18:14 Patch to use CXX_libstdcxx breaks V3 Mark Mitchell
15:31 Re: Which threads for default? (was Re: make check with libstdcxx broken) Phil Edwards
15:26 Re: Which threads for default? (was Re: make check with libstdcxx broken) Alexandre Oliva
14:44 Which threads for default? (was Re: make check with libstdcxx broken) Phil Edwards
12:40 integrated cpplib and nonexistant input Jakub Jelinek
12:22 seg fault during compliation Bob Sumner
10:51 optimization problem in g++ snapshot 2.97-2000103 Reichelt
10:08 Internal compiler error Martin Vogt
08:16 c++/735: Segemtation fault building libstdc++-v3 arne.sorli

November 03, 2000
22:40 Re: make check with libstdcxx broken Andreas Jaeger
20:52 Re: gcc.dg/20000614-1.c exit code? Michael Meissner
19:06 c++/734: namespace AND template AND struct AND virtual together cause internal compiler error rezarob
18:49 Re: gcc.dg/20000614-1.c exit code? Alexandre Oliva
18:42 Re: WG: gcc 2.8.1 using (basic_-)string Alexandre Oliva
18:41 Re: vortex2 driver install error Alexandre Oliva
18:39 Re: gnerating deps with cpp Alexandre Oliva
18:25 gcc.dg/20000614-1.c exit code? DJ Delorie
14:55 RFA [Re: Bug in integrated cpp] Neil Booth
14:34 Re: Bug in integrated cpp Neil Booth
12:20 make versionitis? (OpenBSD) Donn Terry
12:01 Re: testcase for hppa64 gcc bug John David Anglin
11:48 [Fwd: failure notice] Toon Moene
11:19 Bug in integrated cpp Kaveh R. Ghazi
11:17 Re: Bug in destructor ordering? Martin Sebor
11:13 Re: make check with libstdcxx broken Phil Edwards
08:36 c++/733: g++ bug report - i386-redhat-linux wieleman
08:26 optimization/732: Code generation bug on alpha 21264 at -O2 lucier
08:04 Compiler Error Philippe Bouchard
07:56 c++/731: g++ 2.96: numeric_limits hack gives ICE-on-illegal-code abbott
06:57 Bug in destructor ordering? Lassi A. Tuura
06:27 make check with libstdcxx broken Andreas Jaeger
05:06 c++/730: Cannot explicitly specify template parameters of function brcordie
04:40 Regression with GNATS entry c++/510 Wolfgang Bangerth
04:15 Re: profiling fails on arm-linux Richard Earnshaw
04:06 profiling fails on arm-linux Philip Blundell
03:46 c++/729: compiler does not recognize variable definition rovf
02:06 c++/728: run-time problem from asm interrupt statement jtolle
01:56 c/727: Warning bug if -O0? dedu
01:56 c++/726: Internal compiler error rovf
01:56 c++/725: Internal compiler error rovf
01:23 GCC_EXEC_PREFIX vs jc1 Bryce McKinlay
01:17 WG: gcc 2.8.1 using (basic_-)string markus.breuer

November 02, 2000
21:35 vortex2 driver install error Default User
15:51 FW: cvs build fails in fold-const.c Billinghurst, David (CRTS)
12:44 gnerating deps with cpp Victor Secarin
11:46 Re: duplicate symbols on HP-PA John David Anglin
10:56 c++/724: mfc produces an error. jonathand1000
10:44 Re: __builtin_return_address Zack Weinberg
09:56 target/723: Bootstrap failure on sparc64-redhat-linux vonbrand
09:05 This little "one file program" puts gcc 2.95.2 into an infinite loop.]] Jose Angel Sanchez Caso
08:18 Re: Problem Compiling gcc 2.95.2 Alexandre Oliva
07:52 Problem Compiling gcc 2.95.2 Tom Browder
06:34 Bug report gcc 2.95.2 say
04:28 Compiler crash Petr Ovchenkov
02:33 Re: __builtin_return_address Eli Zaretskii
02:06 c++/722: Bug in testing pointer to member functions andreas
00:20 Re: __builtin_return_address Zack Weinberg

November 01, 2000
23:43 Re: bootstrap/genattrtab abort Andris Pavenis
23:41 Re: __builtin_return_address Eli Zaretskii
17:29 cvs build fails in fold-const.c Billinghurst, David (CRTS)
16:25 Bug report. John Wenker
14:42 Re: wrong excess elements warning Ulrich Drepper
14:32 Re: yet another wrong warning Richard Henderson
14:30 Re: wrong excess elements warning Richard Henderson
13:46 c++/721: ICE when using reserved words as identifiers roman
13:07 bug? root
13:03 Re: __builtin_return_address Michael Meissner
11:28 Re: yet another wrong warning Ulrich Drepper
11:24 C4x C++ weak symbols problem Joel Sherrill
11:16 Re: yet another wrong warning Phil Edwards
11:11 Re: yet another wrong warning Geoff Keating
11:04 yet another wrong warning Ulrich Drepper
10:54 Problem in split in sparc.md? Brad Lucier
10:43 Re: wrong excess elements warning Graham Stott
10:23 wrong excess elements warning Ulrich Drepper
09:58 Re: bootstrap/genattrtab abort Larry Evans
09:26 c++/720: C++ inlining problems jbuck
08:56 Re: preexpand_calls vs. TARGET_EXPRs Jeffrey A Law
08:44 Re: Dead link on Web page Norman Hardy
08:36 Re: c/718: -Wall evokes apparent cc1 infloop (w/cvs as of 2000-10-31.03h12UTC) Bernd Schmidt
08:35 Re: Dead link on Web page Jeffrey A Law
08:23 Re: A problems with templates Martin Sebor
06:07 Re: A problem building gcc 2.95.2 Ben Collins
06:06 unknown opcode Jeffrey_Kutcher
02:13 A problem building gcc 2.95.2 Cristo Saulo Bolaos Trujillo
00:50 Re: __builtin_return_address Eli Zaretskii
00:10 A problems with templates Topi Maenpaa


Indexes: [Date Index] [Subject Index] [Author Index] [Thread Index]
Site Nav: [Browse other archives for this mailing list]
[Browse other mailing lists at this site]
Search: Limit to:

Mail converted by MHonArc 2.4.6